{"text_format":"3","workbook":"xlsx","n_sheets":3,"sheets":["Uscite","Entrate","Riepilogo profitti e perdite"],"not_rendered":{"charts":4,"images":6,"defined_names":1},"read":"whole","date_system":"1900"}

{"sheet":"Uscite","index":0,"n_rows":31,"n_cols":9,"rows_kept":31,"merged":[[6,1,7,1]]}
[{"$nulls":8}," "]
[]
[null,"Festa della presentazione del prodotto"]
[null,"DETTAGLI SPESE"]
[]
[]
[null,"Spese totali","Stimate","Effettivo",null,"Programma","Stimate","Effettivo"]
[null,null,{"$f":"SiteExpenses[[#Totals],[Stimate]]+DecorationsExpenses[[#Totals],[Stimate]]+PublicityExpenses[[#Totals],[Stimate]]+MiscellaneousExpenses[[#Totals],[Stimate]]+RefreshmentsExpenses[[#Totals],[Stimate]]+ProgramExpenses[[#Totals],[Stimate]]+PrizesExpenses[[#Totals],[Stimate]]","v":{"v":2090,"d":"€ 2,090.00"}},{"$f":"SiteExpenses[[#Totals],[Effettive]]+DecorationsExpenses[[#Totals],[Effettive]]+PublicityExpenses[[#Totals],[Effettive]]+ProgramExpenses[[#Totals],[Effettivo]]+RefreshmentsExpenses[[#Totals],[Effettivo]]+MiscellaneousExpenses[[#Totals],[Effettivo]]+PrizesExpenses[[#Totals],[Effettive]]","v":{"v":1640,"d":"€ 1,640.00"}},null,"Musicisti",{"v":750,"d":"€ 750.00"},{"v":700,"d":"€ 700.00"}]
[{"$nulls":5},"Relatori",{"v":150,"d":"€ 150.00"},{"v":0,"d":"€ 0.00"}]
[{"$nulls":5},"Viaggio"]
[null,"Sito","Stimate","Effettive",null,"Hotel"]
[null,"Spese per sala e hall",{"v":500,"d":"€ 500.00"},{"v":450,"d":"€ 450.00"},null,"Altro"]
[null,"Personale del sito",{"$nulls":3},"Totale",{"$f":"SUBTOTAL(109,ProgramExpenses[Stimate])","v":{"v":900,"d":"€ 900.00"}},{"$f":"SUBTOTAL(109,ProgramExpenses[Effettivo])","v":{"v":700,"d":"€ 700.00"}}]
[null,"Apparecchiature"]
[null,"Tavoli e sedie",{"$nulls":3},"Pubblicità","Stimate","Effettive"]
[null,"Totale",{"$f":"SUBTOTAL(109,SiteExpenses[Stimate])","v":{"v":500,"d":"€ 500.00"}},{"$f":"SUBTOTAL(109,SiteExpenses[Effettive])","v":{"v":450,"d":"€ 450.00"}},null,"Grafica"]
[{"$nulls":5},"Fotocopie / stampa",{"v":20,"d":"€ 20.00"},{"v":20,"d":"€ 20.00"}]
[null,"Decorazioni","Stimate","Effettive",null,"Affrancatura"]
[null,"Fiori",{"v":200,"d":"€ 200.00"},{"v":100,"d":"€ 100.00"},null,"Totale",{"$f":"SUBTOTAL(109,PublicityExpenses[Stimate])","v":{"v":20,"d":"€ 20.00"}},{"$f":"SUBTOTAL(109,PublicityExpenses[Effettive])","v":{"v":20,"d":"€ 20.00"}}]
[null,"Candele"]
[null,"Illuminazione",{"$nulls":3},"Premi","Stimate","Effettive"]
[null,"Palloncini",{"$nulls":3},"Nastri / trofei"]
[null,"Forniture carta",{"$nulls":3},"Regali",{"v":100,"d":"€ 100.00"},{"v":100,"d":"€ 100.00"}]
[null,"Totale",{"$f":"SUBTOTAL(109,DecorationsExpenses[Stimate])","v":{"v":200,"d":"€ 200.00"}},{"$f":"SUBTOTAL(109,DecorationsExpenses[Effettive])","v":{"v":100,"d":"€ 100.00"}},null,"Totale",{"$f":"SUBTOTAL(109,PrizesExpenses[Stimate])","v":{"v":100,"d":"€ 100.00"}},{"$f":"SUBTOTAL(109,PrizesExpenses[Effettive])","v":{"v":100,"d":"€ 100.00"}}]
[]
[null,"Rinfresco","Stimate","Effettivo",null,"Varie","Stimate","Effettivo"]
[null,"Cibo",{"$nulls":3},"Telefono",{"v":50,"d":"€ 50.00"},{"v":50,"d":"€ 50.00"}]
[null,"Bevande",{"v":220,"d":"€ 220.00"},{"v":120,"d":"€ 120.00"},null,"Trasporti",{"v":20,"d":"€ 20.00"},{"v":20,"d":"€ 20.00"}]
[null,"Biancheria da tavola",{"v":80,"d":"€ 80.00"},{"v":80,"d":"€ 80.00"},null,"Cancelleria"]
[null,"Personale e mance",{"$nulls":3},"Servizi fax"]
[null,"Totale",{"$f":"SUBTOTAL(109,RefreshmentsExpenses[Stimate])","v":{"v":300,"d":"€ 300.00"}},{"$f":"SUBTOTAL(109,RefreshmentsExpenses[Effettivo])","v":{"v":200,"d":"€ 200.00"}},null,"Totale",{"$f":"SUBTOTAL(109,MiscellaneousExpenses[Stimate])","v":{"v":70,"d":"€ 70.00"}},{"$f":"SUBTOTAL(109,MiscellaneousExpenses[Effettivo])","v":{"v":70,"d":"€ 70.00"}}]

{"sheet":"Entrate","index":1,"n_rows":37,"n_cols":8,"rows_kept":37,"merged":[[6,1,7,1],[9,1,9,6],[16,1,16,6],[23,1,23,6],[30,1,30,6]]}
[{"$nulls":7}," "]
[]
[null,{"$f":"Uscite!B3","v":"Festa della presentazione del prodotto"}]
[null,"DETTAGLI REDDITO"]
[]
[]
[null,"Totale entrate","Stimate","Effettivo"]
[null,null,{"$f":"SUM(Ammissioni[[#Totals],[Entrate stimate]],AdsInProgram[[#Totals],[Entrate stimate]],ExhibitorsAndVendors[[#Totals],[Entrate stimate]],SaleOfItems[[#Totals],[Entrate stimate]])","v":{"v":4450,"d":"€ 4,450.00"}},{"$f":"SUM(Ammissioni[[#Totals],[Entrate effettive]],AdsInProgram[[#Totals],[Entrate effettive]],ExhibitorsAndVendors[[#Totals],[Entrate effettive]],SaleOfItems[[#Totals],[Entrate effettive]])","v":{"v":4170,"d":"€ 4,170.00"}}]
[]
[null,"Ammissioni"]
[null,"Tipo","Stimate","Effettive","Prezzo","Entrate stimate","Entrate effettive"]
[null,"Adulti",30,25,{"v":20,"d":"€ 20.00"},{"$f":"C12*E12","v":{"v":600,"d":"€ 600.00"}},{"$f":"D12*E12","v":{"v":500,"d":"€ 500.00"}}]
[null,"Figli",20,22,{"v":10,"d":"€ 10.00"},{"$f":"C13*E13","v":{"v":200,"d":"€ 200.00"}},{"$f":"D13*E13","v":{"v":220,"d":"€ 220.00"}}]
[null,"Altro",10,10,{"v":10,"d":"€ 10.00"},{"$f":"C14*E14","v":{"v":100,"d":"€ 100.00"}},{"$f":"D14*E14","v":{"v":100,"d":"€ 100.00"}}]
[null,"Totale",{"$f":"SUBTOTAL(109,Ammissioni[Stimate])","v":60},{"$f":"SUBTOTAL(109,Ammissioni[Effettive])","v":57},null,{"$f":"SUBTOTAL(109,Ammissioni[Entrate stimate])","v":{"v":900,"d":"€ 900.00"}},{"$f":"SUBTOTAL(109,Ammissioni[Entrate effettive])","v":{"v":820,"d":"€ 820.00"}}]
[]
[null,"Annunci in programma"]
[null,"Tipo","Stimate","Effettive","Prezzo","Entrate stimate","Entrate effettive"]
[null,"Copertine",2,4,{"v":50,"d":"€ 50.00"},{"$f":"C19*E19","v":{"v":100,"d":"€ 100.00"}},{"$f":"D19*E19","v":{"v":200,"d":"€ 200.00"}}]
[null,"Mezze pagine",2,2,{"v":30,"d":"€ 30.00"},{"$f":"C20*E20","v":{"v":60,"d":"€ 60.00"}},{"$f":"D20*E20","v":{"v":60,"d":"€ 60.00"}}]
[null,"Quarti di pagina",2,2,{"v":20,"d":"€ 20.00"},{"$f":"C21*E21","v":{"v":40,"d":"€ 40.00"}},{"$f":"D21*E21","v":{"v":40,"d":"€ 40.00"}}]
[null,"Totale",{"$f":"SUBTOTAL(109,AdsInProgram[Stimate])","v":6},{"$f":"SUBTOTAL(109,AdsInProgram[Effettive])","v":8},null,{"$f":"SUBTOTAL(109,AdsInProgram[Entrate stimate])","v":{"v":200,"d":"€ 200.00"}},{"$f":"SUBTOTAL(109,AdsInProgram[Entrate effettive])","v":{"v":300,"d":"€ 300.00"}}]
[]
[null,"Espositori / fornitori"]
[null,"Tipo","Stimate","Effettive","Prezzo","Entrate stimate","Entrate effettive"]
[null,"Stand grandi",5,5,{"v":300,"d":"€ 300.00"},{"$f":"C26*E26","v":{"v":1500,"d":"€ 1,500.00"}},{"$f":"D26*E26","v":{"v":1500,"d":"€ 1,500.00"}}]
[null,"Stand medi",5,4,{"v":200,"d":"€ 200.00"},{"$f":"C27*E27","v":{"v":1000,"d":"€ 1,000.00"}},{"$f":"D27*E27","v":{"v":800,"d":"€ 800.00"}}]
[null,"Stand piccoli",1,0,{"v":100,"d":"€ 100.00"},{"$f":"C28*E28","v":{"v":100,"d":"€ 100.00"}},{"$f":"D28*E28","v":{"v":0,"d":"€ 0.00"}}]
[null,"Totale",{"$f":"SUBTOTAL(109,ExhibitorsAndVendors[Stimate])","v":11},{"$f":"SUBTOTAL(109,ExhibitorsAndVendors[Effettive])","v":9},null,{"$f":"SUBTOTAL(109,ExhibitorsAndVendors[Entrate stimate])","v":{"v":2600,"d":"€ 2,600.00"}},{"$f":"SUBTOTAL(109,ExhibitorsAndVendors[Entrate effettive])","v":{"v":2300,"d":"€ 2,300.00"}}]
[]
[null,"Vendita di articoli"]
[null,"Tipo","Stimate","Effettivo","Prezzo","Entrate stimate","Entrate effettive"]
[null,"Elemento 1",2,2,{"v":150,"d":"€ 150.00"},{"$f":"C33*E33","v":{"v":300,"d":"€ 300.00"}},{"$f":"D33*E33","v":{"v":300,"d":"€ 300.00"}}]
[null,"Elemento 2",5,5,{"v":50,"d":"€ 50.00"},{"$f":"C34*E34","v":{"v":250,"d":"€ 250.00"}},{"$f":"D34*E34","v":{"v":250,"d":"€ 250.00"}}]
[null,"Elemento 3",5,5,{"v":20,"d":"€ 20.00"},{"$f":"C35*E35","v":{"v":100,"d":"€ 100.00"}},{"$f":"D35*E35","v":{"v":100,"d":"€ 100.00"}}]
[null,"Elemento 4",5,5,{"v":20,"d":"€ 20.00"},{"$f":"C36*E36","v":{"v":100,"d":"€ 100.00"}},{"$f":"D36*E36","v":{"v":100,"d":"€ 100.00"}}]
[null,"Totale",{"$f":"SUBTOTAL(109,SaleOfItems[Stimate])","v":17},{"$f":"SUBTOTAL(109,SaleOfItems[Effettivo])","v":17},null,{"$f":"SUBTOTAL(109,SaleOfItems[Entrate stimate])","v":{"v":750,"d":"€ 750.00"}},{"$f":"SUBTOTAL(109,SaleOfItems[Entrate effettive])","v":{"v":750,"d":"€ 750.00"}}]

{"sheet":"Riepilogo profitti e perdite","index":2,"n_rows":29,"n_cols":16,"rows_kept":29,"merged":[[28,1,28,3],[28,4,28,6]]}
[{"$nulls":7}," "]
[]
[null,{"$f":"Uscite!B3","v":"Festa della presentazione del prodotto"}]
[null,"RIEPILOGO PROFITTI + PERDITE"]
[]
[]
[null,"Riepilogo delle spese","Stimate","Effettivo",null,"Spese effettive",{"$nulls":5},"Classificazione","Spese","Stimate","Effettivo","Valore di classificazione"]
[null,{"$f":"VLOOKUP(1,$L$8:$O$14,2,FALSE)","v":"Programma"},{"$f":"VLOOKUP(1,$L$8:$O$14,3,FALSE)","v":{"v":900,"d":"€ 900.00"}},{"$f":"VLOOKUP(1,$L$8:$O$14,4,FALSE)","v":{"v":700,"d":"€ 700.00"}},{"$nulls":7},{"$f":"_xlfn.RANK.AVG(P8,$P$8:$P$14)","v":2},"Sito",{"$f":"SiteExpenses[[#Totals],[Stimate]]","v":{"v":500,"d":"€ 500"}},{"$f":"SiteExpenses[[#Totals],[Effettive]]","v":{"v":450,"d":"€ 450"}},{"$f":"O8+ROW(O8)/10000","v":450.0008}]
[null,{"$f":"VLOOKUP(2,$L$8:$O$14,2,FALSE)","v":"Sito"},{"$f":"VLOOKUP(2,$L$8:$O$14,3,FALSE)","v":{"v":500,"d":"€ 500.00"}},{"$f":"VLOOKUP(2,$L$8:$O$14,4,FALSE)","v":{"v":450,"d":"€ 450.00"}},{"$nulls":7},5,"Decorazioni",{"$f":"DecorationsExpenses[[#Totals],[Stimate]]","v":{"v":200,"d":"€ 200"}},{"$f":"DecorationsExpenses[[#Totals],[Effettive]]","v":{"v":100,"d":"€ 100"}},{"$f":"O9+ROW(O9)/10000","v":100.0009}]
[null,{"$f":"VLOOKUP(3,$L$8:$O$14,2,FALSE)","v":"Rinfresco"},{"$f":"VLOOKUP(3,$L$8:$O$14,3,FALSE)","v":{"v":300,"d":"€ 300.00"}},{"$f":"VLOOKUP(3,$L$8:$O$14,4,FALSE)","v":{"v":200,"d":"€ 200.00"}},{"$nulls":7},3,"Rinfresco",{"$f":"RefreshmentsExpenses[[#Totals],[Stimate]]","v":{"v":300,"d":"€ 300"}},{"$f":"RefreshmentsExpenses[[#Totals],[Effettivo]]","v":{"v":200,"d":"€ 200"}},{"v":200.001,"d":"200.0010"}]
[null,{"$f":"VLOOKUP(4,$L$8:$O$14,2,FALSE)","v":"Premi"},{"$f":"VLOOKUP(4,$L$8:$O$14,3,FALSE)","v":{"v":100,"d":"€ 100.00"}},{"$f":"VLOOKUP(4,$L$8:$O$14,4,FALSE)","v":{"v":100,"d":"€ 100.00"}},{"$nulls":7},1,"Programma",{"$f":"ProgramExpenses[[#Totals],[Stimate]]","v":{"v":900,"d":"€ 900"}},{"$f":"ProgramExpenses[[#Totals],[Effettivo]]","v":{"v":700,"d":"€ 700"}},700.0011]
[null,{"$f":"VLOOKUP(5,$L$8:$O$14,2,FALSE)","v":"Decorazioni"},{"$f":"VLOOKUP(5,$L$8:$O$14,3,FALSE)","v":{"v":200,"d":"€ 200.00"}},{"$f":"VLOOKUP(5,$L$8:$O$14,4,FALSE)","v":{"v":100,"d":"€ 100.00"}},{"$nulls":7},7,"Pubblicità",{"$f":"PublicityExpenses[[#Totals],[Stimate]]","v":{"v":20,"d":"€ 20"}},{"$f":"PublicityExpenses[[#Totals],[Effettive]]","v":{"v":20,"d":"€ 20"}},20.0012]
[null,{"$f":"VLOOKUP(6,$L$8:$O$14,2,FALSE)","v":"Varie"},{"$f":"VLOOKUP(6,$L$8:$O$14,3,FALSE)","v":{"v":70,"d":"€ 70.00"}},{"$f":"VLOOKUP(6,$L$8:$O$14,4,FALSE)","v":{"v":70,"d":"€ 70.00"}},{"$nulls":7},4,"Premi",{"$f":"PrizesExpenses[[#Totals],[Stimate]]","v":{"v":100,"d":"€ 100"}},{"$f":"PrizesExpenses[[#Totals],[Effettive]]","v":{"v":100,"d":"€ 100"}},100.0013]
[null,{"$f":"VLOOKUP(7,$L$8:$O$14,2,FALSE)","v":"Pubblicità"},{"$f":"VLOOKUP(7,$L$8:$O$14,3,FALSE)","v":{"v":20,"d":"€ 20.00"}},{"$f":"VLOOKUP(7,$L$8:$O$14,4,FALSE)","v":{"v":20,"d":"€ 20.00"}},{"$nulls":7},6,"Varie",{"$f":"MiscellaneousExpenses[[#Totals],[Stimate]]","v":{"v":70,"d":"€ 70"}},{"$f":"MiscellaneousExpenses[[#Totals],[Effettivo]]","v":{"v":70,"d":"€ 70"}},70.0014]
[null,"Totale",{"$f":"SUBTOTAL(109,RiepilogoSpese[Stimate])","v":{"v":2090,"d":"€ 2,090.00"}},{"$f":"SUBTOTAL(109,RiepilogoSpese[Effettivo])","v":{"v":1640,"d":"€ 1,640.00"}}]
[]
[null,"Riepilogo delle entrate","Stimate","Effettive",null,"Entrate effettive",{"$nulls":5},"Classificazione","Entrate","Stimate","Effettivo","Valore di classificazione"]
[null,{"$f":"VLOOKUP(1,$L$18:$O$21,2,FALSE)","v":"Espositori / fornitori"},{"$f":"VLOOKUP(1,$L$18:$O$21,3,FALSE)","v":{"v":2600,"d":"€ 2,600.00"}},{"$f":"VLOOKUP(1,$L$18:$O$21,4,FALSE)","v":{"v":2300,"d":"€ 2,300.00"}},{"$nulls":7},{"$f":"_xlfn.RANK.AVG(P18,$P$18:$P$21)","v":2},"Ammissioni",{"$f":"Ammissioni[[#Totals],[Entrate stimate]]","v":{"v":900,"d":"€ 900"}},{"$f":"Ammissioni[[#Totals],[Entrate effettive]]","v":{"v":820,"d":"€ 820"}},{"$f":"O18+ROW(O18)/10000","v":820.0018}]
[null,{"$f":"VLOOKUP(2,$L$18:$O$21,2,FALSE)","v":"Ammissioni"},{"$f":"VLOOKUP(2,$L$18:$O$21,3,FALSE)","v":{"v":900,"d":"€ 900.00"}},{"$f":"VLOOKUP(2,$L$18:$O$21,4,FALSE)","v":{"v":820,"d":"€ 820.00"}},{"$nulls":7},{"$f":"_xlfn.RANK.AVG(P19,$P$18:$P$21)","v":4},"Annunci in programma",{"$f":"AdsInProgram[[#Totals],[Entrate stimate]]","v":{"v":200,"d":"€ 200"}},{"$f":"AdsInProgram[[#Totals],[Entrate effettive]]","v":{"v":300,"d":"€ 300"}},300.0019]
[null,"Vendite di articoli",{"$f":"VLOOKUP(3,$L$18:$O$21,3,FALSE)","v":{"v":750,"d":"€ 750.00"}},{"$f":"VLOOKUP(3,$L$18:$O$21,4,FALSE)","v":{"v":750,"d":"€ 750.00"}},{"$nulls":7},1,"Espositori / fornitori",{"$f":"ExhibitorsAndVendors[[#Totals],[Entrate stimate]]","v":{"v":2600,"d":"€ 2,600"}},{"$f":"ExhibitorsAndVendors[[#Totals],[Entrate effettive]]","v":{"v":2300,"d":"€ 2,300"}},{"v":2300.002,"d":"2,300.0020"}]
[null,{"$f":"VLOOKUP(4,$L$18:$O$21,2,FALSE)","v":"Annunci in programma"},{"$f":"VLOOKUP(4,$L$18:$O$21,3,FALSE)","v":{"v":200,"d":"€ 200.00"}},{"$f":"VLOOKUP(4,$L$18:$O$21,4,FALSE)","v":{"v":300,"d":"€ 300.00"}},{"$nulls":7},3,"Vendite di articoli",{"$f":"SaleOfItems[[#Totals],[Entrate stimate]]","v":{"v":750,"d":"€ 750"}},{"$f":"SaleOfItems[[#Totals],[Entrate effettive]]","v":{"v":750,"d":"€ 750"}},750.0021]
[null,"Totale",{"$f":"SUBTOTAL(109,RiepilogoEntrate[Stimate])","v":{"v":4450,"d":"€ 4,450.00"}},{"$f":"SUBTOTAL(109,RiepilogoEntrate[Effettive])","v":{"v":4170,"d":"€ 4,170.00"}}]
[]
[null,"Riepilogo profitti e perdite","Stimate","Effettivo"]
[null,"Totale entrate",{"$f":"RiepilogoEntrate[[#Totals],[Stimate]]","v":{"v":4450,"d":"€ 4,450.00"}},{"$f":"RiepilogoEntrate[[#Totals],[Effettive]]","v":{"v":4170,"d":"€ 4,170.00"}}]
[null,"Totale spese",{"$f":"RiepilogoSpese[[#Totals],[Stimate]]","v":{"v":2090,"d":"€ 2,090.00"}},{"$f":"RiepilogoSpese[[#Totals],[Effettivo]]","v":{"v":1640,"d":"€ 1,640.00"}}]
[null,"Profitto o (perdita)",{"$f":"C25-C26","v":{"v":2360,"d":"€ 2,360.00"}},{"$f":"D25-D26","v":{"v":2530,"d":"€ 2,530.00"}}]
[]
[null,"Rapporto tra spese e profitti (perdita)",null,null,"Costi stimati e costi effettivi"]