{"text_format":"3","workbook":"xlsx","n_sheets":4,"sheets":["INIZIO","PARAMETRI DEL PROGETTO","DETTAGLI PROGETTO","VALORI TOTALI DEL PROGETTO"],"not_rendered":{"charts":2,"defined_names":3,"pivot_tables":1},"read":"whole","date_system":"1900"}

{"sheet":"INIZIO","index":0,"n_rows":7,"n_cols":2,"rows_kept":7}
[null,"INFORMAZIONI SU QUESTO MODELLO"]
[null,"Tenere traccia dei parametri, dei dettagli e dei totali del progetto in questa cartella di lavoro Registro pianificazione evento."]
[null,"Immettere le informazioni nel foglio di lavoro di Parametri progetto per aggiornare gli istogrammi e nel foglio di lavoro Dettagli progetto. La tabella pivot nel foglio di lavoro Totali progetto viene aggiornata automaticamente."]
[null,"Immettere il nome della società nel foglio di lavoro dei parametri. Verrà aggiornato automaticamente in altri fogli di lavoro."]
[null,"Nota:  "]
[null,"Nella colonna A di ciascun foglio di lavoro della cartella di lavoro REGISTRO PIANIFICAZIONE EVENTO sono disponibili altre istruzioni. Questo testo è stato nascosto intenzionalmente. Per rimuovere il testo, seleziona la colonna A, quindi scegli ELIMINA. Per visualizzare il testo, selezionare la colonna A, quindi modificare il colore del carattere."]
{"$rows_left_out":2}
{"sheet":"PARAMETRI DEL PROGETTO","index":1,"n_rows":20,"n_cols":9,"rows_kept":20,"merged":[[24,1,43,3]]}
[null,"Nome società"]
[null,"Registro progetti di gestione evento"]
[null,{"$f":"B1&\" Riservato\"","v":"Nome società Riservato"}]
[null,"Le celle ombreggiate vengono calcolate automaticamente. Non è necessario immettervi alcun dato."]
[null,"TIPO DI PROGETTO","ACCOUNT MANAGER","PROJECT MANAGER","STRATEGY MANAGER","DESIGN SPECIALIST","PERSONALE PER L'EVENTO","PERSONALE AMMINISTRATIVO","Totale"]
[null,"Sviluppo strategia evento",{"v":0.2,"d":"20%"},{"v":0.1,"d":"10%"},{"v":0.6,"d":"60%"},{"v":0,"d":"0%"},{"v":0,"d":"0%"},{"v":0.1,"d":"10%"},{"$f":"SUM(Parametri[[#This Row],[ACCOUNT MANAGER]:[PERSONALE AMMINISTRATIVO]])","v":{"v":1,"d":"100%"}}]
{"$rows_left_out":15}
{"sheet":"DETTAGLI PROGETTO","index":2,"n_rows":10,"n_cols":23,"rows_kept":10}
[null,{"$f":"'PARAMETRI DEL PROGETTO'!B1","v":"Nome società"}]
[null,"Registro progetti di gestione evento"]
[null,{"$f":"'PARAMETRI DEL PROGETTO'!B3","v":"Nome società Riservato"}]
["Immettere le informazioni nella tabella dei dettagli del progetto a partire dalla cella a destra.\nINFORMAZIONI\nPer aggiungere una riga nella tabella a destra, selezionare la cella più in basso a destra nel corpo della tabella (non la riga dei totali) e premere TAB oppure premere MAIUSC+F10 nel punto in cui si vuole inserire la riga e selezionare Inserisci | Righe tabella sopra/sotto.\nAssicurarsi che vengano eliminate tutte le righe inutilizzate, altrimenti la tabella pivot TOTALI PROGETTO restituirà risultati errati perché usa tutte le celle delle tabelle.","NOME PROGETTO","TIPO DI PROGETTO","INIZIO STIMATO","FINE STIMATA","INIZIO EFFETTIVO","FINE EFFETTIVA","LAVORO STIMATO","LAVORO EFFETTIVO","DURATA STIMATA","DURATA EFFETTIVA","ACCOUNT MANAGER","PROJECT MANAGER","STRATEGY MANAGER","DESIGN SPECIALIST","PERSONALE PER L'EVENTO","PERSONALE AMMINISTRATIVO","ACCOUNT MANAGER ","PROJECT MANAGER ","STRATEGY MANAGER ","DESIGN SPECIALIST ","PERSONALE PER L'EVENTO ","PERSONALE AMMINISTRATIVO "]
[null,"Progetto 1","Sviluppo strategia evento",{"$f":"DATE(YEAR(TODAY()),6,9)","v":"2022-06-09"},{"$f":" DATE(YEAR(TODAY()),8,7)","v":"2022-08-07"},{"$f":"DATE(YEAR(TODAY()),6,29)","v":"2022-06-29"},{"$f":"DATE(YEAR(TODAY()),9,3)","v":"2022-09-03"},200,220,{"$f":"DAYS360(DettagliProgetto[[#This Row],[INIZIO STIMATO]],DettagliProgetto[[#This Row],[FINE STIMATA]],FALSE)","v":58},{"$f":"DAYS360(DettagliProgetto[[#This Row],[INIZIO EFFETTIVO]],DettagliProgetto[[#This Row],[FINE EFFETTIVA]],FALSE)","v":64},{"$f":"INDEX(Parametri[],MATCH(DettagliProgetto[[#This Row],[TIPO DI PROGETTO]],Parametri[TIPO DI PROGETTO],0),MATCH(DettagliProgetto[[#Headers],[ACCOUNT MANAGER]],Parametri[#Headers],0))*INDEX('PARAMETRI DEL PROGETTO'!$B$13:$H$13,1,MATCH(DettagliProgetto[[#Headers],[ACCOUNT MANAGER]],Parametri[#Headers],0))*DettagliProgetto[[#This Row],[LAVORO STIMATO]]","v":{"v":7200,"d":"7,200 €"}},{"$f":"INDEX(Parametri[],MATCH(DettagliProgetto[[#This Row],[TIPO DI PROGETTO]],Parametri[TIPO DI PROGETTO],0),MATCH(DettagliProgetto[[#Headers],[PROJECT MANAGER]],Parametri[#Headers],0))*INDEX('PARAMETRI DEL PROGETTO'!$B$13:$H$13,1,MATCH(DettagliProgetto[[#Headers],[PROJECT MANAGER]],Parametri[#Headers],0))*DettagliProgetto[[#This Row],[LAVORO STIMATO]]","v":{"v":2400,"d":"2,400 €"}},{"$f":"INDEX(Parametri[],MATCH(DettagliProgetto[[#This Row],[TIPO DI PROGETTO]],Parametri[TIPO DI PROGETTO],0),MATCH(DettagliProgetto[[#Headers],[STRATEGY MANAGER]],Parametri[#Headers],0))*INDEX('PARAMETRI DEL PROGETTO'!$B$13:$H$13,1,MATCH(DettagliProgetto[[#Headers],[STRATEGY MANAGER]],Parametri[#Headers],0))*DettagliProgetto[[#This Row],[LAVORO STIMATO]]","v":{"v":18000,"d":"18,000 €"}},{"$f":"INDEX(Parametri[],MATCH(DettagliProgetto[[#This Row],[TIPO DI PROGETTO]],Parametri[TIPO DI PROGETTO],0),MATCH(DettagliProgetto[[#Headers],[DESIGN SPECIALIST]],Parametri[#Headers],0))*INDEX('PARAMETRI DEL PROGETTO'!$B$13:$H$13,1,MATCH(DettagliProgetto[[#Headers],[DESIGN SPECIALIST]],Parametri[#Headers],0))*DettagliProgetto[[#This Row],[LAVORO STIMATO]]","v":{"v":0,"d":"0 €"}},{"$f":"INDEX(Parametri[],MATCH(DettagliProgetto[[#This Row],[TIPO DI PROGETTO]],Parametri[TIPO DI PROGETTO],0),MATCH(DettagliProgetto[[#Headers],[PERSONALE PER L''EVENTO]],Parametri[#Headers],0))*INDEX('PARAMETRI DEL PROGETTO'!$B$13:$H$13,1,MATCH(DettagliProgetto[[#Headers],[PERSONALE PER L''EVENTO]],Parametri[#Headers],0))*DettagliProgetto[[#This Row],[LAVORO STIMATO]]","v":{"v":0,"d":"0 €"}},{"$f":"INDEX(Parametri[],MATCH(DettagliProgetto[[#This Row],[TIPO DI PROGETTO]],Parametri[TIPO DI PROGETTO],0),MATCH(DettagliProgetto[[#Headers],[PERSONALE AMMINISTRATIVO]],Parametri[#Headers],0))*INDEX('PARAMETRI DEL PROGETTO'!$B$13:$H$13,1,MATCH(DettagliProgetto[[#Headers],[PERSONALE AMMINISTRATIVO]],Parametri[#Headers],0))*DettagliProgetto[[#This Row],[LAVORO STIMATO]]","v":{"v":1200,"d":"1,200 €"}},{"$f":"INDEX(Parametri[],MATCH(DettagliProgetto[[#This Row],[TIPO DI PROGETTO]],Parametri[TIPO DI PROGETTO],0),MATCH(DettagliProgetto[[#Headers],[ACCOUNT MANAGER]],Parametri[#Headers],0))*INDEX('PARAMETRI DEL PROGETTO'!$B$13:$H$13,1,MATCH(DettagliProgetto[[#Headers],[ACCOUNT MANAGER]],Parametri[#Headers],0))*DettagliProgetto[[#This Row],[LAVORO EFFETTIVO]]","v":{"v":7920,"d":"7,920 €"}},{"$f":"INDEX(Parametri[],MATCH(DettagliProgetto[[#This Row],[TIPO DI PROGETTO]],Parametri[TIPO DI PROGETTO],0),MATCH(DettagliProgetto[[#Headers],[PROJECT MANAGER]],Parametri[#Headers],0))*INDEX('PARAMETRI DEL PROGETTO'!$B$13:$H$13,1,MATCH(DettagliProgetto[[#Headers],[PROJECT MANAGER]],Parametri[#Headers],0))*DettagliProgetto[[#This Row],[LAVORO EFFETTIVO]]","v":{"v":2640,"d":"2,640 €"}},{"$f":"INDEX(Parametri[],MATCH(DettagliProgetto[[#This Row],[TIPO DI PROGETTO]],Parametri[TIPO DI PROGETTO],0),MATCH(DettagliProgetto[[#Headers],[STRATEGY MANAGER]],Parametri[#Headers],0))*INDEX('PARAMETRI DEL PROGETTO'!$B$13:$H$13,1,MATCH(DettagliProgetto[[#Headers],[STRATEGY MANAGER]],Parametri[#Headers],0))*DettagliProgetto[[#This Row],[LAVORO EFFETTIVO]]","v":{"v":19800,"d":"19,800 €"}},{"$f":"INDEX(Parametri[],MATCH(DettagliProgetto[[#This Row],[TIPO DI PROGETTO]],Parametri[TIPO DI PROGETTO],0),MATCH(DettagliProgetto[[#Headers],[DESIGN SPECIALIST]],Parametri[#Headers],0))*INDEX('PARAMETRI DEL PROGETTO'!$B$13:$H$13,1,MATCH(DettagliProgetto[[#Headers],[DESIGN SPECIALIST]],Parametri[#Headers],0))*DettagliProgetto[[#This Row],[LAVORO EFFETTIVO]]","v":{"v":0,"d":"0 €"}},{"$f":"INDEX(Parametri[],MATCH(DettagliProgetto[[#This Row],[TIPO DI PROGETTO]],Parametri[TIPO DI PROGETTO],0),MATCH(DettagliProgetto[[#Headers],[PERSONALE PER L''EVENTO]],Parametri[#Headers],0))*INDEX('PARAMETRI DEL PROGETTO'!$B$13:$H$13,1,MATCH(DettagliProgetto[[#Headers],[PERSONALE PER L''EVENTO]],Parametri[#Headers],0))*DettagliProgetto[[#This Row],[LAVORO EFFETTIVO]]","v":{"v":0,"d":"0 €"}},{"$f":"INDEX(Parametri[],MATCH(DettagliProgetto[[#This Row],[TIPO DI PROGETTO]],Parametri[TIPO DI PROGETTO],0),MATCH(DettagliProgetto[[#Headers],[PERSONALE AMMINISTRATIVO]],Parametri[#Headers],0))*INDEX('PARAMETRI DEL PROGETTO'!$B$13:$H$13,1,MATCH(DettagliProgetto[[#Headers],[PERSONALE AMMINISTRATIVO]],Parametri[#Headers],0))*DettagliProgetto[[#This Row],[LAVORO EFFETTIVO]]","v":{"v":1320,"d":"1,320 €"}}]
[null,"Progetto 2","Pianificazione evento",{"$f":"DATE(YEAR(TODAY())+1,6,25)","v":"2023-06-25"},{"$f":"DATE(YEAR(TODAY())+1,7,27)","v":"2023-07-27"},{"$f":"DATE(YEAR(TODAY()),7,15)","v":"2022-07-15"},{"$f":"DATE(YEAR(TODAY())+1,8,25)","v":"2023-08-25"},400,390,{"$f":"DAYS360(DettagliProgetto[[#This Row],[INIZIO STIMATO]],DettagliProgetto[[#This Row],[FINE STIMATA]],FALSE)","v":32},{"$f":"DAYS360(DettagliProgetto[[#This Row],[INIZIO EFFETTIVO]],DettagliProgetto[[#This Row],[FINE EFFETTIVA]],FALSE)","v":400},{"$f":"INDEX(Parametri[],MATCH(DettagliProgetto[[#This Row],[TIPO DI PROGETTO]],Parametri[TIPO DI PROGETTO],0),MATCH(DettagliProgetto[[#Headers],[ACCOUNT MANAGER]],Parametri[#Headers],0))*INDEX('PARAMETRI DEL PROGETTO'!$B$13:$H$13,1,MATCH(DettagliProgetto[[#Headers],[ACCOUNT MANAGER]],Parametri[#Headers],0))*DettagliProgetto[[#This Row],[LAVORO STIMATO]]","v":{"v":14400,"d":"14,400 €"}},{"$f":"INDEX(Parametri[],MATCH(DettagliProgetto[[#This Row],[TIPO DI PROGETTO]],Parametri[TIPO DI PROGETTO],0),MATCH(DettagliProgetto[[#Headers],[PROJECT MANAGER]],Parametri[#Headers],0))*INDEX('PARAMETRI DEL PROGETTO'!$B$13:$H$13,1,MATCH(DettagliProgetto[[#Headers],[PROJECT MANAGER]],Parametri[#Headers],0))*DettagliProgetto[[#This Row],[LAVORO STIMATO]]","v":{"v":24000,"d":"24,000 €"}},{"$f":"INDEX(Parametri[],MATCH(DettagliProgetto[[#This Row],[TIPO DI PROGETTO]],Parametri[TIPO DI PROGETTO],0),MATCH(DettagliProgetto[[#Headers],[STRATEGY MANAGER]],Parametri[#Headers],0))*INDEX('PARAMETRI DEL PROGETTO'!$B$13:$H$13,1,MATCH(DettagliProgetto[[#Headers],[STRATEGY MANAGER]],Parametri[#Headers],0))*DettagliProgetto[[#This Row],[LAVORO STIMATO]]","v":{"v":6000,"d":"6,000 €"}},{"$f":"INDEX(Parametri[],MATCH(DettagliProgetto[[#This Row],[TIPO DI PROGETTO]],Parametri[TIPO DI PROGETTO],0),MATCH(DettagliProgetto[[#Headers],[DESIGN SPECIALIST]],Parametri[#Headers],0))*INDEX('PARAMETRI DEL PROGETTO'!$B$13:$H$13,1,MATCH(DettagliProgetto[[#Headers],[DESIGN SPECIALIST]],Parametri[#Headers],0))*DettagliProgetto[[#This Row],[LAVORO STIMATO]]","v":{"v":4000,"d":"4,000 €"}},{"$f":"INDEX(Parametri[],MATCH(DettagliProgetto[[#This Row],[TIPO DI PROGETTO]],Parametri[TIPO DI PROGETTO],0),MATCH(DettagliProgetto[[#Headers],[PERSONALE PER L''EVENTO]],Parametri[#Headers],0))*INDEX('PARAMETRI DEL PROGETTO'!$B$13:$H$13,1,MATCH(DettagliProgetto[[#Headers],[PERSONALE PER L''EVENTO]],Parametri[#Headers],0))*DettagliProgetto[[#This Row],[LAVORO STIMATO]]","v":{"v":0,"d":"0 €"}},{"$f":"INDEX(Parametri[],MATCH(DettagliProgetto[[#This Row],[TIPO DI PROGETTO]],Parametri[TIPO DI PROGETTO],0),MATCH(DettagliProgetto[[#Headers],[PERSONALE AMMINISTRATIVO]],Parametri[#Headers],0))*INDEX('PARAMETRI DEL PROGETTO'!$B$13:$H$13,1,MATCH(DettagliProgetto[[#Headers],[PERSONALE AMMINISTRATIVO]],Parametri[#Headers],0))*DettagliProgetto[[#This Row],[LAVORO STIMATO]]","v":{"v":2400,"d":"2,400 €"}},{"$f":"INDEX(Parametri[],MATCH(DettagliProgetto[[#This Row],[TIPO DI PROGETTO]],Parametri[TIPO DI PROGETTO],0),MATCH(DettagliProgetto[[#Headers],[ACCOUNT MANAGER]],Parametri[#Headers],0))*INDEX('PARAMETRI DEL PROGETTO'!$B$13:$H$13,1,MATCH(DettagliProgetto[[#Headers],[ACCOUNT MANAGER]],Parametri[#Headers],0))*DettagliProgetto[[#This Row],[LAVORO EFFETTIVO]]","v":{"v":14040,"d":"14,040 €"}},{"$f":"INDEX(Parametri[],MATCH(DettagliProgetto[[#This Row],[TIPO DI PROGETTO]],Parametri[TIPO DI PROGETTO],0),MATCH(DettagliProgetto[[#Headers],[PROJECT MANAGER]],Parametri[#Headers],0))*INDEX('PARAMETRI DEL PROGETTO'!$B$13:$H$13,1,MATCH(DettagliProgetto[[#Headers],[PROJECT MANAGER]],Parametri[#Headers],0))*DettagliProgetto[[#This Row],[LAVORO EFFETTIVO]]","v":{"v":23400,"d":"23,400 €"}},{"$f":"INDEX(Parametri[],MATCH(DettagliProgetto[[#This Row],[TIPO DI PROGETTO]],Parametri[TIPO DI PROGETTO],0),MATCH(DettagliProgetto[[#Headers],[STRATEGY MANAGER]],Parametri[#Headers],0))*INDEX('PARAMETRI DEL PROGETTO'!$B$13:$H$13,1,MATCH(DettagliProgetto[[#Headers],[STRATEGY MANAGER]],Parametri[#Headers],0))*DettagliProgetto[[#This Row],[LAVORO EFFETTIVO]]","v":{"v":5850,"d":"5,850 €"}},{"$f":"INDEX(Parametri[],MATCH(DettagliProgetto[[#This Row],[TIPO DI PROGETTO]],Parametri[TIPO DI PROGETTO],0),MATCH(DettagliProgetto[[#Headers],[DESIGN SPECIALIST]],Parametri[#Headers],0))*INDEX('PARAMETRI DEL PROGETTO'!$B$13:$H$13,1,MATCH(DettagliProgetto[[#Headers],[DESIGN SPECIALIST]],Parametri[#Headers],0))*DettagliProgetto[[#This Row],[LAVORO EFFETTIVO]]","v":{"v":3900,"d":"3,900 €"}},{"$f":"INDEX(Parametri[],MATCH(DettagliProgetto[[#This Row],[TIPO DI PROGETTO]],Parametri[TIPO DI PROGETTO],0),MATCH(DettagliProgetto[[#Headers],[PERSONALE PER L''EVENTO]],Parametri[#Headers],0))*INDEX('PARAMETRI DEL PROGETTO'!$B$13:$H$13,1,MATCH(DettagliProgetto[[#Headers],[PERSONALE PER L''EVENTO]],Parametri[#Headers],0))*DettagliProgetto[[#This Row],[LAVORO EFFETTIVO]]","v":{"v":0,"d":"0 €"}},{"$f":"INDEX(Parametri[],MATCH(DettagliProgetto[[#This Row],[TIPO DI PROGETTO]],Parametri[TIPO DI PROGETTO],0),MATCH(DettagliProgetto[[#Headers],[PERSONALE AMMINISTRATIVO]],Parametri[#Headers],0))*INDEX('PARAMETRI DEL PROGETTO'!$B$13:$H$13,1,MATCH(DettagliProgetto[[#Headers],[PERSONALE AMMINISTRATIVO]],Parametri[#Headers],0))*DettagliProgetto[[#This Row],[LAVORO EFFETTIVO]]","v":{"v":2340,"d":"2,340 €"}}]
{"$rows_left_out":5}
{"sheet":"VALORI TOTALI DEL PROGETTO","index":3,"n_rows":10,"n_cols":14,"rows_kept":10}
[null,{"$f":"'PARAMETRI DEL PROGETTO'!B1","v":"Nome società"}]
[null,"Registro progetti di gestione evento"]
[null,{"$f":"'PARAMETRI DEL PROGETTO'!B3","v":"Nome società Riservato"}]
["La tabella pivot che inizia nella cella a destra viene aggiornata automaticamente.\nINFORMAZIONI\nPer aggiornare la tabella pivot a destra, selezionarla (qualsiasi cella all'interno della tabella pivot) e quindi selezionare Aggiorna nella scheda STRUMENTI TABELLA PIVOT | ANALIZZA sulla barra multifunzione oppure premere MAIUSC+F10 in qualsiasi cella della tabella pivot e selezionare Aggiorna.","Etichette di riga","ACCOUNT MANAGER - STIMA","PROJECT MANAGER - STIMA","STRATEGY MANAGER - STIMA","DESIGN SPECIALIST - STIMA","PERSONALE EVENTO - STIMA","PERSONALE AMMINISTRATIVO - STIMA","ACCOUNT MANAGER - EFFETTIVO","PROJECT MANAGER - EFFETTIVO","STRATEGY MANAGER - EFFETTIVO","DESIGN SPECIALIST - EFFETTIVO","PERSONALE EVENTO - EFFETTIVO","PERSONALE AMMINISTRATIVO - EFFETTIVO"]
[null,"Progetto 1",{"v":7200,"d":"7,200.00 €"},{"v":2400,"d":"2,400.00 €"},{"v":18000,"d":"18,000.00 €"},{"v":0,"d":"0.00 €"},{"v":0,"d":"0.00 €"},{"v":1200,"d":"1,200.00 €"},{"v":7920,"d":"7,920.00 €"},{"v":2640,"d":"2,640.00 €"},{"v":19800,"d":"19,800.00 €"},{"v":0,"d":"0.00 €"},{"v":0,"d":"0.00 €"},{"v":1320,"d":"1,320.00 €"}]
[null,"Progetto 2",{"v":14400,"d":"14,400.00 €"},{"v":24000,"d":"24,000.00 €"},{"v":6000,"d":"6,000.00 €"},{"v":4000,"d":"4,000.00 €"},{"v":0,"d":"0.00 €"},{"v":2400,"d":"2,400.00 €"},{"v":14040,"d":"14,040.00 €"},{"v":23400,"d":"23,400.00 €"},{"v":5850,"d":"5,850.00 €"},{"v":3900,"d":"3,900.00 €"},{"v":0,"d":"0.00 €"},{"v":2340,"d":"2,340.00 €"}]
{"$rows_left_out":4}