{"text_format":"3","workbook":"xlsx","n_sheets":4,"sheets":["Inizio","PARAMETRI DEL PROGETTO","DETTAGLI PROGETTO","VALORI TOTALI DEL PROGETTO"],"not_rendered":{"charts":2,"external_links":1,"defined_names":3,"pivot_tables":1},"read":"whole","date_system":"1900"}

{"sheet":"Inizio","index":0,"n_rows":8,"n_cols":2,"rows_kept":8}
[null,"INFORMAZIONI SU QUESTO MODELLO"]
[]
[null,"In questa cartella di lavoro è possibile tenere traccia dei parametri, dei dettagli e dei totali del progetto in una pianificazione di progetto per studi legali."]
[null,"Immettere il nome della società nel foglio di lavoro Parametri progetto. Verrà aggiornato automaticamente in altri fogli di lavoro."]
[null,"Immettere le informazioni nel foglio di lavoro Parametri progetto per aggiornare gli istogrammi e nel foglio di lavoro Dettagli progetto. La tabella pivot nel foglio di lavoro Totali progetto viene aggiornata automaticamente."]
[null,"Nota:  "]
[null,"Nella colonna A di ciascun foglio di lavoro sono disponibili altre istruzioni. Questo testo è stato nascosto intenzionalmente. Per rimuovere il testo, seleziona la colonna A, quindi scegli ELIMINA. Per visualizzare il testo, selezionare la colonna A, quindi modificare il colore del carattere."]
[null,"Per altre informazioni sulle tabelle nei fogli di lavoro, premere MAIUSC, quindi F10 in una tabella, selezionare l'opzione TABELLA, quindi selezionare TESTO ALTERNATIVO. Per le tabelle pivot nel foglio di lavoro Totali progetto, premere MAIUSC e quindi F10 in una tabella, selezionare OPZIONI TABELLA PIVOT e quindi selezionare la scheda TESTO ALTERNATIVO."]
{"$rows_left_out":1}
{"sheet":"PARAMETRI DEL PROGETTO","index":1,"n_rows":19,"n_cols":9,"rows_kept":19}
[null,"Mitchell, Morris, Ward & Cook"]
[null,"Pianificazione progetto per studi legali"]
[null,{"$f":"B1&\" Riservato\"","v":"Mitchell, Morris, Ward & Cook Riservato"}]
[null,"Le celle ombreggiate vengono calcolate automaticamente. Non è necessario immettervi alcun dato."]
[null,"TIPO DI PROGETTO","PARTNER GENERALE","AVVOCATO D'IMPRESA","DIFENSORE CAUSE CIVILI","AVVOCATO PROPRIETÀ INTELLETTUALE","FALLIMENTARISTA","PERSONALE AMMINISTRATIVO","TOTALE"]
[null,"Registrazione di società",{"v":0.1,"d":"10%"},{"v":0.4,"d":"40%"},{"v":0,"d":"0%"},{"v":0,"d":"0%"},{"v":0,"d":"0%"},{"v":0.5,"d":"50%"},{"$f":"SUM(Parametri[[#This Row],[PARTNER GENERALE]:[PERSONALE AMMINISTRATIVO]])","v":{"v":1,"d":"100%"}}]
[null,"Acquisizione aziendale",{"v":0.1,"d":"10%"},{"v":0.4,"d":"40%"},{"v":0,"d":"0%"},{"v":0.1,"d":"10%"},{"v":0,"d":"0%"},{"v":0.4,"d":"40%"},{"$f":"SUM(Parametri[[#This Row],[PARTNER GENERALE]:[PERSONALE AMMINISTRATIVO]])","v":{"v":1,"d":"100%"}}]
[null,"Difesa per responsabilità prodotto",{"v":0.2,"d":"20%"},{"v":0,"d":"0%"},{"v":0.5,"d":"50%"},{"v":0,"d":"0%"},{"v":0,"d":"0%"},{"v":0.3,"d":"30%"},{"$f":"SUM(Parametri[[#This Row],[PARTNER GENERALE]:[PERSONALE AMMINISTRATIVO]])","v":{"v":1,"d":"100%"}}]
{"$rows_left_out":12}
{"sheet":"DETTAGLI PROGETTO","index":2,"n_rows":10,"n_cols":25,"rows_kept":10,"merged":[[1,24,8,28]]}
[null,{"$f":"'PARAMETRI DEL PROGETTO'!B1","v":"Mitchell, Morris, Ward & Cook"}]
[null,{"$f":"'PARAMETRI DEL PROGETTO'!B2","v":"Pianificazione progetto per studi legali"},{"$nulls":22},"INFORMAZIONI:\nPer aggiungere una riga, selezionare la cella più in basso a destra nel corpo della tabella (non la riga dei totali) e premere TAB oppure premere MAIUSC e quindi F10 all'interno della tabella nel punto in cui si vuole inserire la riga e selezionare Inserisci | Righe tabella sopra/sotto.\nAssicurarsi che vengano eliminate tutte le righe inutilizzate, altrimenti la tabella pivot TOTALI PROGETTO restituirà risultati errati perché usa tutte le celle delle tabelle."]
[null,{"$f":"'PARAMETRI DEL PROGETTO'!B3","v":"Mitchell, Morris, Ward & Cook Riservato"}]
[null,"NOME PROGETTO","TIPO DI PROGETTO","INIZIO STIMATO","FINE STIMATA","INIZIO EFFETTIVO","FINE EFFETTIVA","LAVORO STIMATO","LAVORO EFFETTIVO","DURATA STIMATA","DURATA EFFETTIVA","PARTNER GENERALE","AVVOCATO D'IMPRESA","DIFENSORE CAUSE CIVILI","AVVOCATO PROPRIETÀ INTELLETTUALE","FALLIMENTARISTA","PERSONALE AMMINISTRATIVO","PARTNER GENERALE 2","AVVOCATO D'IMPRESA 2","DIFENSORE CAUSE CIVILI 2","AVVOCATO PROPRIETÀ INTELLETTUALE 2","FALLIMENTARISTA 2","PERSONALE AMMINISTRATIVO 2"]
[null,"Europa","Registrazione di società",{"$f":"TODAY()","v":"2023-03-30"},{"$f":"TODAY()+60","v":"2023-05-29"},{"$f":"TODAY()+10","v":"2023-04-09"},{"$f":"TODAY()+65","v":"2023-06-03"},200,220,{"$f":"DAYS360(Dettagli[[#This Row],[INIZIO STIMATO]],Dettagli[[#This Row],[FINE STIMATA]],FALSE)","v":59},{"$f":"DAYS360(Dettagli[[#This Row],[INIZIO EFFETTIVO]],Dettagli[[#This Row],[FINE EFFETTIVA]],FALSE)","v":54},{"$f":"INDEX(Parametri[],MATCH(Dettagli[[#This Row],[TIPO DI PROGETTO]],Parametri[TIPO DI PROGETTO],0),MATCH(Dettagli[[#Headers],[PARTNER GENERALE]],Parametri[#Headers],0))*INDEX('PARAMETRI DEL PROGETTO'!$B$12:$H$12,1,MATCH(Dettagli[[#Headers],[PARTNER GENERALE]],Parametri[#Headers],0))*Dettagli[[#This Row],[LAVORO STIMATO]]","v":{"v":7000,"d":"€ 7,000"}},{"$f":"INDEX(Parametri[],MATCH(Dettagli[[#This Row],[TIPO DI PROGETTO]],Parametri[TIPO DI PROGETTO],0),MATCH(Dettagli[[#Headers],[AVVOCATO D''IMPRESA]],Parametri[#Headers],0))*INDEX('PARAMETRI DEL PROGETTO'!$B$12:$H$12,1,MATCH(Dettagli[[#Headers],[AVVOCATO D''IMPRESA]],Parametri[#Headers],0))*Dettagli[[#This Row],[LAVORO STIMATO]]","v":{"v":20000,"d":"€ 20,000"}},{"$f":"INDEX(Parametri[],MATCH(Dettagli[[#This Row],[TIPO DI PROGETTO]],Parametri[TIPO DI PROGETTO],0),MATCH(Dettagli[[#Headers],[DIFENSORE CAUSE CIVILI]],Parametri[#Headers],0))*INDEX('PARAMETRI DEL PROGETTO'!$B$12:$H$12,1,MATCH(Dettagli[[#Headers],[DIFENSORE CAUSE CIVILI]],Parametri[#Headers],0))*Dettagli[[#This Row],[LAVORO STIMATO]]","v":{"v":0,"d":"€ 0"}},{"$f":"INDEX(Parametri[],MATCH(Dettagli[[#This Row],[TIPO DI PROGETTO]],Parametri[TIPO DI PROGETTO],0),MATCH(Dettagli[[#Headers],[AVVOCATO PROPRIETÀ INTELLETTUALE]],Parametri[#Headers],0))*INDEX('PARAMETRI DEL PROGETTO'!$B$12:$H$12,1,MATCH(Dettagli[[#Headers],[AVVOCATO PROPRIETÀ INTELLETTUALE]],Parametri[#Headers],0))*Dettagli[[#This Row],[LAVORO STIMATO]]","v":{"v":0,"d":"€ 0"}},{"$f":"INDEX(Parametri[],MATCH(Dettagli[[#This Row],[TIPO DI PROGETTO]],Parametri[TIPO DI PROGETTO],0),MATCH(Dettagli[[#Headers],[FALLIMENTARISTA]],Parametri[#Headers],0))*INDEX('PARAMETRI DEL PROGETTO'!$B$12:$H$12,1,MATCH(Dettagli[[#Headers],[FALLIMENTARISTA]],Parametri[#Headers],0))*Dettagli[[#This Row],[LAVORO STIMATO]]","v":{"v":0,"d":"€ 0"}},{"$f":"INDEX(Parametri[],MATCH(Dettagli[[#This Row],[TIPO DI PROGETTO]],Parametri[TIPO DI PROGETTO],0),MATCH(Dettagli[[#Headers],[PERSONALE AMMINISTRATIVO]],Parametri[#Headers],0))*INDEX('PARAMETRI DEL PROGETTO'!$B$12:$H$12,1,MATCH(Dettagli[[#Headers],[PERSONALE AMMINISTRATIVO]],Parametri[#Headers],0))*Dettagli[[#This Row],[LAVORO STIMATO]]","v":{"v":12500,"d":"€ 12,500"}},{"$f":"INDEX(Parametri[],MATCH(Dettagli[[#This Row],[TIPO DI PROGETTO]],Parametri[TIPO DI PROGETTO],0),MATCH(Dettagli[[#Headers],[PARTNER GENERALE]],Parametri[#Headers],0))*INDEX('PARAMETRI DEL PROGETTO'!$B$12:$H$12,1,MATCH(Dettagli[[#Headers],[PARTNER GENERALE]],Parametri[#Headers],0))*Dettagli[[#This Row],[LAVORO EFFETTIVO]]","v":{"v":7700,"d":"€ 7,700"}},{"$f":"INDEX(Parametri[],MATCH(Dettagli[[#This Row],[TIPO DI PROGETTO]],Parametri[TIPO DI PROGETTO],0),MATCH(Dettagli[[#Headers],[AVVOCATO D''IMPRESA]],Parametri[#Headers],0))*INDEX('PARAMETRI DEL PROGETTO'!$B$12:$H$12,1,MATCH(Dettagli[[#Headers],[AVVOCATO D''IMPRESA]],Parametri[#Headers],0))*Dettagli[[#This Row],[LAVORO EFFETTIVO]]","v":{"v":22000,"d":"€ 22,000"}},{"$f":"INDEX(Parametri[],MATCH(Dettagli[[#This Row],[TIPO DI PROGETTO]],Parametri[TIPO DI PROGETTO],0),MATCH(Dettagli[[#Headers],[DIFENSORE CAUSE CIVILI]],Parametri[#Headers],0))*INDEX('PARAMETRI DEL PROGETTO'!$B$12:$H$12,1,MATCH(Dettagli[[#Headers],[DIFENSORE CAUSE CIVILI]],Parametri[#Headers],0))*Dettagli[[#This Row],[LAVORO EFFETTIVO]]","v":{"v":0,"d":"€ 0"}},{"$f":"INDEX(Parametri[],MATCH(Dettagli[[#This Row],[TIPO DI PROGETTO]],Parametri[TIPO DI PROGETTO],0),MATCH(Dettagli[[#Headers],[AVVOCATO PROPRIETÀ INTELLETTUALE]],Parametri[#Headers],0))*INDEX('PARAMETRI DEL PROGETTO'!$B$12:$H$12,1,MATCH(Dettagli[[#Headers],[AVVOCATO PROPRIETÀ INTELLETTUALE]],Parametri[#Headers],0))*Dettagli[[#This Row],[LAVORO EFFETTIVO]]","v":{"v":0,"d":"€ 0"}},{"$f":"INDEX(Parametri[],MATCH(Dettagli[[#This Row],[TIPO DI PROGETTO]],Parametri[TIPO DI PROGETTO],0),MATCH(Dettagli[[#Headers],[FALLIMENTARISTA]],Parametri[#Headers],0))*INDEX('PARAMETRI DEL PROGETTO'!$B$12:$H$12,1,MATCH(Dettagli[[#Headers],[FALLIMENTARISTA]],Parametri[#Headers],0))*Dettagli[[#This Row],[LAVORO EFFETTIVO]]","v":{"v":0,"d":"€ 0"}},{"$f":"INDEX(Parametri[],MATCH(Dettagli[[#This Row],[TIPO DI PROGETTO]],Parametri[TIPO DI PROGETTO],0),MATCH(Dettagli[[#Headers],[PERSONALE AMMINISTRATIVO]],Parametri[#Headers],0))*INDEX('PARAMETRI DEL PROGETTO'!$B$12:$H$12,1,MATCH(Dettagli[[#Headers],[PERSONALE AMMINISTRATIVO]],Parametri[#Headers],0))*Dettagli[[#This Row],[LAVORO EFFETTIVO]]","v":{"v":13750,"d":"€ 13,750"}}]
[null,"Pesci rossi","Acquisizione aziendale",{"$f":"TODAY()+30","v":"2023-04-29"},{"$f":"TODAY()+100","v":"2023-07-08"},{"$f":"TODAY()+40","v":"2023-05-09"},{"$f":"TODAY()+110","v":"2023-07-18"},400,390,{"$f":"DAYS360(Dettagli[[#This Row],[INIZIO STIMATO]],Dettagli[[#This Row],[FINE STIMATA]],FALSE)","v":69},{"$f":"DAYS360(Dettagli[[#This Row],[INIZIO EFFETTIVO]],Dettagli[[#This Row],[FINE EFFETTIVA]],FALSE)","v":69},{"$f":"INDEX(Parametri[],MATCH(Dettagli[[#This Row],[TIPO DI PROGETTO]],Parametri[TIPO DI PROGETTO],0),MATCH(Dettagli[[#Headers],[PARTNER GENERALE]],Parametri[#Headers],0))*INDEX('PARAMETRI DEL PROGETTO'!$B$12:$H$12,1,MATCH(Dettagli[[#Headers],[PARTNER GENERALE]],Parametri[#Headers],0))*Dettagli[[#This Row],[LAVORO STIMATO]]","v":{"v":14000,"d":"€ 14,000"}},{"$f":"INDEX(Parametri[],MATCH(Dettagli[[#This Row],[TIPO DI PROGETTO]],Parametri[TIPO DI PROGETTO],0),MATCH(Dettagli[[#Headers],[AVVOCATO D''IMPRESA]],Parametri[#Headers],0))*INDEX('PARAMETRI DEL PROGETTO'!$B$12:$H$12,1,MATCH(Dettagli[[#Headers],[AVVOCATO D''IMPRESA]],Parametri[#Headers],0))*Dettagli[[#This Row],[LAVORO STIMATO]]","v":{"v":40000,"d":"€ 40,000"}},{"$f":"INDEX(Parametri[],MATCH(Dettagli[[#This Row],[TIPO DI PROGETTO]],Parametri[TIPO DI PROGETTO],0),MATCH(Dettagli[[#Headers],[DIFENSORE CAUSE CIVILI]],Parametri[#Headers],0))*INDEX('PARAMETRI DEL PROGETTO'!$B$12:$H$12,1,MATCH(Dettagli[[#Headers],[DIFENSORE CAUSE CIVILI]],Parametri[#Headers],0))*Dettagli[[#This Row],[LAVORO STIMATO]]","v":{"v":0,"d":"€ 0"}},{"$f":"INDEX(Parametri[],MATCH(Dettagli[[#This Row],[TIPO DI PROGETTO]],Parametri[TIPO DI PROGETTO],0),MATCH(Dettagli[[#Headers],[AVVOCATO PROPRIETÀ INTELLETTUALE]],Parametri[#Headers],0))*INDEX('PARAMETRI DEL PROGETTO'!$B$12:$H$12,1,MATCH(Dettagli[[#Headers],[AVVOCATO PROPRIETÀ INTELLETTUALE]],Parametri[#Headers],0))*Dettagli[[#This Row],[LAVORO STIMATO]]","v":{"v":11000,"d":"€ 11,000"}},{"$f":"INDEX(Parametri[],MATCH(Dettagli[[#This Row],[TIPO DI PROGETTO]],Parametri[TIPO DI PROGETTO],0),MATCH(Dettagli[[#Headers],[FALLIMENTARISTA]],Parametri[#Headers],0))*INDEX('PARAMETRI DEL PROGETTO'!$B$12:$H$12,1,MATCH(Dettagli[[#Headers],[FALLIMENTARISTA]],Parametri[#Headers],0))*Dettagli[[#This Row],[LAVORO STIMATO]]","v":{"v":0,"d":"€ 0"}},{"$f":"INDEX(Parametri[],MATCH(Dettagli[[#This Row],[TIPO DI PROGETTO]],Parametri[TIPO DI PROGETTO],0),MATCH(Dettagli[[#Headers],[PERSONALE AMMINISTRATIVO]],Parametri[#Headers],0))*INDEX('PARAMETRI DEL PROGETTO'!$B$12:$H$12,1,MATCH(Dettagli[[#Headers],[PERSONALE AMMINISTRATIVO]],Parametri[#Headers],0))*Dettagli[[#This Row],[LAVORO STIMATO]]","v":{"v":20000,"d":"€ 20,000"}},{"$f":"INDEX(Parametri[],MATCH(Dettagli[[#This Row],[TIPO DI PROGETTO]],Parametri[TIPO DI PROGETTO],0),MATCH(Dettagli[[#Headers],[PARTNER GENERALE]],Parametri[#Headers],0))*INDEX('PARAMETRI DEL PROGETTO'!$B$12:$H$12,1,MATCH(Dettagli[[#Headers],[PARTNER GENERALE]],Parametri[#Headers],0))*Dettagli[[#This Row],[LAVORO EFFETTIVO]]","v":{"v":13650,"d":"€ 13,650"}},{"$f":"INDEX(Parametri[],MATCH(Dettagli[[#This Row],[TIPO DI PROGETTO]],Parametri[TIPO DI PROGETTO],0),MATCH(Dettagli[[#Headers],[AVVOCATO D''IMPRESA]],Parametri[#Headers],0))*INDEX('PARAMETRI DEL PROGETTO'!$B$12:$H$12,1,MATCH(Dettagli[[#Headers],[AVVOCATO D''IMPRESA]],Parametri[#Headers],0))*Dettagli[[#This Row],[LAVORO EFFETTIVO]]","v":{"v":39000,"d":"€ 39,000"}},{"$f":"INDEX(Parametri[],MATCH(Dettagli[[#This Row],[TIPO DI PROGETTO]],Parametri[TIPO DI PROGETTO],0),MATCH(Dettagli[[#Headers],[DIFENSORE CAUSE CIVILI]],Parametri[#Headers],0))*INDEX('PARAMETRI DEL PROGETTO'!$B$12:$H$12,1,MATCH(Dettagli[[#Headers],[DIFENSORE CAUSE CIVILI]],Parametri[#Headers],0))*Dettagli[[#This Row],[LAVORO EFFETTIVO]]","v":{"v":0,"d":"€ 0"}},{"$f":"INDEX(Parametri[],MATCH(Dettagli[[#This Row],[TIPO DI PROGETTO]],Parametri[TIPO DI PROGETTO],0),MATCH(Dettagli[[#Headers],[AVVOCATO PROPRIETÀ INTELLETTUALE]],Parametri[#Headers],0))*INDEX('PARAMETRI DEL PROGETTO'!$B$12:$H$12,1,MATCH(Dettagli[[#Headers],[AVVOCATO PROPRIETÀ INTELLETTUALE]],Parametri[#Headers],0))*Dettagli[[#This Row],[LAVORO EFFETTIVO]]","v":{"v":10725,"d":"€ 10,725"}},{"$f":"INDEX(Parametri[],MATCH(Dettagli[[#This Row],[TIPO DI PROGETTO]],Parametri[TIPO DI PROGETTO],0),MATCH(Dettagli[[#Headers],[FALLIMENTARISTA]],Parametri[#Headers],0))*INDEX('PARAMETRI DEL PROGETTO'!$B$12:$H$12,1,MATCH(Dettagli[[#Headers],[FALLIMENTARISTA]],Parametri[#Headers],0))*Dettagli[[#This Row],[LAVORO EFFETTIVO]]","v":{"v":0,"d":"€ 0"}},{"$f":"INDEX(Parametri[],MATCH(Dettagli[[#This Row],[TIPO DI PROGETTO]],Parametri[TIPO DI PROGETTO],0),MATCH(Dettagli[[#Headers],[PERSONALE AMMINISTRATIVO]],Parametri[#Headers],0))*INDEX('PARAMETRI DEL PROGETTO'!$B$12:$H$12,1,MATCH(Dettagli[[#Headers],[PERSONALE AMMINISTRATIVO]],Parametri[#Headers],0))*Dettagli[[#This Row],[LAVORO EFFETTIVO]]","v":{"v":19500,"d":"€ 19,500"}}]
[null,"Cobalto","Difesa per responsabilità prodotto",{"$f":"TODAY()+150","v":"2023-08-27"},{"$f":"TODAY()+150","v":"2023-08-27"},{"$f":"TODAY()+150","v":"2023-08-27"},{"$f":"TODAY()+170","v":"2023-09-16"},500,500,{"$f":"DAYS360(Dettagli[[#This Row],[INIZIO STIMATO]],Dettagli[[#This Row],[FINE STIMATA]],FALSE)","v":0},{"$f":"DAYS360(Dettagli[[#This Row],[INIZIO EFFETTIVO]],Dettagli[[#This Row],[FINE EFFETTIVA]],FALSE)","v":19},{"$f":"INDEX(Parametri[],MATCH(Dettagli[[#This Row],[TIPO DI PROGETTO]],Parametri[TIPO DI PROGETTO],0),MATCH(Dettagli[[#Headers],[PARTNER GENERALE]],Parametri[#Headers],0))*INDEX('PARAMETRI DEL PROGETTO'!$B$12:$H$12,1,MATCH(Dettagli[[#Headers],[PARTNER GENERALE]],Parametri[#Headers],0))*Dettagli[[#This Row],[LAVORO STIMATO]]","v":{"v":35000,"d":"€ 35,000"}},{"$f":"INDEX(Parametri[],MATCH(Dettagli[[#This Row],[TIPO DI PROGETTO]],Parametri[TIPO DI PROGETTO],0),MATCH(Dettagli[[#Headers],[AVVOCATO D''IMPRESA]],Parametri[#Headers],0))*INDEX('PARAMETRI DEL PROGETTO'!$B$12:$H$12,1,MATCH(Dettagli[[#Headers],[AVVOCATO D''IMPRESA]],Parametri[#Headers],0))*Dettagli[[#This Row],[LAVORO STIMATO]]","v":{"v":0,"d":"€ 0"}},{"$f":"INDEX(Parametri[],MATCH(Dettagli[[#This Row],[TIPO DI PROGETTO]],Parametri[TIPO DI PROGETTO],0),MATCH(Dettagli[[#Headers],[DIFENSORE CAUSE CIVILI]],Parametri[#Headers],0))*INDEX('PARAMETRI DEL PROGETTO'!$B$12:$H$12,1,MATCH(Dettagli[[#Headers],[DIFENSORE CAUSE CIVILI]],Parametri[#Headers],0))*Dettagli[[#This Row],[LAVORO STIMATO]]","v":{"v":75000,"d":"€ 75,000"}},{"$f":"INDEX(Parametri[],MATCH(Dettagli[[#This Row],[TIPO DI PROGETTO]],Parametri[TIPO DI PROGETTO],0),MATCH(Dettagli[[#Headers],[AVVOCATO PROPRIETÀ INTELLETTUALE]],Parametri[#Headers],0))*INDEX('PARAMETRI DEL PROGETTO'!$B$12:$H$12,1,MATCH(Dettagli[[#Headers],[AVVOCATO PROPRIETÀ INTELLETTUALE]],Parametri[#Headers],0))*Dettagli[[#This Row],[LAVORO STIMATO]]","v":{"v":0,"d":"€ 0"}},{"$f":"INDEX(Parametri[],MATCH(Dettagli[[#This Row],[TIPO DI PROGETTO]],Parametri[TIPO DI PROGETTO],0),MATCH(Dettagli[[#Headers],[FALLIMENTARISTA]],Parametri[#Headers],0))*INDEX('PARAMETRI DEL PROGETTO'!$B$12:$H$12,1,MATCH(Dettagli[[#Headers],[FALLIMENTARISTA]],Parametri[#Headers],0))*Dettagli[[#This Row],[LAVORO STIMATO]]","v":{"v":0,"d":"€ 0"}},{"$f":"INDEX(Parametri[],MATCH(Dettagli[[#This Row],[TIPO DI PROGETTO]],Parametri[TIPO DI PROGETTO],0),MATCH(Dettagli[[#Headers],[PERSONALE AMMINISTRATIVO]],Parametri[#Headers],0))*INDEX('PARAMETRI DEL PROGETTO'!$B$12:$H$12,1,MATCH(Dettagli[[#Headers],[PERSONALE AMMINISTRATIVO]],Parametri[#Headers],0))*Dettagli[[#This Row],[LAVORO STIMATO]]","v":{"v":18750,"d":"€ 18,750"}},{"$f":"INDEX(Parametri[],MATCH(Dettagli[[#This Row],[TIPO DI PROGETTO]],Parametri[TIPO DI PROGETTO],0),MATCH(Dettagli[[#Headers],[PARTNER GENERALE]],Parametri[#Headers],0))*INDEX('PARAMETRI DEL PROGETTO'!$B$12:$H$12,1,MATCH(Dettagli[[#Headers],[PARTNER GENERALE]],Parametri[#Headers],0))*Dettagli[[#This Row],[LAVORO EFFETTIVO]]","v":{"v":35000,"d":"€ 35,000"}},{"$f":"INDEX(Parametri[],MATCH(Dettagli[[#This Row],[TIPO DI PROGETTO]],Parametri[TIPO DI PROGETTO],0),MATCH(Dettagli[[#Headers],[AVVOCATO D''IMPRESA]],Parametri[#Headers],0))*INDEX('PARAMETRI DEL PROGETTO'!$B$12:$H$12,1,MATCH(Dettagli[[#Headers],[AVVOCATO D''IMPRESA]],Parametri[#Headers],0))*Dettagli[[#This Row],[LAVORO EFFETTIVO]]","v":{"v":0,"d":"€ 0"}},{"$f":"INDEX(Parametri[],MATCH(Dettagli[[#This Row],[TIPO DI PROGETTO]],Parametri[TIPO DI PROGETTO],0),MATCH(Dettagli[[#Headers],[DIFENSORE CAUSE CIVILI]],Parametri[#Headers],0))*INDEX('PARAMETRI DEL PROGETTO'!$B$12:$H$12,1,MATCH(Dettagli[[#Headers],[DIFENSORE CAUSE CIVILI]],Parametri[#Headers],0))*Dettagli[[#This Row],[LAVORO EFFETTIVO]]","v":{"v":75000,"d":"€ 75,000"}},{"$f":"INDEX(Parametri[],MATCH(Dettagli[[#This Row],[TIPO DI PROGETTO]],Parametri[TIPO DI PROGETTO],0),MATCH(Dettagli[[#Headers],[AVVOCATO PROPRIETÀ INTELLETTUALE]],Parametri[#Headers],0))*INDEX('PARAMETRI DEL PROGETTO'!$B$12:$H$12,1,MATCH(Dettagli[[#Headers],[AVVOCATO PROPRIETÀ INTELLETTUALE]],Parametri[#Headers],0))*Dettagli[[#This Row],[LAVORO EFFETTIVO]]","v":{"v":0,"d":"€ 0"}},{"$f":"INDEX(Parametri[],MATCH(Dettagli[[#This Row],[TIPO DI PROGETTO]],Parametri[TIPO DI PROGETTO],0),MATCH(Dettagli[[#Headers],[FALLIMENTARISTA]],Parametri[#Headers],0))*INDEX('PARAMETRI DEL PROGETTO'!$B$12:$H$12,1,MATCH(Dettagli[[#Headers],[FALLIMENTARISTA]],Parametri[#Headers],0))*Dettagli[[#This Row],[LAVORO EFFETTIVO]]","v":{"v":0,"d":"€ 0"}},{"$f":"INDEX(Parametri[],MATCH(Dettagli[[#This Row],[TIPO DI PROGETTO]],Parametri[TIPO DI PROGETTO],0),MATCH(Dettagli[[#Headers],[PERSONALE AMMINISTRATIVO]],Parametri[#Headers],0))*INDEX('PARAMETRI DEL PROGETTO'!$B$12:$H$12,1,MATCH(Dettagli[[#Headers],[PERSONALE AMMINISTRATIVO]],Parametri[#Headers],0))*Dettagli[[#This Row],[LAVORO EFFETTIVO]]","v":{"v":18750,"d":"€ 18,750"}}]
[null,"Iris","Domanda di brevetto",{"$f":"TODAY()+200","v":"2023-10-16"},{"$f":"TODAY()+230","v":"2023-11-15"},{"$f":"TODAY()+230","v":"2023-11-15"},{"$f":"TODAY()+230","v":"2023-11-15"},150,145,{"$f":"DAYS360(Dettagli[[#This Row],[INIZIO STIMATO]],Dettagli[[#This Row],[FINE STIMATA]],FALSE)","v":29},{"$f":"DAYS360(Dettagli[[#This Row],[INIZIO EFFETTIVO]],Dettagli[[#This Row],[FINE EFFETTIVA]],FALSE)","v":0},{"$f":"INDEX(Parametri[],MATCH(Dettagli[[#This Row],[TIPO DI PROGETTO]],Parametri[TIPO DI PROGETTO],0),MATCH(Dettagli[[#Headers],[PARTNER GENERALE]],Parametri[#Headers],0))*INDEX('PARAMETRI DEL PROGETTO'!$B$12:$H$12,1,MATCH(Dettagli[[#Headers],[PARTNER GENERALE]],Parametri[#Headers],0))*Dettagli[[#This Row],[LAVORO STIMATO]]","v":{"v":5250,"d":"€ 5,250"}},{"$f":"INDEX(Parametri[],MATCH(Dettagli[[#This Row],[TIPO DI PROGETTO]],Parametri[TIPO DI PROGETTO],0),MATCH(Dettagli[[#Headers],[AVVOCATO D''IMPRESA]],Parametri[#Headers],0))*INDEX('PARAMETRI DEL PROGETTO'!$B$12:$H$12,1,MATCH(Dettagli[[#Headers],[AVVOCATO D''IMPRESA]],Parametri[#Headers],0))*Dettagli[[#This Row],[LAVORO STIMATO]]","v":{"v":0,"d":"€ 0"}},{"$f":"INDEX(Parametri[],MATCH(Dettagli[[#This Row],[TIPO DI PROGETTO]],Parametri[TIPO DI PROGETTO],0),MATCH(Dettagli[[#Headers],[DIFENSORE CAUSE CIVILI]],Parametri[#Headers],0))*INDEX('PARAMETRI DEL PROGETTO'!$B$12:$H$12,1,MATCH(Dettagli[[#Headers],[DIFENSORE CAUSE CIVILI]],Parametri[#Headers],0))*Dettagli[[#This Row],[LAVORO STIMATO]]","v":{"v":0,"d":"€ 0"}},{"$f":"INDEX(Parametri[],MATCH(Dettagli[[#This Row],[TIPO DI PROGETTO]],Parametri[TIPO DI PROGETTO],0),MATCH(Dettagli[[#Headers],[AVVOCATO PROPRIETÀ INTELLETTUALE]],Parametri[#Headers],0))*INDEX('PARAMETRI DEL PROGETTO'!$B$12:$H$12,1,MATCH(Dettagli[[#Headers],[AVVOCATO PROPRIETÀ INTELLETTUALE]],Parametri[#Headers],0))*Dettagli[[#This Row],[LAVORO STIMATO]]","v":{"v":24750,"d":"€ 24,750"}},{"$f":"INDEX(Parametri[],MATCH(Dettagli[[#This Row],[TIPO DI PROGETTO]],Parametri[TIPO DI PROGETTO],0),MATCH(Dettagli[[#Headers],[FALLIMENTARISTA]],Parametri[#Headers],0))*INDEX('PARAMETRI DEL PROGETTO'!$B$12:$H$12,1,MATCH(Dettagli[[#Headers],[FALLIMENTARISTA]],Parametri[#Headers],0))*Dettagli[[#This Row],[LAVORO STIMATO]]","v":{"v":0,"d":"€ 0"}},{"$f":"INDEX(Parametri[],MATCH(Dettagli[[#This Row],[TIPO DI PROGETTO]],Parametri[TIPO DI PROGETTO],0),MATCH(Dettagli[[#Headers],[PERSONALE AMMINISTRATIVO]],Parametri[#Headers],0))*INDEX('PARAMETRI DEL PROGETTO'!$B$12:$H$12,1,MATCH(Dettagli[[#Headers],[PERSONALE AMMINISTRATIVO]],Parametri[#Headers],0))*Dettagli[[#This Row],[LAVORO STIMATO]]","v":{"v":5625,"d":"€ 5,625"}},{"$f":"INDEX(Parametri[],MATCH(Dettagli[[#This Row],[TIPO DI PROGETTO]],Parametri[TIPO DI PROGETTO],0),MATCH(Dettagli[[#Headers],[PARTNER GENERALE]],Parametri[#Headers],0))*INDEX('PARAMETRI DEL PROGETTO'!$B$12:$H$12,1,MATCH(Dettagli[[#Headers],[PARTNER GENERALE]],Parametri[#Headers],0))*Dettagli[[#This Row],[LAVORO EFFETTIVO]]","v":{"v":5075,"d":"€ 5,075"}},{"$f":"INDEX(Parametri[],MATCH(Dettagli[[#This Row],[TIPO DI PROGETTO]],Parametri[TIPO DI PROGETTO],0),MATCH(Dettagli[[#Headers],[AVVOCATO D''IMPRESA]],Parametri[#Headers],0))*INDEX('PARAMETRI DEL PROGETTO'!$B$12:$H$12,1,MATCH(Dettagli[[#Headers],[AVVOCATO D''IMPRESA]],Parametri[#Headers],0))*Dettagli[[#This Row],[LAVORO EFFETTIVO]]","v":{"v":0,"d":"€ 0"}},{"$f":"INDEX(Parametri[],MATCH(Dettagli[[#This Row],[TIPO DI PROGETTO]],Parametri[TIPO DI PROGETTO],0),MATCH(Dettagli[[#Headers],[DIFENSORE CAUSE CIVILI]],Parametri[#Headers],0))*INDEX('PARAMETRI DEL PROGETTO'!$B$12:$H$12,1,MATCH(Dettagli[[#Headers],[DIFENSORE CAUSE CIVILI]],Parametri[#Headers],0))*Dettagli[[#This Row],[LAVORO EFFETTIVO]]","v":{"v":0,"d":"€ 0"}},{"$f":"INDEX(Parametri[],MATCH(Dettagli[[#This Row],[TIPO DI PROGETTO]],Parametri[TIPO DI PROGETTO],0),MATCH(Dettagli[[#Headers],[AVVOCATO PROPRIETÀ INTELLETTUALE]],Parametri[#Headers],0))*INDEX('PARAMETRI DEL PROGETTO'!$B$12:$H$12,1,MATCH(Dettagli[[#Headers],[AVVOCATO PROPRIETÀ INTELLETTUALE]],Parametri[#Headers],0))*Dettagli[[#This Row],[LAVORO EFFETTIVO]]","v":{"v":23925,"d":"€ 23,925"}},{"$f":"INDEX(Parametri[],MATCH(Dettagli[[#This Row],[TIPO DI PROGETTO]],Parametri[TIPO DI PROGETTO],0),MATCH(Dettagli[[#Headers],[FALLIMENTARISTA]],Parametri[#Headers],0))*INDEX('PARAMETRI DEL PROGETTO'!$B$12:$H$12,1,MATCH(Dettagli[[#Headers],[FALLIMENTARISTA]],Parametri[#Headers],0))*Dettagli[[#This Row],[LAVORO EFFETTIVO]]","v":{"v":0,"d":"€ 0"}},{"$f":"INDEX(Parametri[],MATCH(Dettagli[[#This Row],[TIPO DI PROGETTO]],Parametri[TIPO DI PROGETTO],0),MATCH(Dettagli[[#Headers],[PERSONALE AMMINISTRATIVO]],Parametri[#Headers],0))*INDEX('PARAMETRI DEL PROGETTO'!$B$12:$H$12,1,MATCH(Dettagli[[#Headers],[PERSONALE AMMINISTRATIVO]],Parametri[#Headers],0))*Dettagli[[#This Row],[LAVORO EFFETTIVO]]","v":{"v":5437.5,"d":"€ 5,438"}}]
{"$rows_left_out":3}
{"sheet":"VALORI TOTALI DEL PROGETTO","index":3,"n_rows":11,"n_cols":14,"rows_kept":11,"merged":[[3,2,3,7],[3,8,3,13]]}
[null,{"$f":"'PARAMETRI DEL PROGETTO'!B1","v":"Mitchell, Morris, Ward & Cook"}]
[null,{"$f":"'PARAMETRI DEL PROGETTO'!B2","v":"Pianificazione progetto per studi legali"}]
[null,{"$f":"'PARAMETRI DEL PROGETTO'!B3","v":"Mitchell, Morris, Ward & Cook Riservato"}]
[null,null,"IMPORTI STIMATI",{"$nulls":5},"IMPORTI EFFETTIVI"]
[null,"NOME PROGETTO","PARTNER GENERALE ","AVVOCATO D'IMPRESA ","DIFENSORE CAUSE CIVILI ","AVVOCATO PROPRIETÀ INTELLETTUALE ","FALLIMENTARISTA ","PERSONALE AMMINISTRATIVO ","PARTNER GENERALE  ","AVVOCATO D'IMPRESA  ","DIFENSORE CAUSE CIVILI  ","AVVOCATO PROPRIETÀ INTELLETTUALE  ","FALLIMENTARISTA   ","PERSONALE AMMINISTRATIVO  "]
[null,"Europa",{"v":7000,"d":"€ 7,000.00"},{"v":20000,"d":"€ 20,000.00"},{"v":0,"d":"€ 0.00"},{"v":0,"d":"€ 0.00"},{"v":0,"d":"€ 0.00"},{"v":12500,"d":"€ 12,500.00"},{"v":7700,"d":"€ 7,700.00"},{"v":22000,"d":"€ 22,000.00"},{"v":0,"d":"€ 0.00"},{"v":0,"d":"€ 0.00"},{"v":0,"d":"€ 0.00"},{"v":13750,"d":"€ 13,750.00"}]
[null,"Pesci rossi",{"v":14000,"d":"€ 14,000.00"},{"v":40000,"d":"€ 40,000.00"},{"v":0,"d":"€ 0.00"},{"v":11000,"d":"€ 11,000.00"},{"v":0,"d":"€ 0.00"},{"v":20000,"d":"€ 20,000.00"},{"v":13650,"d":"€ 13,650.00"},{"v":39000,"d":"€ 39,000.00"},{"v":0,"d":"€ 0.00"},{"v":10725,"d":"€ 10,725.00"},{"v":0,"d":"€ 0.00"},{"v":19500,"d":"€ 19,500.00"}]
[null,"Cobalto",{"v":35000,"d":"€ 35,000.00"},{"v":0,"d":"€ 0.00"},{"v":75000,"d":"€ 75,000.00"},{"v":0,"d":"€ 0.00"},{"v":0,"d":"€ 0.00"},{"v":18750,"d":"€ 18,750.00"},{"v":35000,"d":"€ 35,000.00"},{"v":0,"d":"€ 0.00"},{"v":75000,"d":"€ 75,000.00"},{"v":0,"d":"€ 0.00"},{"v":0,"d":"€ 0.00"},{"v":18750,"d":"€ 18,750.00"}]
{"$rows_left_out":3}