{"text_format":"3","workbook":"xlsx","n_sheets":3,"sheets":["Valore netto personale","Attività","Debiti"],"not_rendered":{"charts":2,"defined_names":1},"read":"whole","date_system":"1900"}

{"sheet":"Valore netto personale","index":0,"n_rows":19,"n_cols":21,"rows_kept":19,"merged":[[0,2,0,9],[2,2,2,4],[3,2,3,4],[8,2,8,4]]}
[{"$nulls":12},"Disponibilità liquide",{"$f":"SUMIF(TBL_Attività[Categoria],'Valore netto personale'!M1,TBL_Attività[Valore])+ROW(M1)/10000","v":42500.0001},{"$f":"_xlfn.RANK.EQ(N1,$N$1:$N$5,0)","v":5},null,{"$f":"INDEX($M$1:$N$5,MATCH(5,$O$1:$O$5,0),1)","v":"Disponibilità liquide"},{"$f":"ROUND(INDEX($M$1:$N$5,MATCH(5,$O$1:$O$5,0),2),2)","v":42500},null,"Totale attività",{"$f":"SUM(TBL_Attività[Valore])","v":1923500}]
[{"$nulls":12},"Proprietà",{"$f":"SUMIF(TBL_Attività[Categoria],'Valore netto personale'!M2,TBL_Attività[Valore])+ROW(M2)/10000","v":1205000.0002},{"$f":"_xlfn.RANK.EQ(N2,$N$1:$N$5,0)","v":1},null,{"$f":"INDEX($M$1:$N$5,MATCH(4,$O$1:$O$5,0),1)","v":"Risparmi per la pensione"},{"$f":"ROUND(INDEX($M$1:$N$5,MATCH(4,$O$1:$O$5,0),2),2)","v":98000},null,"Totale passività",{"$f":"SUM(TBL_Debiti[Valore])","v":652500}]
[null,null,"PATRIMONIO NETTO PERSONALE",{"$nulls":3},"ASSET E DEBITI",{"$nulls":5},"Investimenti",{"$f":"SUMIF(TBL_Attività[Categoria],'Valore netto personale'!M3,TBL_Attività[Valore])+ROW(M3)/10000","v":475000.0003},{"$f":"_xlfn.RANK.EQ(N3,$N$1:$N$5,0)","v":2},null,{"$f":"INDEX($M$1:$N$5,MATCH(3,$O$1:$O$5,0),1)","v":"Assicurazione vita"},{"$f":"ROUND(INDEX($M$1:$N$5,MATCH(3,$O$1:$O$5,0),2),2)","v":103000}]
[null,null,{"$f":"E5-E7","v":{"v":1271000,"d":"1,271,000 €"}},{"$nulls":9},"Risparmi per la pensione",{"$f":"SUMIF(TBL_Attività[Categoria],'Valore netto personale'!M4,TBL_Attività[Valore])+ROW(M4)/10000","v":98000.0004},{"$f":"_xlfn.RANK.EQ(N4,$N$1:$N$5,0)","v":4},null,{"$f":"INDEX($M$1:$N$5,MATCH(2,$O$1:$O$5,0),1)","v":"Investimenti"},{"$f":"ROUND(INDEX($M$1:$N$5,MATCH(2,$O$1:$O$5,0),2),2)","v":475000}]
[{"$nulls":3},"Asset totali",{"$f":"SUM(TBL_Attività[Valore])","v":{"v":1923500,"d":"1,923,500 €"}},{"$nulls":7},"Assicurazione vita",{"$f":"SUMIF(TBL_Attività[Categoria],'Valore netto personale'!M5,TBL_Attività[Valore])+ROW(M5)/10000","v":103000.0005},{"$f":"_xlfn.RANK.EQ(N5,$N$1:$N$5,0)","v":3},null,{"$f":"INDEX($M$1:$N$5,MATCH(1,$O$1:$O$5,0),1)","v":"Proprietà"},{"$f":"ROUND(INDEX($M$1:$N$5,MATCH(1,$O$1:$O$5,0),2),2)","v":1205000}]
[]
[{"$nulls":3},"Debiti totali",{"$f":"SUM(TBL_Debiti[Valore])","v":{"v":652500,"d":"652,500 €"}}]
[]
[null,null,"RIEPILOGO ASSET"]
[]
[{"$nulls":7},{"$f":"Q5","v":"Proprietà"},{"$f":"R5","v":{"v":1205000,"d":"1,205,000 €"}}]
[]
[{"$nulls":7},{"$f":"Q4","v":"Investimenti"},{"$f":"R4","v":{"v":475000,"d":"475,000 €"}}]
[]
[{"$nulls":7},{"$f":"Q3","v":"Assicurazione vita"},{"$f":"R3","v":{"v":103000,"d":"103,000 €"}}]
[]
[{"$nulls":7},{"$f":"Q2","v":"Risparmi per la pensione"},{"$f":"R2","v":{"v":98000,"d":"98,000 €"}}]
[]
[{"$nulls":7},{"$f":"Q1","v":"Disponibilità liquide"},{"$f":"R1","v":{"v":42500,"d":"42,500 €"}}]

{"sheet":"Attività","index":1,"n_rows":24,"n_cols":5,"rows_kept":24,"merged":[[1,1,1,3]]}
[{"$nulls":4}," "]
[null,"ATTIVITÀ"]
[null,"Categoria","Elemento","Valore"]
[null,"Proprietà","Casa",{"v":560000,"d":"€ 560,000.00"}]
[null,"Proprietà","Altro",{"v":255000,"d":"€ 255,000.00"}]
[null,"Risparmi per la pensione","Fondi pensione",{"v":98000,"d":"€ 98,000.00"}]
[null,"Investimenti","Azioni",{"v":53000,"d":"€ 53,000.00"}]
[null,"Investimenti","Obbligazioni",{"v":25000,"d":"€ 25,000.00"}]
[null,"Investimenti","Fondi comuni",{"v":33000,"d":"€ 33,000.00"}]
[null,"Investimenti","CD",{"v":74000,"d":"€ 74,000.00"}]
[null,"Investimenti","Metalli preziosi",{"v":20000,"d":"€ 20,000.00"}]
[null,"Investimenti","Fondi fiduciari",{"v":250000,"d":"€ 250,000.00"}]
[null,"Assicurazione vita","Fondo per assistenza sanitaria",{"v":18000,"d":"€ 18,000.00"}]
[null,"Assicurazione vita","Valore nominale della polizza di assicurazione sulla vita",{"v":85000,"d":"€ 85,000.00"}]
[null,"Investimenti","Altro",{"v":20000,"d":"€ 20,000.00"}]
[null,"Disponibilità liquide","Conti correnti",{"v":35500,"d":"€ 35,500.00"}]
[null,"Disponibilità liquide","Conti di risparmio",{"v":5000,"d":"€ 5,000.00"}]
[null,"Disponibilità liquide","Altro",{"v":2000,"d":"€ 2,000.00"}]
[null,"Proprietà","Automobili",{"v":55000,"d":"€ 55,000.00"}]
[null,"Proprietà","Altri veicoli",{"v":85000,"d":"€ 85,000.00"}]
[null,"Proprietà","Arredamento",{"v":100000,"d":"€ 100,000.00"}]
[null,"Proprietà","Pezzi da collezione",{"v":50000,"d":"€ 50,000.00"}]
[null,"Proprietà","Gioielli",{"v":60000,"d":"€ 60,000.00"}]
[null,"Proprietà","Altri beni di lusso",{"v":40000,"d":"€ 40,000.00"}]

{"sheet":"Debiti","index":2,"n_rows":13,"n_cols":4,"rows_kept":13}
[{"$nulls":3}," "]
[null,"DEBITI"]
[null,"Categoria","Valore"]
[null,"Mutui",{"v":400000,"d":"€ 400,000.00"}]
[null,"Prestiti ipotecari",{"v":50000,"d":"€ 50,000.00"}]
[null,"Prestiti auto",{"v":30000,"d":"€ 30,000.00"}]
[null,"Prestiti personali",{"v":12500,"d":"€ 12,500.00"}]
[null,"Carte di credito",{"v":65000,"d":"€ 65,000.00"}]
[null,"Prestiti studenteschi",{"v":10000,"d":"€ 10,000.00"}]
[null,"Prestiti su investimenti",{"v":20000,"d":"€ 20,000.00"}]
[null,"Prestiti su assicurazione sulla vita",{"v":5000,"d":"€ 5,000.00"}]
[null,"Altri prestiti a rate",{"v":10000,"d":"€ 10,000.00"}]
[null,"Altri debiti",{"v":50000,"d":"€ 50,000.00"}]