{"text_format":"3","workbook":"xlsx","n_sheets":6,"sheets":["Home","Dettagli personali","Dettagli Viaggio","Hotel e attività","Noleggio auto","Dettagli emergenza"],"not_rendered":{"images":19,"defined_names":10},"read":"whole","date_system":"1900"}

{"sheet":"Home","index":0,"n_rows":34,"n_cols":22,"rows_kept":34,"merged":[[32,1,32,3],[32,6,32,8],[32,11,32,13],[32,16,32,18],[32,21,32,23],[33,1,33,3],[33,6,33,8],[33,11,33,13],[33,16,33,18],[33,21,33,23]]}
{"$rows_empty":32}
[null,{"$f":"VocePersonale/ContaPersonale","v":{"v":1,"d":"100%"}},{"$nulls":4},{"$f":"VoceViaggio/ContaViaggio","v":{"v":0.65,"d":"65%"}},{"$nulls":4},{"$f":"VoceHotel/ContaHotel","v":{"v":0.5384615384615384,"d":"54%"}},{"$nulls":4},{"$f":"IF('Noleggio auto'!D4=\"Sì\",VoceNoleggioAuto/ContaNoleggioAuto,1)","v":{"v":0.2857142857142857,"d":"29%"}},{"$nulls":4},{"$f":"VoceEmergenza/ContaEmergenza","v":{"v":0.625,"d":"63%"}}]
[null,{"$f":"TEXT(B33,\"0% \"\"completo\"\"\")","v":"100% completo"},{"$nulls":4},{"$f":"TEXT(G33,\"0% \"\"completo\"\"\")","v":"65% completo"},{"$nulls":4},{"$f":"TEXT(L33,\"0% \"\"completo\"\"\")","v":"54% completo"},{"$nulls":4},{"$f":"TEXT(Q33,\"0% \"\"completo\"\"\")","v":"29% completo"},{"$nulls":4},{"$f":"TEXT(V33,\"0% \"\"completo\"\"\")","v":"63% completo"}]

{"sheet":"Dettagli personali","index":1,"n_rows":11,"n_cols":5,"rows_kept":11,"merged":[[4,2,5,2],[4,3,5,3],[4,4,5,4],[7,2,8,2],[7,3,8,3],[7,4,8,4],[17,1,17,4]]}
[]
[]
[{"$f":"IF(COUNTA(B4:B8)<1,\"*\",\"\")","v":""},"Nome e cognome & diminutivi",{"$f":"IF(E3=\"\",1,\"\")","v":""},"Indirizzo abitazione","Via Martedì 123, Londra 01234"]
[null,"Michele Olivotto"]
[null,"Adriana Olivotto",{"$f":"IF(E5=\"\",1,\"\")","v":""},"Telefono abitazione",3455550123]
[null,"Nino P. Olivotto"]
[]
[null,null,{"$f":"IF((E8=0)+(E8=\"\"),1,\"\")","v":""},"Cellulari",3455550124]
[]
[]
[{"$f":"VocePersonale","v":3},{"$f":"IF(A11<>ContaPersonale,\"Dettagli importanti mancanti\",\"Dettagli importanti completi\")","v":"Dettagli importanti completi"}]

{"sheet":"Dettagli Viaggio","index":2,"n_rows":18,"n_cols":6,"rows_kept":18,"merged":[[23,1,23,5]]}
[]
[]
[null,"Dettagli della partenza",null,null,"Dettagli del ritorno"]
[{"$f":"IF(C4=\"\",1,\"\")","v":""},"Data",{"$f":"TODAY()+45","v":"2013-01-17"},{"$f":"IF(F4=\"\",1,\"\")","v":""},"Data",{"$f":"TODAY()+51","v":"2013-01-23"}]
[{"$f":"IF(C5=\"\",1,\"\")","v":""},"Compagnia aerea","Blue Yonder Airlines","","Compagnia aerea","Blue Yonder Airlines"]
[{"$f":"IF(C6=\"\",1,\"\")","v":""},"Numero volo","WS192",1,"Numero volo"]
[{"$f":"IF(C7=\"\",1,\"\")","v":""},"Da","Londra","","Da","Milano"]
[{"$f":"IF(C8=\"\",1,\"\")","v":""},"Orario partenza","12:30:00",1,"Orario partenza"]
[null,"Terminal/uscita partenza",null,1,"Terminal/uscita partenza"]
[{"$f":"IF(C10=\"\",1,\"\")","v":""},"A","Milano",1,"A"]
[{"$f":"IF(C11=\"\",1,\"\")","v":""},"Orario arrivo","12:32:00",1,"Orario arrivo"]
[null,"Durata del volo","2 ore",null,"Durata del volo"]
[{"$f":"IF(C13=\"\",1,\"\")","v":""},"Numero posti","A1, A2, A3",{"$f":"IF(F13=\"\",1,\"\")","v":1},"Numero posti"]
[{"$f":"IF(C14=\"\",1,\"\")","v":""},"Numeri di conferma","Uguale",{"$f":"IF(F14=\"\",1,\"\")","v":1},"Numeri di conferma"]
[{"$f":"IF(C15=\"\",1,\"\")","v":""},"Pasti","Nessuna restrizione",null,"Pasti"]
[null,"Numero di telefono compagnia aerea",1235550234,null,"Numero di telefono compagnia aerea",1235550234]
[]
[{"$f":"VoceViaggio","v":13},{"$f":"IF(A18<>ContaViaggio,\"Dettagli importanti mancanti\",\"Dettagli importanti completi\")","v":"Dettagli importanti mancanti"}]

{"sheet":"Hotel e attività","index":3,"n_rows":15,"n_cols":7,"rows_kept":15,"merged":[[21,1,21,6]]}
[]
[]
[null,"Dettagli soggiorno in hotel/alloggio",{"$nulls":3},"Dettagli sulle attività durante la vacanza"]
[{"$f":"IF(C4=\"\",1,\"\")","v":""},"Data della prenotazione",{"$f":"TODAY()+45","v":"2013-01-17"},null,null,"Attività 1","Sci"]
["","Nome dell'hotel","Alpine Ski House",null,{"$f":"IF(AND($G$4<>\"\",G5=\"\"),1,\"\")","v":1},"Date/orari"]
["","Indirizzo dell'hotel","Via Lunedì 45",null,{"$f":"IF(AND($G$4<>\"\",G6=\"\"),1,\"\")","v":1},"Data della prenotazione"]
["","Numero di telefono dell'hotel","Milano",null,{"$f":"IF(AND($G$4<>\"\",G7=\"\"),1,\"\")","v":1},"Numero di conferma"]
["","Data/ora check-in",{"$f":"TODAY()+45.5","v":"2013-01-17T12:00:00"},null,null,"Attività 2","Coho Vineyard & Winery"]
["","Data/ora uscita",{"$f":"TODAY()+50.5","v":"2013-01-22T12:00:00"},null,{"$f":"IF(AND($G$8<>\"\",G9=\"\"),1,\"\")","v":1},"Date/orari"]
["","Numero di conferma","CJ1234567",null,{"$f":"IF(AND($G$8<>\"\",G10=\"\"),1,\"\")","v":1},"Data della prenotazione"]
[{"$nulls":4},{"$f":"IF(AND($G$8<>\"\",G11=\"\"),1,\"\")","v":1},"Numero di conferma"]
[{"$f":"VoceHotel","v":7},{"$f":"IF(A12<>ContaHotel,\"Dettagli importanti mancanti\",\"Dettagli importanti completi\")","v":"Dettagli importanti mancanti"},{"$nulls":3},"Attività 3"]
[{"$nulls":4},{"$f":"IF(AND($G$12<>\"\",G13=\"\"),1,\"\")","v":""},"Date/orari"]
[{"$nulls":4},{"$f":"IF(AND($G$12<>\"\",G14=\"\"),1,\"\")","v":""},"Data della prenotazione"]
[{"$nulls":4},{"$f":"IF(AND($G$12<>\"\",G15=\"\"),1,\"\")","v":""},"Numero di conferma"]

{"sheet":"Noleggio auto","index":4,"n_rows":13,"n_cols":4,"rows_kept":13,"merged":[[18,0,18,4]]}
[]
[]
[null,null,"Informazioni sul noleggio auto"]
[null,null,"Noleggiare un'auto?","Sì"]
[null,{"$f":"IF(AND($D$4=\"Sì\",D5=\"\"),1,\"\")","v":""},"Data della prenotazione",{"$f":"TODAY()+45","v":"2013-01-17"}]
[null,{"$f":"IF(AND($D$4=\"Sì\",D6=\"\"),1,\"\")","v":1},"Noleggiatore"]
[null,{"$f":"IF(AND($D$4=\"Sì\",D7=\"\"),1,\"\")","v":1},"Giorno/ora prelievo"]
[null,{"$f":"IF(AND($D$4=\"Sì\",D8=\"\"),1,\"\")","v":1},"Giorno/ora consegna"]
[null,{"$f":"IF(AND($D$4=\"Sì\",D9=\"\"),1,\"\")","v":1},"Numero di conferma"]
[null,{"$f":"IF(AND($D$4=\"Sì\",D10=\"\"),1,\"\")","v":""},"Tipo di veicolo","Economica"]
[null,{"$f":"IF(AND($D$4=\"Sì\",D11=\"\"),1,\"\")","v":1},"Numero di telefono"]
[]
[null,{"$f":"VoceNoleggioAuto","v":2},{"$f":"IF(B13<>ContaNoleggioAuto,\"Dettagli importanti mancanti\",\"Dettagli importanti completi\")","v":"Dettagli importanti mancanti"}]

{"sheet":"Dettagli emergenza","index":5,"n_rows":11,"n_cols":6,"rows_kept":11,"merged":[[3,4,4,4],[3,5,4,5],[3,6,4,6],[5,4,6,4],[5,5,6,5],[5,6,6,6],[7,5,8,5],[7,6,8,6],[16,1,16,6]]}
[]
[]
[null,"Dettagli assicurativi",{"$nulls":3},"Dettagli contatto di emergenza"]
[{"$f":"IF(C4=\"\",1,\"\")","v":""},"Compagnia assicurativa","Humongous Insurance",null,{"$f":"IF(G4=\"\",1,\"\")","v":1},"Nome/Relazione/Telefono"]
["","Numero di telefono",1235550567]
["","Tipo di copertura","1900-01-05",null,{"$f":"IF(G6=\"\",1,\"\")","v":1},"Nome/Relazione/Telefono"]
["","Numero di conferma","1900-01-05"]
["","Data di acquisto",{"$f":"TODAY()","v":"2012-12-03"},null,null,"Nome/Relazione/Telefono"]
[1,"Date di copertura"]
[]
[{"$f":"VoceEmergenza","v":5},{"$f":"IF(A11<>ContaEmergenza,\"Dettagli importanti mancanti\",\"Dettagli importanti completi\")","v":"Dettagli importanti mancanti"}]