{"text_format":"3","workbook":"xlsx","n_sheets":3,"sheets":["Diario corsi","Elenco dei corsi","Info per personale"],"not_rendered":{"defined_names":13},"read":"whole","date_system":"1900"}

{"sheet":"Diario corsi","index":0,"n_rows":23,"n_cols":9,"rows_kept":23}
[]
[]
[null,null,"DIARIO CORSI"]
{"$rows_empty":8}
[null,null,"DATA","NOME","CORSO","ISTRUTTORE","COMPLETATO","SUPERATO","NOTE"]
[null,null,"2012-06-01","Guido Pica","Introduzione per i dipendenti",{"$f":"IF(tblDiarioCorsi[[#This Row],[CORSO]]=\"\",\"\",IFERROR(VLOOKUP(tblDiarioCorsi[[#This Row],[CORSO]],tblElencoCorsi[],2,0),\"Not Found\"))","v":"Luca Argentiero"},"Sì","Sì","Istruttore perfetto."]
[null,null,"2012-06-02","Giorgio Cavaglieri","Introduzione per i dipendenti",{"$f":"IF(tblDiarioCorsi[[#This Row],[CORSO]]=\"\",\"\",IFERROR(VLOOKUP(tblDiarioCorsi[[#This Row],[CORSO]],tblElencoCorsi[],2,0),\"Not Found\"))","v":"Luca Argentiero"},"Sì","No","Non completato per uscita anticipata."]
[null,null,"2012-06-03","Vincenzo Mancini","Introduzione per i dipendenti",{"$f":"IF(tblDiarioCorsi[[#This Row],[CORSO]]=\"\",\"\",IFERROR(VLOOKUP(tblDiarioCorsi[[#This Row],[CORSO]],tblElencoCorsi[],2,0),\"Not Found\"))","v":"Luca Argentiero"},"Sì","Sì","Proposto per l'ultima volta in questo trimestre."]
[null,null,"2012-06-03","Giorgio Cavaglieri","Introduzione per i dipendenti",{"$f":"IF(tblDiarioCorsi[[#This Row],[CORSO]]=\"\",\"\",IFERROR(VLOOKUP(tblDiarioCorsi[[#This Row],[CORSO]],tblElencoCorsi[],2,0),\"Not Found\"))","v":"Luca Argentiero"},"Sì","Sì","Proposto per l'ultima volta in questo trimestre."]
[null,null,"2012-06-04","Giorgio Cavaglieri","Operazioni dipendente",{"$f":"IF(tblDiarioCorsi[[#This Row],[CORSO]]=\"\",\"\",IFERROR(VLOOKUP(tblDiarioCorsi[[#This Row],[CORSO]],tblElencoCorsi[],2,0),\"Not Found\"))","v":"Marco Tanara"},"Sì","Sì","Proposto per la prima volta in questo trimestre."]
[null,null,"2012-06-04","Vincenzo Mancini","Operazioni dipendente",{"$f":"IF(tblDiarioCorsi[[#This Row],[CORSO]]=\"\",\"\",IFERROR(VLOOKUP(tblDiarioCorsi[[#This Row],[CORSO]],tblElencoCorsi[],2,0),\"Not Found\"))","v":"Marco Tanara"},"Sì","Sì","Proposto per la prima volta in questo trimestre."]
[null,null,"2012-06-04","Vincenzo Mancini","Contabilità - Intermedio",{"$f":"IF(tblDiarioCorsi[[#This Row],[CORSO]]=\"\",\"\",IFERROR(VLOOKUP(tblDiarioCorsi[[#This Row],[CORSO]],tblElencoCorsi[],2,0),\"Not Found\"))","v":"Marco Tanara"},"Sì","Sì","Solo partecipanti invitati."]
[null,null,"2012-06-04","Guido Pica","Operazioni dipendente",{"$f":"IF(tblDiarioCorsi[[#This Row],[CORSO]]=\"\",\"\",IFERROR(VLOOKUP(tblDiarioCorsi[[#This Row],[CORSO]],tblElencoCorsi[],2,0),\"Not Found\"))","v":"Marco Tanara"},"Sì","Sì","Proposto per la prima volta in questo trimestre."]
[null,null,"2012-06-05","Guido Pica","Contabilità - Intermedio",{"$f":"IF(tblDiarioCorsi[[#This Row],[CORSO]]=\"\",\"\",IFERROR(VLOOKUP(tblDiarioCorsi[[#This Row],[CORSO]],tblElencoCorsi[],2,0),\"Not Found\"))","v":"Marco Tanara"},"No","Futuro","Non ancora completato."]
[null,null,"2012-06-05","Giorgio Cavaglieri","Contabilità - Avanzato",{"$f":"IF(tblDiarioCorsi[[#This Row],[CORSO]]=\"\",\"\",IFERROR(VLOOKUP(tblDiarioCorsi[[#This Row],[CORSO]],tblElencoCorsi[],2,0),\"Not Found\"))","v":"Luca Argentiero"},"No","Futuro","Non ancora completato."]
[{"$nulls":5},{"$f":"IF(tblDiarioCorsi[[#This Row],[CORSO]]=\"\",\"\",IFERROR(VLOOKUP(tblDiarioCorsi[[#This Row],[CORSO]],tblElencoCorsi[],2,0),\"Not Found\"))","v":""}]

{"sheet":"Elenco dei corsi","index":1,"n_rows":10,"n_cols":6,"rows_kept":10}
[]
[]
[null,null,"ELENCO DEI CORSI"]
[]
[null,null,"TITOLO","ISTRUTTORE","DESCRIZIONE","ORARI"]
[null,null,"Introduzione per i dipendenti","Luca Argentiero","Introduzione al corso base per i nuovi dipendenti. Vengono definiti obiettivi e aspettative per i singoli reparti, oltre alle tempistiche e alle competenz.",2]
[null,null,"Operazioni dipendente","Marco Tanara","Operazioni di base di competenza del dipendente, illustrate nel manuale per il dipendente.",1]
[null,null,"Operazioni dipendente","Luca Argentiero","Procedure e linee guida per corso contabilità di base",1.5]
[null,null,"Contabilità - Intermedio","Marco Tanara","Procedure e linee guida per corso contabilità intermedio",2]
[null,null,"Contabilità - Avanzato","Luca Argentiero","Procedure e linee guida per corso contabilità avanzato",2]

{"sheet":"Info per personale","index":2,"n_rows":9,"n_cols":5,"rows_kept":9}
[]
[]
[null,null,"INFO PER PERSONALE"]
[]
[null,null,"NOME","REPARTO","TITOLO"]
[null,null,"Guido Pica","Vendite","Contabile capo"]
[null,null,"Giorgio Cavaglieri","Contabilità","Contabile"]
[null,null,"Vincenzo Mancini","Contabilità","Contabile"]
[null,null,"Elisabetta Scotti","Contabilità","Contabile"]