{"text_format":"3","workbook":"xlsx","n_sheets":4,"sheets":["Mulai","PARAMETER PROYEK","DETAIL PROYEK","TOTAL PROYEK"],"not_rendered":{"charts":2,"defined_names":3,"pivot_tables":1},"read":"whole","date_system":"1900"}

{"sheet":"Mulai","index":0,"n_rows":8,"n_cols":2,"rows_kept":8}
[null,"TENTANG TEMPLAT INI"]
[]
[null,"Gunakan buku kerja ini untuk mencatat Parameter Proyek, Detail Proyek, dan Total Proyek selama Perencanaan Proyek untuk Firma Hukum."]
[null,"Isi Nama Perusahaan dalam lembar kerja Parameter Proyek dan akan diperbarui secara otomatis di lembar kerja lain."]
[null,"Masukkan informasi dalam lembar kerja Parameter Proyek untuk memperbarui bagan kolom, dan di lembar kerja Detail Proyek. PivotTable dalam lembar kerja Total Proyek diperbarui secara otomatis."]
[null,"Catatan:  "]
[null,"Instruksi Tambahan telah disediakan dalam kolom A setiap lembar kerja. Teks ini sengaja disembunyikan. Untuk menghapus teks, pilih kolom A, lalu pilih HAPUS. Untuk memperlihatkan teks, pilih kolom A, lalu ubah warna font."]
[null,"Untuk mempelajari selengkapnya tentang tabel dalam lembar kerja, tekan SHIFT kemudian F10 dalam tabel, pilih opsi TABEL, lalu pilih TEKS ALTERNATIF. Untuk PivotTable di lembar kerja Total Proyek, tekan SHIFT lalu F10 dalam tabel, pilih OPSI PIVOTTABLE, lalu pilih tab TEKS ALT."]
{"$rows_left_out":1}
{"sheet":"PARAMETER PROYEK","index":1,"n_rows":19,"n_cols":9,"rows_kept":19}
["Buat Parameter Proyek dalam lembar kerja ini. Masukkan Nama Perusahaan dalam sel di sebelah kanan. Instruksi yang bermanfaat berada dalam sel di kolom ini.","Nama Perusahaan"]
["Judul lembar kerja ini ada dalam sel di sebelah kanan.","Perencanaan Proyek untuk Firma Hukum"]
["Pesan kerahasiaan berada dalam sel di sebelah kanan.",{"$f":"B1&\" Rahasia\"","v":"Nama Perusahaan Rahasia"}]
["Tips berada dalam sel di sebelah kanan.","Sel berbayang akan dihitung untuk Anda. Anda tidak perlu memasukkan apa pun ke dalamnya."]
["Masukkan detail dalam tabel Parameter yang dimulai dari sel di sebelah kanan. Instruksi berikutnya berada dalam sel A12.","TIPE PROYEK","REKAN UMUM","PENGACARA BISNIS","PEMBELA","PENGACARA HAK KEKAYAAN INTELEKTUAL","PENGACARA PAILIT","STAF ADMIN","TOTAL"]
[null,"Penggabungan Badan Usaha",{"v":0.1,"d":"10%"},{"v":0.4,"d":"40%"},{"v":0,"d":"0%"},{"v":0,"d":"0%"},{"v":0,"d":"0%"},{"v":0.5,"d":"50%"},{"$f":"SUM(Parameter[[#This Row],[REKAN UMUM]:[STAF ADMIN]])","v":{"v":1,"d":"100%"}}]
[null,"Akuisisi Badan Usaha",{"v":0.1,"d":"10%"},{"v":0.4,"d":"40%"},{"v":0,"d":"0%"},{"v":0.1,"d":"10%"},{"v":0,"d":"0%"},{"v":0.4,"d":"40%"},{"$f":"SUM(Parameter[[#This Row],[REKAN UMUM]:[STAF ADMIN]])","v":{"v":1,"d":"100%"}}]
[null,"Pembelaan Tanggung Jawab Produk",{"v":0.2,"d":"20%"},{"v":0,"d":"0%"},{"v":0.5,"d":"50%"},{"v":0,"d":"0%"},{"v":0,"d":"0%"},{"v":0.3,"d":"30%"},{"$f":"SUM(Parameter[[#This Row],[REKAN UMUM]:[STAF ADMIN]])","v":{"v":1,"d":"100%"}}]
{"$rows_left_out":12}
{"sheet":"DETAIL PROYEK","index":2,"n_rows":10,"n_cols":25,"rows_kept":10,"merged":[[1,24,8,28]]}
["Buat Detail Proyek dalam lembar kerja ini. Nama Perusahaan akan diperbarui secara otomatis dalam sel di sebelah kanan. Instruksi yang bermanfaat berada dalam sel di kolom ini. Tekan panah bawah untuk memulai.",{"$f":"'PARAMETER PROYEK'!B1","v":"Nama Perusahaan"}]
["Judul lembar kerja ini berada dalam sel di sebelah kanan dan tips Info di sel Y2.",{"$f":"'PARAMETER PROYEK'!B2","v":"Perencanaan Proyek untuk Firma Hukum"},{"$nulls":22},"INFO:\nUntuk menambahkan baris, pilih sel paling kanan bawah di isi tabel (bukan baris total) dan tekan Tab, atau tekan SHIFT lalu F10 dalam tabel tempat Anda ingin menyisipkan baris dan pilih Sisipkan | Baris Tabel Atas/Tabel Baris Bawah.\nPastikan semua baris yang tidak terpakai dihapus, karena PivotTable TOTAL PROYEK akan menggunakan semua sel tabel, dan jika tidak akan menghasilkan hasil yang salah."]
["Pesan kerahasiaan berada dalam sel di sebelah kanan.",{"$f":"'PARAMETER PROYEK'!B3","v":"Nama Perusahaan Rahasia"}]
["Masukkan informasi dalam tabel Detail yang dimulai dari sel di sebelah kanan. Tipe Proyek di tabel Detail di sebelah kanan diperbarui secara otomatis dari tabel Parameter dalam lembar kerja Parameter Proyek.","NAMA PROYEK","TIPE PROYEK","PERKIRAAN MULAI","PERKIRAAN SELESAI","MULAI AKTUAL","SELESAI AKTUAL","ESTIMASI PEKERJAAN","PEKERJAAN AKTUAL","ESTIMASI DURASI","DURASI AKTUAL","REKAN UMUM","PENGACARA BISNIS","PEMBELA","PENGACARA HAK KEKAYAAN INTELEKTUAL","PENGACARA PAILIT","STAF ADMIN","REKAN UMUM 2","PENGACARA BISNIS 2","PEMBELA 2","PENGACARA HAK KEKAYAAN INTELEKTUAL 2","PENGACARA PAILIT 2","STAF ADMIN 2"]
[null,"Proyek 1","Penggabungan Badan Usaha",{"$f":"TODAY()","v":"2019-02-15"},{"$f":"TODAY()+60","v":"2019-04-16"},{"$f":"TODAY()+10","v":"2019-02-25"},{"$f":"TODAY()+65","v":"2019-04-21"},200,220,{"$f":"DAYS360(Detail[[#This Row],[PERKIRAAN MULAI]],Detail[[#This Row],[PERKIRAAN SELESAI]],FALSE)","v":61},{"$f":"DAYS360(Detail[[#This Row],[MULAI AKTUAL]],Detail[[#This Row],[SELESAI AKTUAL]],FALSE)","v":56},{"$f":"INDEX(Parameter[],MATCH(Detail[[#This Row],[TIPE PROYEK]],Parameter[TIPE PROYEK],0),MATCH(Detail[[#Headers],[REKAN UMUM]],Parameter[#Headers],0))*INDEX('PARAMETER PROYEK'!$B$12:$H$12,1,MATCH(Detail[[#Headers],[REKAN UMUM]],Parameter[#Headers],0))*Detail[[#This Row],[ESTIMASI PEKERJAAN]]","v":{"v":7000,"d":"Rp7,000"}},{"$f":"INDEX(Parameter[],MATCH(Detail[[#This Row],[TIPE PROYEK]],Parameter[TIPE PROYEK],0),MATCH(Detail[[#Headers],[PENGACARA BISNIS]],Parameter[#Headers],0))*INDEX('PARAMETER PROYEK'!$B$12:$H$12,1,MATCH(Detail[[#Headers],[PENGACARA BISNIS]],Parameter[#Headers],0))*Detail[[#This Row],[ESTIMASI PEKERJAAN]]","v":{"v":20000,"d":"Rp20,000"}},{"$f":"INDEX(Parameter[],MATCH(Detail[[#This Row],[TIPE PROYEK]],Parameter[TIPE PROYEK],0),MATCH(Detail[[#Headers],[PEMBELA]],Parameter[#Headers],0))*INDEX('PARAMETER PROYEK'!$B$12:$H$12,1,MATCH(Detail[[#Headers],[PEMBELA]],Parameter[#Headers],0))*Detail[[#This Row],[ESTIMASI PEKERJAAN]]","v":{"v":0,"d":"Rp0"}},{"$f":"INDEX(Parameter[],MATCH(Detail[[#This Row],[TIPE PROYEK]],Parameter[TIPE PROYEK],0),MATCH(Detail[[#Headers],[PENGACARA HAK KEKAYAAN INTELEKTUAL]],Parameter[#Headers],0))*INDEX('PARAMETER PROYEK'!$B$12:$H$12,1,MATCH(Detail[[#Headers],[PENGACARA HAK KEKAYAAN INTELEKTUAL]],Parameter[#Headers],0))*Detail[[#This Row],[ESTIMASI PEKERJAAN]]","v":{"v":0,"d":"Rp0"}},{"$f":"INDEX(Parameter[],MATCH(Detail[[#This Row],[TIPE PROYEK]],Parameter[TIPE PROYEK],0),MATCH(Detail[[#Headers],[PENGACARA PAILIT]],Parameter[#Headers],0))*INDEX('PARAMETER PROYEK'!$B$12:$H$12,1,MATCH(Detail[[#Headers],[PENGACARA PAILIT]],Parameter[#Headers],0))*Detail[[#This Row],[ESTIMASI PEKERJAAN]]","v":{"v":0,"d":"Rp0"}},{"$f":"INDEX(Parameter[],MATCH(Detail[[#This Row],[TIPE PROYEK]],Parameter[TIPE PROYEK],0),MATCH(Detail[[#Headers],[STAF ADMIN]],Parameter[#Headers],0))*INDEX('PARAMETER PROYEK'!$B$12:$H$12,1,MATCH(Detail[[#Headers],[STAF ADMIN]],Parameter[#Headers],0))*Detail[[#This Row],[ESTIMASI PEKERJAAN]]","v":{"v":12500,"d":"Rp12,500"}},{"$f":"INDEX(Parameter[],MATCH(Detail[[#This Row],[TIPE PROYEK]],Parameter[TIPE PROYEK],0),MATCH(Detail[[#Headers],[REKAN UMUM]],Parameter[#Headers],0))*INDEX('PARAMETER PROYEK'!$B$12:$H$12,1,MATCH(Detail[[#Headers],[REKAN UMUM]],Parameter[#Headers],0))*Detail[[#This Row],[PEKERJAAN AKTUAL]]","v":{"v":7700,"d":"Rp7,700"}},{"$f":"INDEX(Parameter[],MATCH(Detail[[#This Row],[TIPE PROYEK]],Parameter[TIPE PROYEK],0),MATCH(Detail[[#Headers],[PENGACARA BISNIS]],Parameter[#Headers],0))*INDEX('PARAMETER PROYEK'!$B$12:$H$12,1,MATCH(Detail[[#Headers],[PENGACARA BISNIS]],Parameter[#Headers],0))*Detail[[#This Row],[PEKERJAAN AKTUAL]]","v":{"v":22000,"d":"Rp22,000"}},{"$f":"INDEX(Parameter[],MATCH(Detail[[#This Row],[TIPE PROYEK]],Parameter[TIPE PROYEK],0),MATCH(Detail[[#Headers],[PEMBELA]],Parameter[#Headers],0))*INDEX('PARAMETER PROYEK'!$B$12:$H$12,1,MATCH(Detail[[#Headers],[PEMBELA]],Parameter[#Headers],0))*Detail[[#This Row],[PEKERJAAN AKTUAL]]","v":{"v":0,"d":"Rp0"}},{"$f":"INDEX(Parameter[],MATCH(Detail[[#This Row],[TIPE PROYEK]],Parameter[TIPE PROYEK],0),MATCH(Detail[[#Headers],[PENGACARA HAK KEKAYAAN INTELEKTUAL]],Parameter[#Headers],0))*INDEX('PARAMETER PROYEK'!$B$12:$H$12,1,MATCH(Detail[[#Headers],[PENGACARA HAK KEKAYAAN INTELEKTUAL]],Parameter[#Headers],0))*Detail[[#This Row],[PEKERJAAN AKTUAL]]","v":{"v":0,"d":"Rp0"}},{"$f":"INDEX(Parameter[],MATCH(Detail[[#This Row],[TIPE PROYEK]],Parameter[TIPE PROYEK],0),MATCH(Detail[[#Headers],[PENGACARA PAILIT]],Parameter[#Headers],0))*INDEX('PARAMETER PROYEK'!$B$12:$H$12,1,MATCH(Detail[[#Headers],[PENGACARA PAILIT]],Parameter[#Headers],0))*Detail[[#This Row],[PEKERJAAN AKTUAL]]","v":{"v":0,"d":"Rp0"}},{"$f":"INDEX(Parameter[],MATCH(Detail[[#This Row],[TIPE PROYEK]],Parameter[TIPE PROYEK],0),MATCH(Detail[[#Headers],[STAF ADMIN]],Parameter[#Headers],0))*INDEX('PARAMETER PROYEK'!$B$12:$H$12,1,MATCH(Detail[[#Headers],[STAF ADMIN]],Parameter[#Headers],0))*Detail[[#This Row],[PEKERJAAN AKTUAL]]","v":{"v":13750,"d":"Rp13,750"}}]
[null,"Proyek 2","Akuisisi Badan Usaha",{"$f":"TODAY()+30","v":"2019-03-17"},{"$f":"TODAY()+100","v":"2019-05-26"},{"$f":"TODAY()+40","v":"2019-03-27"},{"$f":"TODAY()+110","v":"2019-06-05"},400,390,{"$f":"DAYS360(Detail[[#This Row],[PERKIRAAN MULAI]],Detail[[#This Row],[PERKIRAAN SELESAI]],FALSE)","v":69},{"$f":"DAYS360(Detail[[#This Row],[MULAI AKTUAL]],Detail[[#This Row],[SELESAI AKTUAL]],FALSE)","v":68},{"$f":"INDEX(Parameter[],MATCH(Detail[[#This Row],[TIPE PROYEK]],Parameter[TIPE PROYEK],0),MATCH(Detail[[#Headers],[REKAN UMUM]],Parameter[#Headers],0))*INDEX('PARAMETER PROYEK'!$B$12:$H$12,1,MATCH(Detail[[#Headers],[REKAN UMUM]],Parameter[#Headers],0))*Detail[[#This Row],[ESTIMASI PEKERJAAN]]","v":{"v":14000,"d":"Rp14,000"}},{"$f":"INDEX(Parameter[],MATCH(Detail[[#This Row],[TIPE PROYEK]],Parameter[TIPE PROYEK],0),MATCH(Detail[[#Headers],[PENGACARA BISNIS]],Parameter[#Headers],0))*INDEX('PARAMETER PROYEK'!$B$12:$H$12,1,MATCH(Detail[[#Headers],[PENGACARA BISNIS]],Parameter[#Headers],0))*Detail[[#This Row],[ESTIMASI PEKERJAAN]]","v":{"v":40000,"d":"Rp40,000"}},{"$f":"INDEX(Parameter[],MATCH(Detail[[#This Row],[TIPE PROYEK]],Parameter[TIPE PROYEK],0),MATCH(Detail[[#Headers],[PEMBELA]],Parameter[#Headers],0))*INDEX('PARAMETER PROYEK'!$B$12:$H$12,1,MATCH(Detail[[#Headers],[PEMBELA]],Parameter[#Headers],0))*Detail[[#This Row],[ESTIMASI PEKERJAAN]]","v":{"v":0,"d":"Rp0"}},{"$f":"INDEX(Parameter[],MATCH(Detail[[#This Row],[TIPE PROYEK]],Parameter[TIPE PROYEK],0),MATCH(Detail[[#Headers],[PENGACARA HAK KEKAYAAN INTELEKTUAL]],Parameter[#Headers],0))*INDEX('PARAMETER PROYEK'!$B$12:$H$12,1,MATCH(Detail[[#Headers],[PENGACARA HAK KEKAYAAN INTELEKTUAL]],Parameter[#Headers],0))*Detail[[#This Row],[ESTIMASI PEKERJAAN]]","v":{"v":11000,"d":"Rp11,000"}},{"$f":"INDEX(Parameter[],MATCH(Detail[[#This Row],[TIPE PROYEK]],Parameter[TIPE PROYEK],0),MATCH(Detail[[#Headers],[PENGACARA PAILIT]],Parameter[#Headers],0))*INDEX('PARAMETER PROYEK'!$B$12:$H$12,1,MATCH(Detail[[#Headers],[PENGACARA PAILIT]],Parameter[#Headers],0))*Detail[[#This Row],[ESTIMASI PEKERJAAN]]","v":{"v":0,"d":"Rp0"}},{"$f":"INDEX(Parameter[],MATCH(Detail[[#This Row],[TIPE PROYEK]],Parameter[TIPE PROYEK],0),MATCH(Detail[[#Headers],[STAF ADMIN]],Parameter[#Headers],0))*INDEX('PARAMETER PROYEK'!$B$12:$H$12,1,MATCH(Detail[[#Headers],[STAF ADMIN]],Parameter[#Headers],0))*Detail[[#This Row],[ESTIMASI PEKERJAAN]]","v":{"v":20000,"d":"Rp20,000"}},{"$f":"INDEX(Parameter[],MATCH(Detail[[#This Row],[TIPE PROYEK]],Parameter[TIPE PROYEK],0),MATCH(Detail[[#Headers],[REKAN UMUM]],Parameter[#Headers],0))*INDEX('PARAMETER PROYEK'!$B$12:$H$12,1,MATCH(Detail[[#Headers],[REKAN UMUM]],Parameter[#Headers],0))*Detail[[#This Row],[PEKERJAAN AKTUAL]]","v":{"v":13650,"d":"Rp13,650"}},{"$f":"INDEX(Parameter[],MATCH(Detail[[#This Row],[TIPE PROYEK]],Parameter[TIPE PROYEK],0),MATCH(Detail[[#Headers],[PENGACARA BISNIS]],Parameter[#Headers],0))*INDEX('PARAMETER PROYEK'!$B$12:$H$12,1,MATCH(Detail[[#Headers],[PENGACARA BISNIS]],Parameter[#Headers],0))*Detail[[#This Row],[PEKERJAAN AKTUAL]]","v":{"v":39000,"d":"Rp39,000"}},{"$f":"INDEX(Parameter[],MATCH(Detail[[#This Row],[TIPE PROYEK]],Parameter[TIPE PROYEK],0),MATCH(Detail[[#Headers],[PEMBELA]],Parameter[#Headers],0))*INDEX('PARAMETER PROYEK'!$B$12:$H$12,1,MATCH(Detail[[#Headers],[PEMBELA]],Parameter[#Headers],0))*Detail[[#This Row],[PEKERJAAN AKTUAL]]","v":{"v":0,"d":"Rp0"}},{"$f":"INDEX(Parameter[],MATCH(Detail[[#This Row],[TIPE PROYEK]],Parameter[TIPE PROYEK],0),MATCH(Detail[[#Headers],[PENGACARA HAK KEKAYAAN INTELEKTUAL]],Parameter[#Headers],0))*INDEX('PARAMETER PROYEK'!$B$12:$H$12,1,MATCH(Detail[[#Headers],[PENGACARA HAK KEKAYAAN INTELEKTUAL]],Parameter[#Headers],0))*Detail[[#This Row],[PEKERJAAN AKTUAL]]","v":{"v":10725,"d":"Rp10,725"}},{"$f":"INDEX(Parameter[],MATCH(Detail[[#This Row],[TIPE PROYEK]],Parameter[TIPE PROYEK],0),MATCH(Detail[[#Headers],[PENGACARA PAILIT]],Parameter[#Headers],0))*INDEX('PARAMETER PROYEK'!$B$12:$H$12,1,MATCH(Detail[[#Headers],[PENGACARA PAILIT]],Parameter[#Headers],0))*Detail[[#This Row],[PEKERJAAN AKTUAL]]","v":{"v":0,"d":"Rp0"}},{"$f":"INDEX(Parameter[],MATCH(Detail[[#This Row],[TIPE PROYEK]],Parameter[TIPE PROYEK],0),MATCH(Detail[[#Headers],[STAF ADMIN]],Parameter[#Headers],0))*INDEX('PARAMETER PROYEK'!$B$12:$H$12,1,MATCH(Detail[[#Headers],[STAF ADMIN]],Parameter[#Headers],0))*Detail[[#This Row],[PEKERJAAN AKTUAL]]","v":{"v":19500,"d":"Rp19,500"}}]
[null,"Proyek 3","Pembelaan Tanggung Jawab Produk",{"$f":"TODAY()+150","v":"2019-07-15"},{"$f":"TODAY()+150","v":"2019-07-15"},{"$f":"TODAY()+150","v":"2019-07-15"},{"$f":"TODAY()+170","v":"2019-08-04"},500,500,{"$f":"DAYS360(Detail[[#This Row],[PERKIRAAN MULAI]],Detail[[#This Row],[PERKIRAAN SELESAI]],FALSE)","v":0},{"$f":"DAYS360(Detail[[#This Row],[MULAI AKTUAL]],Detail[[#This Row],[SELESAI AKTUAL]],FALSE)","v":19},{"$f":"INDEX(Parameter[],MATCH(Detail[[#This Row],[TIPE PROYEK]],Parameter[TIPE PROYEK],0),MATCH(Detail[[#Headers],[REKAN UMUM]],Parameter[#Headers],0))*INDEX('PARAMETER PROYEK'!$B$12:$H$12,1,MATCH(Detail[[#Headers],[REKAN UMUM]],Parameter[#Headers],0))*Detail[[#This Row],[ESTIMASI PEKERJAAN]]","v":{"v":35000,"d":"Rp35,000"}},{"$f":"INDEX(Parameter[],MATCH(Detail[[#This Row],[TIPE PROYEK]],Parameter[TIPE PROYEK],0),MATCH(Detail[[#Headers],[PENGACARA BISNIS]],Parameter[#Headers],0))*INDEX('PARAMETER PROYEK'!$B$12:$H$12,1,MATCH(Detail[[#Headers],[PENGACARA BISNIS]],Parameter[#Headers],0))*Detail[[#This Row],[ESTIMASI PEKERJAAN]]","v":{"v":0,"d":"Rp0"}},{"$f":"INDEX(Parameter[],MATCH(Detail[[#This Row],[TIPE PROYEK]],Parameter[TIPE PROYEK],0),MATCH(Detail[[#Headers],[PEMBELA]],Parameter[#Headers],0))*INDEX('PARAMETER PROYEK'!$B$12:$H$12,1,MATCH(Detail[[#Headers],[PEMBELA]],Parameter[#Headers],0))*Detail[[#This Row],[ESTIMASI PEKERJAAN]]","v":{"v":75000,"d":"Rp75,000"}},{"$f":"INDEX(Parameter[],MATCH(Detail[[#This Row],[TIPE PROYEK]],Parameter[TIPE PROYEK],0),MATCH(Detail[[#Headers],[PENGACARA HAK KEKAYAAN INTELEKTUAL]],Parameter[#Headers],0))*INDEX('PARAMETER PROYEK'!$B$12:$H$12,1,MATCH(Detail[[#Headers],[PENGACARA HAK KEKAYAAN INTELEKTUAL]],Parameter[#Headers],0))*Detail[[#This Row],[ESTIMASI PEKERJAAN]]","v":{"v":0,"d":"Rp0"}},{"$f":"INDEX(Parameter[],MATCH(Detail[[#This Row],[TIPE PROYEK]],Parameter[TIPE PROYEK],0),MATCH(Detail[[#Headers],[PENGACARA PAILIT]],Parameter[#Headers],0))*INDEX('PARAMETER PROYEK'!$B$12:$H$12,1,MATCH(Detail[[#Headers],[PENGACARA PAILIT]],Parameter[#Headers],0))*Detail[[#This Row],[ESTIMASI PEKERJAAN]]","v":{"v":0,"d":"Rp0"}},{"$f":"INDEX(Parameter[],MATCH(Detail[[#This Row],[TIPE PROYEK]],Parameter[TIPE PROYEK],0),MATCH(Detail[[#Headers],[STAF ADMIN]],Parameter[#Headers],0))*INDEX('PARAMETER PROYEK'!$B$12:$H$12,1,MATCH(Detail[[#Headers],[STAF ADMIN]],Parameter[#Headers],0))*Detail[[#This Row],[ESTIMASI PEKERJAAN]]","v":{"v":18750,"d":"Rp18,750"}},{"$f":"INDEX(Parameter[],MATCH(Detail[[#This Row],[TIPE PROYEK]],Parameter[TIPE PROYEK],0),MATCH(Detail[[#Headers],[REKAN UMUM]],Parameter[#Headers],0))*INDEX('PARAMETER PROYEK'!$B$12:$H$12,1,MATCH(Detail[[#Headers],[REKAN UMUM]],Parameter[#Headers],0))*Detail[[#This Row],[PEKERJAAN AKTUAL]]","v":{"v":35000,"d":"Rp35,000"}},{"$f":"INDEX(Parameter[],MATCH(Detail[[#This Row],[TIPE PROYEK]],Parameter[TIPE PROYEK],0),MATCH(Detail[[#Headers],[PENGACARA BISNIS]],Parameter[#Headers],0))*INDEX('PARAMETER PROYEK'!$B$12:$H$12,1,MATCH(Detail[[#Headers],[PENGACARA BISNIS]],Parameter[#Headers],0))*Detail[[#This Row],[PEKERJAAN AKTUAL]]","v":{"v":0,"d":"Rp0"}},{"$f":"INDEX(Parameter[],MATCH(Detail[[#This Row],[TIPE PROYEK]],Parameter[TIPE PROYEK],0),MATCH(Detail[[#Headers],[PEMBELA]],Parameter[#Headers],0))*INDEX('PARAMETER PROYEK'!$B$12:$H$12,1,MATCH(Detail[[#Headers],[PEMBELA]],Parameter[#Headers],0))*Detail[[#This Row],[PEKERJAAN AKTUAL]]","v":{"v":75000,"d":"Rp75,000"}},{"$f":"INDEX(Parameter[],MATCH(Detail[[#This Row],[TIPE PROYEK]],Parameter[TIPE PROYEK],0),MATCH(Detail[[#Headers],[PENGACARA HAK KEKAYAAN INTELEKTUAL]],Parameter[#Headers],0))*INDEX('PARAMETER PROYEK'!$B$12:$H$12,1,MATCH(Detail[[#Headers],[PENGACARA HAK KEKAYAAN INTELEKTUAL]],Parameter[#Headers],0))*Detail[[#This Row],[PEKERJAAN AKTUAL]]","v":{"v":0,"d":"Rp0"}},{"$f":"INDEX(Parameter[],MATCH(Detail[[#This Row],[TIPE PROYEK]],Parameter[TIPE PROYEK],0),MATCH(Detail[[#Headers],[PENGACARA PAILIT]],Parameter[#Headers],0))*INDEX('PARAMETER PROYEK'!$B$12:$H$12,1,MATCH(Detail[[#Headers],[PENGACARA PAILIT]],Parameter[#Headers],0))*Detail[[#This Row],[PEKERJAAN AKTUAL]]","v":{"v":0,"d":"Rp0"}},{"$f":"INDEX(Parameter[],MATCH(Detail[[#This Row],[TIPE PROYEK]],Parameter[TIPE PROYEK],0),MATCH(Detail[[#Headers],[STAF ADMIN]],Parameter[#Headers],0))*INDEX('PARAMETER PROYEK'!$B$12:$H$12,1,MATCH(Detail[[#Headers],[STAF ADMIN]],Parameter[#Headers],0))*Detail[[#This Row],[PEKERJAAN AKTUAL]]","v":{"v":18750,"d":"Rp18,750"}}]
[null,"Proyek 4","Pendaftaran Paten",{"$f":"TODAY()+200","v":"2019-09-03"},{"$f":"TODAY()+230","v":"2019-10-03"},{"$f":"TODAY()+230","v":"2019-10-03"},{"$f":"TODAY()+230","v":"2019-10-03"},150,145,{"$f":"DAYS360(Detail[[#This Row],[PERKIRAAN MULAI]],Detail[[#This Row],[PERKIRAAN SELESAI]],FALSE)","v":30},{"$f":"DAYS360(Detail[[#This Row],[MULAI AKTUAL]],Detail[[#This Row],[SELESAI AKTUAL]],FALSE)","v":0},{"$f":"INDEX(Parameter[],MATCH(Detail[[#This Row],[TIPE PROYEK]],Parameter[TIPE PROYEK],0),MATCH(Detail[[#Headers],[REKAN UMUM]],Parameter[#Headers],0))*INDEX('PARAMETER PROYEK'!$B$12:$H$12,1,MATCH(Detail[[#Headers],[REKAN UMUM]],Parameter[#Headers],0))*Detail[[#This Row],[ESTIMASI PEKERJAAN]]","v":{"v":5250,"d":"Rp5,250"}},{"$f":"INDEX(Parameter[],MATCH(Detail[[#This Row],[TIPE PROYEK]],Parameter[TIPE PROYEK],0),MATCH(Detail[[#Headers],[PENGACARA BISNIS]],Parameter[#Headers],0))*INDEX('PARAMETER PROYEK'!$B$12:$H$12,1,MATCH(Detail[[#Headers],[PENGACARA BISNIS]],Parameter[#Headers],0))*Detail[[#This Row],[ESTIMASI PEKERJAAN]]","v":{"v":0,"d":"Rp0"}},{"$f":"INDEX(Parameter[],MATCH(Detail[[#This Row],[TIPE PROYEK]],Parameter[TIPE PROYEK],0),MATCH(Detail[[#Headers],[PEMBELA]],Parameter[#Headers],0))*INDEX('PARAMETER PROYEK'!$B$12:$H$12,1,MATCH(Detail[[#Headers],[PEMBELA]],Parameter[#Headers],0))*Detail[[#This Row],[ESTIMASI PEKERJAAN]]","v":{"v":0,"d":"Rp0"}},{"$f":"INDEX(Parameter[],MATCH(Detail[[#This Row],[TIPE PROYEK]],Parameter[TIPE PROYEK],0),MATCH(Detail[[#Headers],[PENGACARA HAK KEKAYAAN INTELEKTUAL]],Parameter[#Headers],0))*INDEX('PARAMETER PROYEK'!$B$12:$H$12,1,MATCH(Detail[[#Headers],[PENGACARA HAK KEKAYAAN INTELEKTUAL]],Parameter[#Headers],0))*Detail[[#This Row],[ESTIMASI PEKERJAAN]]","v":{"v":24750,"d":"Rp24,750"}},{"$f":"INDEX(Parameter[],MATCH(Detail[[#This Row],[TIPE PROYEK]],Parameter[TIPE PROYEK],0),MATCH(Detail[[#Headers],[PENGACARA PAILIT]],Parameter[#Headers],0))*INDEX('PARAMETER PROYEK'!$B$12:$H$12,1,MATCH(Detail[[#Headers],[PENGACARA PAILIT]],Parameter[#Headers],0))*Detail[[#This Row],[ESTIMASI PEKERJAAN]]","v":{"v":0,"d":"Rp0"}},{"$f":"INDEX(Parameter[],MATCH(Detail[[#This Row],[TIPE PROYEK]],Parameter[TIPE PROYEK],0),MATCH(Detail[[#Headers],[STAF ADMIN]],Parameter[#Headers],0))*INDEX('PARAMETER PROYEK'!$B$12:$H$12,1,MATCH(Detail[[#Headers],[STAF ADMIN]],Parameter[#Headers],0))*Detail[[#This Row],[ESTIMASI PEKERJAAN]]","v":{"v":5625,"d":"Rp5,625"}},{"$f":"INDEX(Parameter[],MATCH(Detail[[#This Row],[TIPE PROYEK]],Parameter[TIPE PROYEK],0),MATCH(Detail[[#Headers],[REKAN UMUM]],Parameter[#Headers],0))*INDEX('PARAMETER PROYEK'!$B$12:$H$12,1,MATCH(Detail[[#Headers],[REKAN UMUM]],Parameter[#Headers],0))*Detail[[#This Row],[PEKERJAAN AKTUAL]]","v":{"v":5075,"d":"Rp5,075"}},{"$f":"INDEX(Parameter[],MATCH(Detail[[#This Row],[TIPE PROYEK]],Parameter[TIPE PROYEK],0),MATCH(Detail[[#Headers],[PENGACARA BISNIS]],Parameter[#Headers],0))*INDEX('PARAMETER PROYEK'!$B$12:$H$12,1,MATCH(Detail[[#Headers],[PENGACARA BISNIS]],Parameter[#Headers],0))*Detail[[#This Row],[PEKERJAAN AKTUAL]]","v":{"v":0,"d":"Rp0"}},{"$f":"INDEX(Parameter[],MATCH(Detail[[#This Row],[TIPE PROYEK]],Parameter[TIPE PROYEK],0),MATCH(Detail[[#Headers],[PEMBELA]],Parameter[#Headers],0))*INDEX('PARAMETER PROYEK'!$B$12:$H$12,1,MATCH(Detail[[#Headers],[PEMBELA]],Parameter[#Headers],0))*Detail[[#This Row],[PEKERJAAN AKTUAL]]","v":{"v":0,"d":"Rp0"}},{"$f":"INDEX(Parameter[],MATCH(Detail[[#This Row],[TIPE PROYEK]],Parameter[TIPE PROYEK],0),MATCH(Detail[[#Headers],[PENGACARA HAK KEKAYAAN INTELEKTUAL]],Parameter[#Headers],0))*INDEX('PARAMETER PROYEK'!$B$12:$H$12,1,MATCH(Detail[[#Headers],[PENGACARA HAK KEKAYAAN INTELEKTUAL]],Parameter[#Headers],0))*Detail[[#This Row],[PEKERJAAN AKTUAL]]","v":{"v":23925,"d":"Rp23,925"}},{"$f":"INDEX(Parameter[],MATCH(Detail[[#This Row],[TIPE PROYEK]],Parameter[TIPE PROYEK],0),MATCH(Detail[[#Headers],[PENGACARA PAILIT]],Parameter[#Headers],0))*INDEX('PARAMETER PROYEK'!$B$12:$H$12,1,MATCH(Detail[[#Headers],[PENGACARA PAILIT]],Parameter[#Headers],0))*Detail[[#This Row],[PEKERJAAN AKTUAL]]","v":{"v":0,"d":"Rp0"}},{"$f":"INDEX(Parameter[],MATCH(Detail[[#This Row],[TIPE PROYEK]],Parameter[TIPE PROYEK],0),MATCH(Detail[[#Headers],[STAF ADMIN]],Parameter[#Headers],0))*INDEX('PARAMETER PROYEK'!$B$12:$H$12,1,MATCH(Detail[[#Headers],[STAF ADMIN]],Parameter[#Headers],0))*Detail[[#This Row],[PEKERJAAN AKTUAL]]","v":{"v":5437.5,"d":"Rp5,438"}}]
{"$rows_left_out":3}
{"sheet":"TOTAL PROYEK","index":3,"n_rows":11,"n_cols":16,"rows_kept":11,"merged":[[3,2,3,7],[3,8,3,13],[3,15,14,19]]}
["Dapatkan Total Proyek dalam lembar kerja ini. Nama Perusahaan diperbarui secara otomatis dalam sel di sebelah kanan. Instruksi yang bermanfaat berada dalam sel di kolom ini. Tekan panah bawah untuk memulai.",{"$f":"'PARAMETER PROYEK'!B1","v":"Nama Perusahaan"}]
["Judul lembar kerja ini ada dalam sel di sebelah kanan.",{"$f":"'PARAMETER PROYEK'!B2","v":"Perencanaan Proyek untuk Firma Hukum"}]
["Pesan kerahasiaan berada dalam sel di sebelah kanan.",{"$f":"'PARAMETER PROYEK'!B3","v":"Nama Perusahaan Rahasia"}]
["Label Perkiraan berada dalam sel C4, label Aktual di sel I4, dan tips Info di sel P4.",null,"PERKIRAAN",{"$nulls":5},"AKTUAL",{"$nulls":6},"INFO: \nPivotTable ini tidak akan direfresh secara otomatis.  Untuk merefreshnya, pilih (sel mana saja dalam PivotTable), di tab pita ALAT PIVOTTABLE | ANALISIS, pilih Refresh.  Atau tekan SHIFT + F10 dengan memilih PivotTable dan pilih Refresh."]
["PivotTable yang dimulai dalam sel di sebelah kanan akan diperbarui secara otomatis","NAMA PROYEK","REKAN UMUM ","BISNIS ","PEMBELA ","HAK KEKAYAAN INTELEKTUAL ","PAILIT ","STAF ADMIN ","REKAN UMUM  ","BISNIS","PEMBELA  ","PAILIT  ","HAK KEKAYAAN INTELEKTUAL  ","STAF ADMIN  "]
[null,"Proyek 1",{"v":7000,"d":"Rp7,000.00"},{"v":20000,"d":"Rp20,000.00"},{"v":0,"d":"Rp0.00"},{"v":0,"d":"Rp0.00"},{"v":0,"d":"Rp0.00"},{"v":12500,"d":"Rp12,500.00"},{"v":7700,"d":"Rp7,700.00"},{"v":22000,"d":"Rp22,000.00"},{"v":0,"d":"Rp0.00"},{"v":0,"d":"Rp0.00"},{"v":0,"d":"Rp0.00"},{"v":13750,"d":"Rp13,750.00"}]
[null,"Proyek 2",{"v":14000,"d":"Rp14,000.00"},{"v":40000,"d":"Rp40,000.00"},{"v":0,"d":"Rp0.00"},{"v":11000,"d":"Rp11,000.00"},{"v":0,"d":"Rp0.00"},{"v":20000,"d":"Rp20,000.00"},{"v":13650,"d":"Rp13,650.00"},{"v":39000,"d":"Rp39,000.00"},{"v":0,"d":"Rp0.00"},{"v":10725,"d":"Rp10,725.00"},{"v":0,"d":"Rp0.00"},{"v":19500,"d":"Rp19,500.00"}]
[null,"Proyek 3",{"v":35000,"d":"Rp35,000.00"},{"v":0,"d":"Rp0.00"},{"v":75000,"d":"Rp75,000.00"},{"v":0,"d":"Rp0.00"},{"v":0,"d":"Rp0.00"},{"v":18750,"d":"Rp18,750.00"},{"v":35000,"d":"Rp35,000.00"},{"v":0,"d":"Rp0.00"},{"v":75000,"d":"Rp75,000.00"},{"v":0,"d":"Rp0.00"},{"v":0,"d":"Rp0.00"},{"v":18750,"d":"Rp18,750.00"}]
{"$rows_left_out":3}