{"text_format":"3","workbook":"xlsx","n_sheets":5,"sheets":["Tárgyévi összegzés","1. n.é.","2. n.é.","3. n.é.","4. n.é."],"not_rendered":{"defined_names":12},"read":"whole","date_system":"1900"}

{"sheet":"Tárgyévi összegzés","index":0,"n_rows":36,"n_cols":12,"rows_kept":36,"merged":[[3,0,3,6]]}
["Cégnév"]
["Jelenléti nyilvántartás, tárgyévi összegzés"]
["Dátum"]
[{"$f":"Cégnév","v":"Cégnév"},{"$nulls":6},"BIZALMAS"]
["Vezetéknév","Utónév","Szabadság","Személyes távollét","Betegség","Tajszám","Beosztás","Felettes","Foglalkoztatás kezdete","Megjegyzések","Szabadságon töltött napok száma \névente","Szabadságon töltött napok száma \nFennmaradó"]
["Vezetéknév","Utónév",{"$f":"SUM('1. n.é.:4. n.é.'!C6)","v":3},{"$f":"SUM('1. n.é.:4. n.é.'!D6)","v":0},{"$f":"SUM('1. n.é.:4. n.é.'!E6)","v":1},"xxx-xx-xxxx","Vezető","Név",null,null,10,{"$f":"K6-C6","v":7}]
[null,null,{"$f":"SUM('1. n.é.:4. n.é.'!C7)","v":0},{"$f":"SUM('1. n.é.:4. n.é.'!D7)","v":0},{"$f":"SUM('1. n.é.:4. n.é.'!E7)","v":0},{"$nulls":6},{"$f":"K7-C7","v":0}]
[null,null,{"$f":"SUM('1. n.é.:4. n.é.'!C8)","v":0},{"$f":"SUM('1. n.é.:4. n.é.'!D8)","v":0},{"$f":"SUM('1. n.é.:4. n.é.'!E8)","v":0},{"$nulls":6},0]
[null,null,{"$f":"SUM('1. n.é.:4. n.é.'!C9)","v":0},{"$f":"SUM('1. n.é.:4. n.é.'!D9)","v":0},{"$f":"SUM('1. n.é.:4. n.é.'!E9)","v":0},{"$nulls":6},0]
[null,null,{"$f":"SUM('1. n.é.:4. n.é.'!C10)","v":0},{"$f":"SUM('1. n.é.:4. n.é.'!D10)","v":0},{"$f":"SUM('1. n.é.:4. n.é.'!E10)","v":0},{"$nulls":6},0]
[null,null,{"$f":"SUM('1. n.é.:4. n.é.'!C11)","v":0},{"$f":"SUM('1. n.é.:4. n.é.'!D11)","v":0},{"$f":"SUM('1. n.é.:4. n.é.'!E11)","v":0},{"$nulls":6},0]
[null,null,{"$f":"SUM('1. n.é.:4. n.é.'!C12)","v":0},{"$f":"SUM('1. n.é.:4. n.é.'!D12)","v":0},{"$f":"SUM('1. n.é.:4. n.é.'!E12)","v":0},{"$nulls":6},0]
[null,null,{"$f":"SUM('1. n.é.:4. n.é.'!C13)","v":0},{"$f":"SUM('1. n.é.:4. n.é.'!D13)","v":0},{"$f":"SUM('1. n.é.:4. n.é.'!E13)","v":0},{"$nulls":6},0]
[null,null,{"$f":"SUM('1. n.é.:4. n.é.'!C14)","v":0},{"$f":"SUM('1. n.é.:4. n.é.'!D14)","v":0},{"$f":"SUM('1. n.é.:4. n.é.'!E14)","v":0},{"$nulls":6},0]
[null,null,{"$f":"SUM('1. n.é.:4. n.é.'!C15)","v":0},{"$f":"SUM('1. n.é.:4. n.é.'!D15)","v":0},{"$f":"SUM('1. n.é.:4. n.é.'!E15)","v":0},{"$nulls":6},0]
[null,null,{"$f":"SUM('1. n.é.:4. n.é.'!C16)","v":0},{"$f":"SUM('1. n.é.:4. n.é.'!D16)","v":0},{"$f":"SUM('1. n.é.:4. n.é.'!E16)","v":0},{"$nulls":6},0]
[null,null,{"$f":"SUM('1. n.é.:4. n.é.'!C17)","v":0},{"$f":"SUM('1. n.é.:4. n.é.'!D17)","v":0},{"$f":"SUM('1. n.é.:4. n.é.'!E17)","v":0},{"$nulls":6},0]
[null,null,{"$f":"SUM('1. n.é.:4. n.é.'!C18)","v":0},{"$f":"SUM('1. n.é.:4. n.é.'!D18)","v":0},{"$f":"SUM('1. n.é.:4. n.é.'!E18)","v":0},{"$nulls":6},0]
[null,null,{"$f":"SUM('1. n.é.:4. n.é.'!C19)","v":0},{"$f":"SUM('1. n.é.:4. n.é.'!D19)","v":0},{"$f":"SUM('1. n.é.:4. n.é.'!E19)","v":0},{"$nulls":6},0]
[null,null,{"$f":"SUM('1. n.é.:4. n.é.'!C20)","v":0},{"$f":"SUM('1. n.é.:4. n.é.'!D20)","v":0},{"$f":"SUM('1. n.é.:4. n.é.'!E20)","v":0},{"$nulls":6},0]
[null,null,{"$f":"SUM('1. n.é.:4. n.é.'!C21)","v":0},{"$f":"SUM('1. n.é.:4. n.é.'!D21)","v":0},{"$f":"SUM('1. n.é.:4. n.é.'!E21)","v":0},{"$nulls":6},0]
[null,null,{"$f":"SUM('1. n.é.:4. n.é.'!C22)","v":0},{"$f":"SUM('1. n.é.:4. n.é.'!D22)","v":0},{"$f":"SUM('1. n.é.:4. n.é.'!E22)","v":0},{"$nulls":6},0]
[null,null,{"$f":"SUM('1. n.é.:4. n.é.'!C23)","v":0},{"$f":"SUM('1. n.é.:4. n.é.'!D23)","v":0},{"$f":"SUM('1. n.é.:4. n.é.'!E23)","v":0},{"$nulls":6},0]
[null,null,{"$f":"SUM('1. n.é.:4. n.é.'!C24)","v":0},{"$f":"SUM('1. n.é.:4. n.é.'!D24)","v":0},{"$f":"SUM('1. n.é.:4. n.é.'!E24)","v":0},{"$nulls":6},0]
[null,null,{"$f":"SUM('1. n.é.:4. n.é.'!C25)","v":0},{"$f":"SUM('1. n.é.:4. n.é.'!D25)","v":0},{"$f":"SUM('1. n.é.:4. n.é.'!E25)","v":0},{"$nulls":6},0]
[null,null,{"$f":"SUM('1. n.é.:4. n.é.'!C26)","v":0},{"$f":"SUM('1. n.é.:4. n.é.'!D26)","v":0},{"$f":"SUM('1. n.é.:4. n.é.'!E26)","v":0},{"$nulls":6},0]
[null,null,{"$f":"SUM('1. n.é.:4. n.é.'!C27)","v":0},{"$f":"SUM('1. n.é.:4. n.é.'!D27)","v":0},{"$f":"SUM('1. n.é.:4. n.é.'!E27)","v":0},{"$nulls":6},0]
[null,null,{"$f":"SUM('1. n.é.:4. n.é.'!C28)","v":0},{"$f":"SUM('1. n.é.:4. n.é.'!D28)","v":0},{"$f":"SUM('1. n.é.:4. n.é.'!E28)","v":0},{"$nulls":6},0]
[null,null,{"$f":"SUM('1. n.é.:4. n.é.'!C29)","v":0},{"$f":"SUM('1. n.é.:4. n.é.'!D29)","v":0},{"$f":"SUM('1. n.é.:4. n.é.'!E29)","v":0},{"$nulls":6},0]
[null,null,{"$f":"SUM('1. n.é.:4. n.é.'!C30)","v":0},{"$f":"SUM('1. n.é.:4. n.é.'!D30)","v":0},{"$f":"SUM('1. n.é.:4. n.é.'!E30)","v":0},{"$nulls":6},0]
[null,null,{"$f":"SUM('1. n.é.:4. n.é.'!C31)","v":0},{"$f":"SUM('1. n.é.:4. n.é.'!D31)","v":0},{"$f":"SUM('1. n.é.:4. n.é.'!E31)","v":0},{"$nulls":6},0]
[null,null,{"$f":"SUM('1. n.é.:4. n.é.'!C32)","v":0},{"$f":"SUM('1. n.é.:4. n.é.'!D32)","v":0},{"$f":"SUM('1. n.é.:4. n.é.'!E32)","v":0},{"$nulls":6},0]
[null,null,{"$f":"SUM('1. n.é.:4. n.é.'!C33)","v":0},{"$f":"SUM('1. n.é.:4. n.é.'!D33)","v":0},{"$f":"SUM('1. n.é.:4. n.é.'!E33)","v":0},{"$nulls":6},0]
[null,null,{"$f":"SUM('1. n.é.:4. n.é.'!C34)","v":0},{"$f":"SUM('1. n.é.:4. n.é.'!D34)","v":0},{"$f":"SUM('1. n.é.:4. n.é.'!E34)","v":0},{"$nulls":6},0]
[null,null,{"$f":"SUM('1. n.é.:4. n.é.'!C35)","v":0},{"$f":"SUM('1. n.é.:4. n.é.'!D35)","v":0},{"$f":"SUM('1. n.é.:4. n.é.'!E35)","v":0},{"$nulls":6},0]
[null,null,{"$f":"SUM('1. n.é.:4. n.é.'!C36)","v":0},{"$f":"SUM('1. n.é.:4. n.é.'!D36)","v":0},{"$f":"SUM('1. n.é.:4. n.é.'!E36)","v":0},{"$nulls":6},0]

{"sheet":"1. n.é.","index":1,"n_rows":36,"n_cols":95,"rows_kept":36,"merged":[[3,0,3,6]]}
[{"$f":"Cégnév","v":"Cégnév"}]
["Jelenléti nyilvántartás, 1. negyedév"]
["Dátum"]
[{"$f":"Cégnév","v":"Cégnév"},{"$nulls":6},"BIZALMAS"]
["Vezetéknév","Utónév","Szabadság","Személyes távollét","Betegség","01.01","01.02","01.03","01.04","01.05","01.06","01.07","01.08","01.09","01.10","01.11","01.12","01.13","01.14","01.15","01.16","01.17","01.18","01.19","01.20","01.21","01.22","01.23","01.24","01.25","01.26","01.27","01.28","01.29","01.30","01.31","02.01","02.02","02.03","02.04","02.05","02.06","02.07","02.08","02.09","02.10","02.11","02.12","02.13","02.14","02.15","02.16","02.17","02.18","02.19","02.20","02.21","02.22","02.23","02.24","02.25","02.26","02.27","02.28","03.01","03.02","03.03","03.04","03.05","03.06","03.07","03.08","03.09","03.10","03.11","03.12","03.13","03.14","03.15","03.16","03.17","03.18","03.19","03.20","03.21","03.22","03.23","03.24","03.25","03.26","03.27","03.28","03.29","03.30","03.31"]
[{"$f":"IF(ISBLANK('Tárgyévi összegzés'!A6),\"\",'Tárgyévi összegzés'!A6)","v":"Vezetéknév"},{"$f":"IF(ISBLANK('Tárgyévi összegzés'!B6),\"\",'Tárgyévi összegzés'!B6)","v":"Utónév"},{"$f":"COUNTIF($F6:$CQ6, \"Sza\")","v":3},{"$f":"COUNTIF($F6:$CQ6, \"Sze\")","v":0},{"$f":"COUNTIF($F6:$CQ6, \"B\")","v":1},"sza","sza","sza",{"$nulls":4},"b"]
[{"$f":"IF(ISBLANK('Tárgyévi összegzés'!A7),\"\",'Tárgyévi összegzés'!A7)","v":""},{"$f":"IF(ISBLANK('Tárgyévi összegzés'!B7),\"\",'Tárgyévi összegzés'!B7)","v":""},0,0,0]
[{"$f":"IF(ISBLANK('Tárgyévi összegzés'!A8),\"\",'Tárgyévi összegzés'!A8)","v":""},{"$f":"IF(ISBLANK('Tárgyévi összegzés'!B8),\"\",'Tárgyévi összegzés'!B8)","v":""},0,0,0]
[{"$f":"IF(ISBLANK('Tárgyévi összegzés'!A9),\"\",'Tárgyévi összegzés'!A9)","v":""},{"$f":"IF(ISBLANK('Tárgyévi összegzés'!B9),\"\",'Tárgyévi összegzés'!B9)","v":""},0,0,0]
[{"$f":"IF(ISBLANK('Tárgyévi összegzés'!A10),\"\",'Tárgyévi összegzés'!A10)","v":""},{"$f":"IF(ISBLANK('Tárgyévi összegzés'!B10),\"\",'Tárgyévi összegzés'!B10)","v":""},0,0,0]
[{"$f":"IF(ISBLANK('Tárgyévi összegzés'!A11),\"\",'Tárgyévi összegzés'!A11)","v":""},{"$f":"IF(ISBLANK('Tárgyévi összegzés'!B11),\"\",'Tárgyévi összegzés'!B11)","v":""},0,0,0]
[{"$f":"IF(ISBLANK('Tárgyévi összegzés'!A12),\"\",'Tárgyévi összegzés'!A12)","v":""},{"$f":"IF(ISBLANK('Tárgyévi összegzés'!B12),\"\",'Tárgyévi összegzés'!B12)","v":""},0,0,0]
[{"$f":"IF(ISBLANK('Tárgyévi összegzés'!A13),\"\",'Tárgyévi összegzés'!A13)","v":""},{"$f":"IF(ISBLANK('Tárgyévi összegzés'!B13),\"\",'Tárgyévi összegzés'!B13)","v":""},0,0,0]
[{"$f":"IF(ISBLANK('Tárgyévi összegzés'!A14),\"\",'Tárgyévi összegzés'!A14)","v":""},{"$f":"IF(ISBLANK('Tárgyévi összegzés'!B14),\"\",'Tárgyévi összegzés'!B14)","v":""},0,0,0]
[{"$f":"IF(ISBLANK('Tárgyévi összegzés'!A15),\"\",'Tárgyévi összegzés'!A15)","v":""},{"$f":"IF(ISBLANK('Tárgyévi összegzés'!B15),\"\",'Tárgyévi összegzés'!B15)","v":""},0,0,0]
[{"$f":"IF(ISBLANK('Tárgyévi összegzés'!A16),\"\",'Tárgyévi összegzés'!A16)","v":""},{"$f":"IF(ISBLANK('Tárgyévi összegzés'!B16),\"\",'Tárgyévi összegzés'!B16)","v":""},0,0,0]
[{"$f":"IF(ISBLANK('Tárgyévi összegzés'!A17),\"\",'Tárgyévi összegzés'!A17)","v":""},{"$f":"IF(ISBLANK('Tárgyévi összegzés'!B17),\"\",'Tárgyévi összegzés'!B17)","v":""},0,0,0]
[{"$f":"IF(ISBLANK('Tárgyévi összegzés'!A18),\"\",'Tárgyévi összegzés'!A18)","v":""},{"$f":"IF(ISBLANK('Tárgyévi összegzés'!B18),\"\",'Tárgyévi összegzés'!B18)","v":""},0,0,0]
[{"$f":"IF(ISBLANK('Tárgyévi összegzés'!A19),\"\",'Tárgyévi összegzés'!A19)","v":""},{"$f":"IF(ISBLANK('Tárgyévi összegzés'!B19),\"\",'Tárgyévi összegzés'!B19)","v":""},0,0,0]
[{"$f":"IF(ISBLANK('Tárgyévi összegzés'!A20),\"\",'Tárgyévi összegzés'!A20)","v":""},{"$f":"IF(ISBLANK('Tárgyévi összegzés'!B20),\"\",'Tárgyévi összegzés'!B20)","v":""},0,0,0]
[{"$f":"IF(ISBLANK('Tárgyévi összegzés'!A21),\"\",'Tárgyévi összegzés'!A21)","v":""},{"$f":"IF(ISBLANK('Tárgyévi összegzés'!B21),\"\",'Tárgyévi összegzés'!B21)","v":""},0,0,0]
[{"$f":"IF(ISBLANK('Tárgyévi összegzés'!A22),\"\",'Tárgyévi összegzés'!A22)","v":""},{"$f":"IF(ISBLANK('Tárgyévi összegzés'!B22),\"\",'Tárgyévi összegzés'!B22)","v":""},0,0,0]
[{"$f":"IF(ISBLANK('Tárgyévi összegzés'!A23),\"\",'Tárgyévi összegzés'!A23)","v":""},{"$f":"IF(ISBLANK('Tárgyévi összegzés'!B23),\"\",'Tárgyévi összegzés'!B23)","v":""},0,0,0]
[{"$f":"IF(ISBLANK('Tárgyévi összegzés'!A24),\"\",'Tárgyévi összegzés'!A24)","v":""},{"$f":"IF(ISBLANK('Tárgyévi összegzés'!B24),\"\",'Tárgyévi összegzés'!B24)","v":""},0,0,0]
[{"$f":"IF(ISBLANK('Tárgyévi összegzés'!A25),\"\",'Tárgyévi összegzés'!A25)","v":""},{"$f":"IF(ISBLANK('Tárgyévi összegzés'!B25),\"\",'Tárgyévi összegzés'!B25)","v":""},0,0,0]
[{"$f":"IF(ISBLANK('Tárgyévi összegzés'!A26),\"\",'Tárgyévi összegzés'!A26)","v":""},{"$f":"IF(ISBLANK('Tárgyévi összegzés'!B26),\"\",'Tárgyévi összegzés'!B26)","v":""},0,0,0]
[{"$f":"IF(ISBLANK('Tárgyévi összegzés'!A27),\"\",'Tárgyévi összegzés'!A27)","v":""},{"$f":"IF(ISBLANK('Tárgyévi összegzés'!B27),\"\",'Tárgyévi összegzés'!B27)","v":""},0,0,0]
[{"$f":"IF(ISBLANK('Tárgyévi összegzés'!A28),\"\",'Tárgyévi összegzés'!A28)","v":""},{"$f":"IF(ISBLANK('Tárgyévi összegzés'!B28),\"\",'Tárgyévi összegzés'!B28)","v":""},0,0,0]
[{"$f":"IF(ISBLANK('Tárgyévi összegzés'!A29),\"\",'Tárgyévi összegzés'!A29)","v":""},{"$f":"IF(ISBLANK('Tárgyévi összegzés'!B29),\"\",'Tárgyévi összegzés'!B29)","v":""},0,0,0]
[{"$f":"IF(ISBLANK('Tárgyévi összegzés'!A30),\"\",'Tárgyévi összegzés'!A30)","v":""},{"$f":"IF(ISBLANK('Tárgyévi összegzés'!B30),\"\",'Tárgyévi összegzés'!B30)","v":""},0,0,0]
[{"$f":"IF(ISBLANK('Tárgyévi összegzés'!A31),\"\",'Tárgyévi összegzés'!A31)","v":""},{"$f":"IF(ISBLANK('Tárgyévi összegzés'!B31),\"\",'Tárgyévi összegzés'!B31)","v":""},0,0,0]
[{"$f":"IF(ISBLANK('Tárgyévi összegzés'!A32),\"\",'Tárgyévi összegzés'!A32)","v":""},{"$f":"IF(ISBLANK('Tárgyévi összegzés'!B32),\"\",'Tárgyévi összegzés'!B32)","v":""},0,0,0]
[{"$f":"IF(ISBLANK('Tárgyévi összegzés'!A33),\"\",'Tárgyévi összegzés'!A33)","v":""},{"$f":"IF(ISBLANK('Tárgyévi összegzés'!B33),\"\",'Tárgyévi összegzés'!B33)","v":""},0,0,0]
[{"$f":"IF(ISBLANK('Tárgyévi összegzés'!A34),\"\",'Tárgyévi összegzés'!A34)","v":""},{"$f":"IF(ISBLANK('Tárgyévi összegzés'!B34),\"\",'Tárgyévi összegzés'!B34)","v":""},0,0,0]
[{"$f":"IF(ISBLANK('Tárgyévi összegzés'!A35),\"\",'Tárgyévi összegzés'!A35)","v":""},{"$f":"IF(ISBLANK('Tárgyévi összegzés'!B35),\"\",'Tárgyévi összegzés'!B35)","v":""},0,0,0]
[{"$f":"IF(ISBLANK('Tárgyévi összegzés'!A36),\"\",'Tárgyévi összegzés'!A36)","v":""},{"$f":"IF(ISBLANK('Tárgyévi összegzés'!B36),\"\",'Tárgyévi összegzés'!B36)","v":""},0,0,0]

{"sheet":"2. n.é.","index":2,"n_rows":36,"n_cols":96,"rows_kept":36,"merged":[[3,0,3,6]]}
[{"$f":"Cégnév","v":"Cégnév"}]
["Jelenléti nyilvántartás, 2. negyedév"]
["Dátum"]
[{"$f":"Cégnév","v":"Cégnév"},{"$nulls":6},"BIZALMAS"]
["Vezetéknév","Utónév","Szabadság","Személyes távollét","Betegség","04.01","04.02","04.03","04.04","04.05","04.06","04.07","04.08","04.09","04.10","04.11","04.12","04.13","04.14","04.15","04.16","04.17","04.18","04.19","04.20","04.21","04.22","04.23","04.24","04.25","04.26","04.27","04.28","04.29","04.30","05.01","05.02","05.03","05.04","05.05","05.06","05.07","05.08","05.09","05.10","05.11","05.12","05.13","05.14","05.15","05.16","05.17","05.18","05.19","05.20","05.21","05.22","05.23","05.24","05.25","05.26","05.27","05.28","05.29","05.30","05.31","06.01","06.02","06.03","06.04","06.05","06.06","06.07","06.08","06.09","06.10","06.11","06.12","06.13","06.14","06.15","06.16","06.17","06.18","06.19","06.20","06.21","06.22","06.23","06.24","06.25","06.26","06.27","06.28","06.29","06.30"]
[{"$f":"IF(ISBLANK('Tárgyévi összegzés'!A6),\"\",'Tárgyévi összegzés'!A6)","v":"Vezetéknév"},{"$f":"IF(ISBLANK('Tárgyévi összegzés'!B6),\"\",'Tárgyévi összegzés'!B6)","v":"Utónév"},{"$f":"COUNTIF($F6:$CR6, \"Sza\")","v":0},{"$f":"COUNTIF($F6:$CR6, \"Sze\")","v":0},{"$f":"COUNTIF($F6:$CR6, \"B\")","v":0}]
[{"$f":"IF(ISBLANK('Tárgyévi összegzés'!A7),\"\",'Tárgyévi összegzés'!A7)","v":""},{"$f":"IF(ISBLANK('Tárgyévi összegzés'!B7),\"\",'Tárgyévi összegzés'!B7)","v":""},0,0,0]
[{"$f":"IF(ISBLANK('Tárgyévi összegzés'!A8),\"\",'Tárgyévi összegzés'!A8)","v":""},{"$f":"IF(ISBLANK('Tárgyévi összegzés'!B8),\"\",'Tárgyévi összegzés'!B8)","v":""},0,0,0]
[{"$f":"IF(ISBLANK('Tárgyévi összegzés'!A9),\"\",'Tárgyévi összegzés'!A9)","v":""},{"$f":"IF(ISBLANK('Tárgyévi összegzés'!B9),\"\",'Tárgyévi összegzés'!B9)","v":""},0,0,0]
[{"$f":"IF(ISBLANK('Tárgyévi összegzés'!A10),\"\",'Tárgyévi összegzés'!A10)","v":""},{"$f":"IF(ISBLANK('Tárgyévi összegzés'!B10),\"\",'Tárgyévi összegzés'!B10)","v":""},0,0,0]
[{"$f":"IF(ISBLANK('Tárgyévi összegzés'!A11),\"\",'Tárgyévi összegzés'!A11)","v":""},{"$f":"IF(ISBLANK('Tárgyévi összegzés'!B11),\"\",'Tárgyévi összegzés'!B11)","v":""},0,0,0]
[{"$f":"IF(ISBLANK('Tárgyévi összegzés'!A12),\"\",'Tárgyévi összegzés'!A12)","v":""},{"$f":"IF(ISBLANK('Tárgyévi összegzés'!B12),\"\",'Tárgyévi összegzés'!B12)","v":""},0,0,0]
[{"$f":"IF(ISBLANK('Tárgyévi összegzés'!A13),\"\",'Tárgyévi összegzés'!A13)","v":""},{"$f":"IF(ISBLANK('Tárgyévi összegzés'!B13),\"\",'Tárgyévi összegzés'!B13)","v":""},0,0,0]
[{"$f":"IF(ISBLANK('Tárgyévi összegzés'!A14),\"\",'Tárgyévi összegzés'!A14)","v":""},{"$f":"IF(ISBLANK('Tárgyévi összegzés'!B14),\"\",'Tárgyévi összegzés'!B14)","v":""},0,0,0]
[{"$f":"IF(ISBLANK('Tárgyévi összegzés'!A15),\"\",'Tárgyévi összegzés'!A15)","v":""},{"$f":"IF(ISBLANK('Tárgyévi összegzés'!B15),\"\",'Tárgyévi összegzés'!B15)","v":""},0,0,0]
[{"$f":"IF(ISBLANK('Tárgyévi összegzés'!A16),\"\",'Tárgyévi összegzés'!A16)","v":""},{"$f":"IF(ISBLANK('Tárgyévi összegzés'!B16),\"\",'Tárgyévi összegzés'!B16)","v":""},0,0,0]
[{"$f":"IF(ISBLANK('Tárgyévi összegzés'!A17),\"\",'Tárgyévi összegzés'!A17)","v":""},{"$f":"IF(ISBLANK('Tárgyévi összegzés'!B17),\"\",'Tárgyévi összegzés'!B17)","v":""},0,0,0]
[{"$f":"IF(ISBLANK('Tárgyévi összegzés'!A18),\"\",'Tárgyévi összegzés'!A18)","v":""},{"$f":"IF(ISBLANK('Tárgyévi összegzés'!B18),\"\",'Tárgyévi összegzés'!B18)","v":""},0,0,0]
[{"$f":"IF(ISBLANK('Tárgyévi összegzés'!A19),\"\",'Tárgyévi összegzés'!A19)","v":""},{"$f":"IF(ISBLANK('Tárgyévi összegzés'!B19),\"\",'Tárgyévi összegzés'!B19)","v":""},0,0,0]
[{"$f":"IF(ISBLANK('Tárgyévi összegzés'!A20),\"\",'Tárgyévi összegzés'!A20)","v":""},{"$f":"IF(ISBLANK('Tárgyévi összegzés'!B20),\"\",'Tárgyévi összegzés'!B20)","v":""},0,0,0]
[{"$f":"IF(ISBLANK('Tárgyévi összegzés'!A21),\"\",'Tárgyévi összegzés'!A21)","v":""},{"$f":"IF(ISBLANK('Tárgyévi összegzés'!B21),\"\",'Tárgyévi összegzés'!B21)","v":""},0,0,0]
[{"$f":"IF(ISBLANK('Tárgyévi összegzés'!A22),\"\",'Tárgyévi összegzés'!A22)","v":""},{"$f":"IF(ISBLANK('Tárgyévi összegzés'!B22),\"\",'Tárgyévi összegzés'!B22)","v":""},0,0,0]
[{"$f":"IF(ISBLANK('Tárgyévi összegzés'!A23),\"\",'Tárgyévi összegzés'!A23)","v":""},{"$f":"IF(ISBLANK('Tárgyévi összegzés'!B23),\"\",'Tárgyévi összegzés'!B23)","v":""},0,0,0]
[{"$f":"IF(ISBLANK('Tárgyévi összegzés'!A24),\"\",'Tárgyévi összegzés'!A24)","v":""},{"$f":"IF(ISBLANK('Tárgyévi összegzés'!B24),\"\",'Tárgyévi összegzés'!B24)","v":""},0,0,0]
[{"$f":"IF(ISBLANK('Tárgyévi összegzés'!A25),\"\",'Tárgyévi összegzés'!A25)","v":""},{"$f":"IF(ISBLANK('Tárgyévi összegzés'!B25),\"\",'Tárgyévi összegzés'!B25)","v":""},0,0,0]
[{"$f":"IF(ISBLANK('Tárgyévi összegzés'!A26),\"\",'Tárgyévi összegzés'!A26)","v":""},{"$f":"IF(ISBLANK('Tárgyévi összegzés'!B26),\"\",'Tárgyévi összegzés'!B26)","v":""},0,0,0]
[{"$f":"IF(ISBLANK('Tárgyévi összegzés'!A27),\"\",'Tárgyévi összegzés'!A27)","v":""},{"$f":"IF(ISBLANK('Tárgyévi összegzés'!B27),\"\",'Tárgyévi összegzés'!B27)","v":""},0,0,0]
[{"$f":"IF(ISBLANK('Tárgyévi összegzés'!A28),\"\",'Tárgyévi összegzés'!A28)","v":""},{"$f":"IF(ISBLANK('Tárgyévi összegzés'!B28),\"\",'Tárgyévi összegzés'!B28)","v":""},0,0,0]
[{"$f":"IF(ISBLANK('Tárgyévi összegzés'!A29),\"\",'Tárgyévi összegzés'!A29)","v":""},{"$f":"IF(ISBLANK('Tárgyévi összegzés'!B29),\"\",'Tárgyévi összegzés'!B29)","v":""},0,0,0]
[{"$f":"IF(ISBLANK('Tárgyévi összegzés'!A30),\"\",'Tárgyévi összegzés'!A30)","v":""},{"$f":"IF(ISBLANK('Tárgyévi összegzés'!B30),\"\",'Tárgyévi összegzés'!B30)","v":""},0,0,0]
[{"$f":"IF(ISBLANK('Tárgyévi összegzés'!A31),\"\",'Tárgyévi összegzés'!A31)","v":""},{"$f":"IF(ISBLANK('Tárgyévi összegzés'!B31),\"\",'Tárgyévi összegzés'!B31)","v":""},0,0,0]
[{"$f":"IF(ISBLANK('Tárgyévi összegzés'!A32),\"\",'Tárgyévi összegzés'!A32)","v":""},{"$f":"IF(ISBLANK('Tárgyévi összegzés'!B32),\"\",'Tárgyévi összegzés'!B32)","v":""},0,0,0]
[{"$f":"IF(ISBLANK('Tárgyévi összegzés'!A33),\"\",'Tárgyévi összegzés'!A33)","v":""},{"$f":"IF(ISBLANK('Tárgyévi összegzés'!B33),\"\",'Tárgyévi összegzés'!B33)","v":""},0,0,0]
[{"$f":"IF(ISBLANK('Tárgyévi összegzés'!A34),\"\",'Tárgyévi összegzés'!A34)","v":""},{"$f":"IF(ISBLANK('Tárgyévi összegzés'!B34),\"\",'Tárgyévi összegzés'!B34)","v":""},0,0,0]
[{"$f":"IF(ISBLANK('Tárgyévi összegzés'!A35),\"\",'Tárgyévi összegzés'!A35)","v":""},{"$f":"IF(ISBLANK('Tárgyévi összegzés'!B35),\"\",'Tárgyévi összegzés'!B35)","v":""},0,0,0]
[{"$f":"IF(ISBLANK('Tárgyévi összegzés'!A36),\"\",'Tárgyévi összegzés'!A36)","v":""},{"$f":"IF(ISBLANK('Tárgyévi összegzés'!B36),\"\",'Tárgyévi összegzés'!B36)","v":""},0,0,0]

{"sheet":"3. n.é.","index":3,"n_rows":36,"n_cols":97,"rows_kept":36,"merged":[[3,0,3,6]]}
[{"$f":"Cégnév","v":"Cégnév"}]
["Jelenléti nyilvántartás, 3. negyedév"]
["Dátum"]
[{"$f":"Cégnév","v":"Cégnév"},{"$nulls":6},"BIZALMAS"]
["Vezetéknév","Utónév","Szabadság","Személyes távollét","Betegség","07.01","07.02","07.03","07.04","07.05","07.06","07.07","07.08","07.09","07.10","07.11","07.12","07.13","07.14","07.15","07.16","07.17","07.18","07.19","07.20","07.21","07.22","07.23","07.24","07.25","07.26","07.27","07.28","07.29","07.30","07.31","08.01","08.02","08.03","08.04","08.05","08.06","08.07","08.08","08.09","08.10","08.11","08.12","08.13","08.14","08.15","08.16","08.17","08.18","08.19","08.20","08.21","08.22","08.23","08.24","08.25","08.26","08.27","08.28","08.29","08.30","08.31","09.01","09.02","09.03","09.04","09.05","09.06","09.07","09.08","09.09","09.10","09.11","09.12","09.13","09.14","09.15","09.16","09.17","09.18","09.19","09.20","09.21","09.22","09.23","09.24","09.25","09.26","09.27","09.28","09.29","09.30"]
[{"$f":"IF(ISBLANK('Tárgyévi összegzés'!A6),\"\",'Tárgyévi összegzés'!A6)","v":"Vezetéknév"},{"$f":"IF(ISBLANK('Tárgyévi összegzés'!B6),\"\",'Tárgyévi összegzés'!B6)","v":"Utónév"},{"$f":"COUNTIF($F6:$CS6, \"Sza\")","v":0},{"$f":"COUNTIF($F6:$CS6, \"Sze\")","v":0},{"$f":"COUNTIF($F6:$CS6, \"B\")","v":0}]
[{"$f":"IF(ISBLANK('Tárgyévi összegzés'!A7),\"\",'Tárgyévi összegzés'!A7)","v":""},{"$f":"IF(ISBLANK('Tárgyévi összegzés'!B7),\"\",'Tárgyévi összegzés'!B7)","v":""},0,0,0]
[{"$f":"IF(ISBLANK('Tárgyévi összegzés'!A8),\"\",'Tárgyévi összegzés'!A8)","v":""},{"$f":"IF(ISBLANK('Tárgyévi összegzés'!B8),\"\",'Tárgyévi összegzés'!B8)","v":""},0,0,0]
[{"$f":"IF(ISBLANK('Tárgyévi összegzés'!A9),\"\",'Tárgyévi összegzés'!A9)","v":""},{"$f":"IF(ISBLANK('Tárgyévi összegzés'!B9),\"\",'Tárgyévi összegzés'!B9)","v":""},0,0,0]
[{"$f":"IF(ISBLANK('Tárgyévi összegzés'!A10),\"\",'Tárgyévi összegzés'!A10)","v":""},{"$f":"IF(ISBLANK('Tárgyévi összegzés'!B10),\"\",'Tárgyévi összegzés'!B10)","v":""},0,0,0]
[{"$f":"IF(ISBLANK('Tárgyévi összegzés'!A11),\"\",'Tárgyévi összegzés'!A11)","v":""},{"$f":"IF(ISBLANK('Tárgyévi összegzés'!B11),\"\",'Tárgyévi összegzés'!B11)","v":""},0,0,0]
[{"$f":"IF(ISBLANK('Tárgyévi összegzés'!A12),\"\",'Tárgyévi összegzés'!A12)","v":""},{"$f":"IF(ISBLANK('Tárgyévi összegzés'!B12),\"\",'Tárgyévi összegzés'!B12)","v":""},0,0,0]
[{"$f":"IF(ISBLANK('Tárgyévi összegzés'!A13),\"\",'Tárgyévi összegzés'!A13)","v":""},{"$f":"IF(ISBLANK('Tárgyévi összegzés'!B13),\"\",'Tárgyévi összegzés'!B13)","v":""},0,0,0]
[{"$f":"IF(ISBLANK('Tárgyévi összegzés'!A14),\"\",'Tárgyévi összegzés'!A14)","v":""},{"$f":"IF(ISBLANK('Tárgyévi összegzés'!B14),\"\",'Tárgyévi összegzés'!B14)","v":""},0,0,0]
[{"$f":"IF(ISBLANK('Tárgyévi összegzés'!A15),\"\",'Tárgyévi összegzés'!A15)","v":""},{"$f":"IF(ISBLANK('Tárgyévi összegzés'!B15),\"\",'Tárgyévi összegzés'!B15)","v":""},0,0,0]
[{"$f":"IF(ISBLANK('Tárgyévi összegzés'!A16),\"\",'Tárgyévi összegzés'!A16)","v":""},{"$f":"IF(ISBLANK('Tárgyévi összegzés'!B16),\"\",'Tárgyévi összegzés'!B16)","v":""},0,0,0]
[{"$f":"IF(ISBLANK('Tárgyévi összegzés'!A17),\"\",'Tárgyévi összegzés'!A17)","v":""},{"$f":"IF(ISBLANK('Tárgyévi összegzés'!B17),\"\",'Tárgyévi összegzés'!B17)","v":""},0,0,0]
[{"$f":"IF(ISBLANK('Tárgyévi összegzés'!A18),\"\",'Tárgyévi összegzés'!A18)","v":""},{"$f":"IF(ISBLANK('Tárgyévi összegzés'!B18),\"\",'Tárgyévi összegzés'!B18)","v":""},0,0,0]
[{"$f":"IF(ISBLANK('Tárgyévi összegzés'!A19),\"\",'Tárgyévi összegzés'!A19)","v":""},{"$f":"IF(ISBLANK('Tárgyévi összegzés'!B19),\"\",'Tárgyévi összegzés'!B19)","v":""},0,0,0]
[{"$f":"IF(ISBLANK('Tárgyévi összegzés'!A20),\"\",'Tárgyévi összegzés'!A20)","v":""},{"$f":"IF(ISBLANK('Tárgyévi összegzés'!B20),\"\",'Tárgyévi összegzés'!B20)","v":""},0,0,0]
[{"$f":"IF(ISBLANK('Tárgyévi összegzés'!A21),\"\",'Tárgyévi összegzés'!A21)","v":""},{"$f":"IF(ISBLANK('Tárgyévi összegzés'!B21),\"\",'Tárgyévi összegzés'!B21)","v":""},0,0,0]
[{"$f":"IF(ISBLANK('Tárgyévi összegzés'!A22),\"\",'Tárgyévi összegzés'!A22)","v":""},{"$f":"IF(ISBLANK('Tárgyévi összegzés'!B22),\"\",'Tárgyévi összegzés'!B22)","v":""},0,0,0]
[{"$f":"IF(ISBLANK('Tárgyévi összegzés'!A23),\"\",'Tárgyévi összegzés'!A23)","v":""},{"$f":"IF(ISBLANK('Tárgyévi összegzés'!B23),\"\",'Tárgyévi összegzés'!B23)","v":""},0,0,0]
[{"$f":"IF(ISBLANK('Tárgyévi összegzés'!A24),\"\",'Tárgyévi összegzés'!A24)","v":""},{"$f":"IF(ISBLANK('Tárgyévi összegzés'!B24),\"\",'Tárgyévi összegzés'!B24)","v":""},0,0,0]
[{"$f":"IF(ISBLANK('Tárgyévi összegzés'!A25),\"\",'Tárgyévi összegzés'!A25)","v":""},{"$f":"IF(ISBLANK('Tárgyévi összegzés'!B25),\"\",'Tárgyévi összegzés'!B25)","v":""},0,0,0]
[{"$f":"IF(ISBLANK('Tárgyévi összegzés'!A26),\"\",'Tárgyévi összegzés'!A26)","v":""},{"$f":"IF(ISBLANK('Tárgyévi összegzés'!B26),\"\",'Tárgyévi összegzés'!B26)","v":""},0,0,0]
[{"$f":"IF(ISBLANK('Tárgyévi összegzés'!A27),\"\",'Tárgyévi összegzés'!A27)","v":""},{"$f":"IF(ISBLANK('Tárgyévi összegzés'!B27),\"\",'Tárgyévi összegzés'!B27)","v":""},0,0,0]
[{"$f":"IF(ISBLANK('Tárgyévi összegzés'!A28),\"\",'Tárgyévi összegzés'!A28)","v":""},{"$f":"IF(ISBLANK('Tárgyévi összegzés'!B28),\"\",'Tárgyévi összegzés'!B28)","v":""},0,0,0]
[{"$f":"IF(ISBLANK('Tárgyévi összegzés'!A29),\"\",'Tárgyévi összegzés'!A29)","v":""},{"$f":"IF(ISBLANK('Tárgyévi összegzés'!B29),\"\",'Tárgyévi összegzés'!B29)","v":""},0,0,0]
[{"$f":"IF(ISBLANK('Tárgyévi összegzés'!A30),\"\",'Tárgyévi összegzés'!A30)","v":""},{"$f":"IF(ISBLANK('Tárgyévi összegzés'!B30),\"\",'Tárgyévi összegzés'!B30)","v":""},0,0,0]
[{"$f":"IF(ISBLANK('Tárgyévi összegzés'!A31),\"\",'Tárgyévi összegzés'!A31)","v":""},{"$f":"IF(ISBLANK('Tárgyévi összegzés'!B31),\"\",'Tárgyévi összegzés'!B31)","v":""},0,0,0]
[{"$f":"IF(ISBLANK('Tárgyévi összegzés'!A32),\"\",'Tárgyévi összegzés'!A32)","v":""},{"$f":"IF(ISBLANK('Tárgyévi összegzés'!B32),\"\",'Tárgyévi összegzés'!B32)","v":""},0,0,0]
[{"$f":"IF(ISBLANK('Tárgyévi összegzés'!A33),\"\",'Tárgyévi összegzés'!A33)","v":""},{"$f":"IF(ISBLANK('Tárgyévi összegzés'!B33),\"\",'Tárgyévi összegzés'!B33)","v":""},0,0,0]
[{"$f":"IF(ISBLANK('Tárgyévi összegzés'!A34),\"\",'Tárgyévi összegzés'!A34)","v":""},{"$f":"IF(ISBLANK('Tárgyévi összegzés'!B34),\"\",'Tárgyévi összegzés'!B34)","v":""},0,0,0]
[{"$f":"IF(ISBLANK('Tárgyévi összegzés'!A35),\"\",'Tárgyévi összegzés'!A35)","v":""},{"$f":"IF(ISBLANK('Tárgyévi összegzés'!B35),\"\",'Tárgyévi összegzés'!B35)","v":""},0,0,0]
[{"$f":"IF(ISBLANK('Tárgyévi összegzés'!A36),\"\",'Tárgyévi összegzés'!A36)","v":""},{"$f":"IF(ISBLANK('Tárgyévi összegzés'!B36),\"\",'Tárgyévi összegzés'!B36)","v":""},0,0,0]

{"sheet":"4. n.é.","index":4,"n_rows":36,"n_cols":97,"rows_kept":36,"merged":[[3,0,3,6]]}
[{"$f":"Cégnév","v":"Cégnév"}]
["Jelenléti nyilvántartás, 4. negyedév"]
["Dátum"]
[{"$f":"Cégnév","v":"Cégnév"},{"$nulls":6},"BIZALMAS"]
["Vezetéknév","Utónév","Szabadság","Személyes távollét","Betegség","10.01","10.02","10.03","10.04","10.05","10.06","10.07","10.08","10.09","10.10","10.11","10.12","10.13","10.14","10.15","10.16","10.17","10.18","10.19","10.20","10.21","10.22","10.23","10.24","10.25","10.26","10.27","10.28","10.29","10.30","10.31","11.01","11.02","11.03","11.04","11.05","11.06","11.07","11.08","11.09","11.10","11.11","11.12","11.13","11.14","11.15","11.16","11.17","11.18","11.19","11.20","11.21","11.22","11.23","11.24","11.25","11.26","11.27","11.28","11.29","11.30","12.01","12.02","12.03","12.04","12.05","12.06","12.07","12.08","12.09","12.10","12.11","12.12","12.13","12.14","12.15","12.16","12.17","12.18","12.19","12.20","12.21","12.22","12.23","12.24","12.25","12.26","12.27","12.28","12.29","12.30","12.31"]
[{"$f":"IF(ISBLANK('Tárgyévi összegzés'!A6),\"\",'Tárgyévi összegzés'!A6)","v":"Vezetéknév"},{"$f":"IF(ISBLANK('Tárgyévi összegzés'!B6),\"\",'Tárgyévi összegzés'!B6)","v":"Utónév"},{"$f":"COUNTIF($F6:$CS6, \"Sza\")","v":0},{"$f":"COUNTIF($F6:CS6, \"Sze\")","v":0},{"$f":"COUNTIF($F6:CS6, \"B\")","v":0}]
[{"$f":"IF(ISBLANK('Tárgyévi összegzés'!A7),\"\",'Tárgyévi összegzés'!A7)","v":""},{"$f":"IF(ISBLANK('Tárgyévi összegzés'!B7),\"\",'Tárgyévi összegzés'!B7)","v":""},0,{"$f":"COUNTIF($F7:CS7, \"Sze\")","v":0},{"$f":"COUNTIF($F7:CS7, \"B\")","v":0}]
[{"$f":"IF(ISBLANK('Tárgyévi összegzés'!A8),\"\",'Tárgyévi összegzés'!A8)","v":""},{"$f":"IF(ISBLANK('Tárgyévi összegzés'!B8),\"\",'Tárgyévi összegzés'!B8)","v":""},0,{"$f":"COUNTIF($F8:CS8, \"Sze\")","v":0},{"$f":"COUNTIF($F8:CS8, \"B\")","v":0}]
[{"$f":"IF(ISBLANK('Tárgyévi összegzés'!A9),\"\",'Tárgyévi összegzés'!A9)","v":""},{"$f":"IF(ISBLANK('Tárgyévi összegzés'!B9),\"\",'Tárgyévi összegzés'!B9)","v":""},0,{"$f":"COUNTIF($F9:CS9, \"Sze\")","v":0},{"$f":"COUNTIF($F9:CS9, \"B\")","v":0}]
[{"$f":"IF(ISBLANK('Tárgyévi összegzés'!A10),\"\",'Tárgyévi összegzés'!A10)","v":""},{"$f":"IF(ISBLANK('Tárgyévi összegzés'!B10),\"\",'Tárgyévi összegzés'!B10)","v":""},0,{"$f":"COUNTIF($F10:CS10, \"Sze\")","v":0},{"$f":"COUNTIF($F10:CS10, \"B\")","v":0}]
[{"$f":"IF(ISBLANK('Tárgyévi összegzés'!A11),\"\",'Tárgyévi összegzés'!A11)","v":""},{"$f":"IF(ISBLANK('Tárgyévi összegzés'!B11),\"\",'Tárgyévi összegzés'!B11)","v":""},0,{"$f":"COUNTIF($F11:CS11, \"Sze\")","v":0},{"$f":"COUNTIF($F11:CS11, \"B\")","v":0}]
[{"$f":"IF(ISBLANK('Tárgyévi összegzés'!A12),\"\",'Tárgyévi összegzés'!A12)","v":""},{"$f":"IF(ISBLANK('Tárgyévi összegzés'!B12),\"\",'Tárgyévi összegzés'!B12)","v":""},0,{"$f":"COUNTIF($F12:CS12, \"Sze\")","v":0},{"$f":"COUNTIF($F12:CS12, \"B\")","v":0}]
[{"$f":"IF(ISBLANK('Tárgyévi összegzés'!A13),\"\",'Tárgyévi összegzés'!A13)","v":""},{"$f":"IF(ISBLANK('Tárgyévi összegzés'!B13),\"\",'Tárgyévi összegzés'!B13)","v":""},0,{"$f":"COUNTIF($F13:CS13, \"Sze\")","v":0},{"$f":"COUNTIF($F13:CS13, \"B\")","v":0}]
[{"$f":"IF(ISBLANK('Tárgyévi összegzés'!A14),\"\",'Tárgyévi összegzés'!A14)","v":""},{"$f":"IF(ISBLANK('Tárgyévi összegzés'!B14),\"\",'Tárgyévi összegzés'!B14)","v":""},0,{"$f":"COUNTIF($F14:CS14, \"Sze\")","v":0},{"$f":"COUNTIF($F14:CS14, \"B\")","v":0}]
[{"$f":"IF(ISBLANK('Tárgyévi összegzés'!A15),\"\",'Tárgyévi összegzés'!A15)","v":""},{"$f":"IF(ISBLANK('Tárgyévi összegzés'!B15),\"\",'Tárgyévi összegzés'!B15)","v":""},0,{"$f":"COUNTIF($F15:CS15, \"Sze\")","v":0},{"$f":"COUNTIF($F15:CS15, \"B\")","v":0}]
[{"$f":"IF(ISBLANK('Tárgyévi összegzés'!A16),\"\",'Tárgyévi összegzés'!A16)","v":""},{"$f":"IF(ISBLANK('Tárgyévi összegzés'!B16),\"\",'Tárgyévi összegzés'!B16)","v":""},0,{"$f":"COUNTIF($F16:CS16, \"Sze\")","v":0},{"$f":"COUNTIF($F16:CS16, \"B\")","v":0}]
[{"$f":"IF(ISBLANK('Tárgyévi összegzés'!A17),\"\",'Tárgyévi összegzés'!A17)","v":""},{"$f":"IF(ISBLANK('Tárgyévi összegzés'!B17),\"\",'Tárgyévi összegzés'!B17)","v":""},0,{"$f":"COUNTIF($F17:CS17, \"Sze\")","v":0},{"$f":"COUNTIF($F17:CS17, \"B\")","v":0}]
[{"$f":"IF(ISBLANK('Tárgyévi összegzés'!A18),\"\",'Tárgyévi összegzés'!A18)","v":""},{"$f":"IF(ISBLANK('Tárgyévi összegzés'!B18),\"\",'Tárgyévi összegzés'!B18)","v":""},0,{"$f":"COUNTIF($F18:CS18, \"Sze\")","v":0},{"$f":"COUNTIF($F18:CS18, \"B\")","v":0}]
[{"$f":"IF(ISBLANK('Tárgyévi összegzés'!A19),\"\",'Tárgyévi összegzés'!A19)","v":""},{"$f":"IF(ISBLANK('Tárgyévi összegzés'!B19),\"\",'Tárgyévi összegzés'!B19)","v":""},0,{"$f":"COUNTIF($F19:CS19, \"Sze\")","v":0},{"$f":"COUNTIF($F19:CS19, \"B\")","v":0}]
[{"$f":"IF(ISBLANK('Tárgyévi összegzés'!A20),\"\",'Tárgyévi összegzés'!A20)","v":""},{"$f":"IF(ISBLANK('Tárgyévi összegzés'!B20),\"\",'Tárgyévi összegzés'!B20)","v":""},0,{"$f":"COUNTIF($F20:CS20, \"Sze\")","v":0},{"$f":"COUNTIF($F20:CS20, \"B\")","v":0}]
[{"$f":"IF(ISBLANK('Tárgyévi összegzés'!A21),\"\",'Tárgyévi összegzés'!A21)","v":""},{"$f":"IF(ISBLANK('Tárgyévi összegzés'!B21),\"\",'Tárgyévi összegzés'!B21)","v":""},0,{"$f":"COUNTIF($F21:CS21, \"Sze\")","v":0},{"$f":"COUNTIF($F21:CS21, \"B\")","v":0}]
[{"$f":"IF(ISBLANK('Tárgyévi összegzés'!A22),\"\",'Tárgyévi összegzés'!A22)","v":""},{"$f":"IF(ISBLANK('Tárgyévi összegzés'!B22),\"\",'Tárgyévi összegzés'!B22)","v":""},0,{"$f":"COUNTIF($F22:CS22, \"Sze\")","v":0},{"$f":"COUNTIF($F22:CS22, \"B\")","v":0}]
[{"$f":"IF(ISBLANK('Tárgyévi összegzés'!A23),\"\",'Tárgyévi összegzés'!A23)","v":""},{"$f":"IF(ISBLANK('Tárgyévi összegzés'!B23),\"\",'Tárgyévi összegzés'!B23)","v":""},0,{"$f":"COUNTIF($F23:CS23, \"Sze\")","v":0},{"$f":"COUNTIF($F23:CS23, \"B\")","v":0}]
[{"$f":"IF(ISBLANK('Tárgyévi összegzés'!A24),\"\",'Tárgyévi összegzés'!A24)","v":""},{"$f":"IF(ISBLANK('Tárgyévi összegzés'!B24),\"\",'Tárgyévi összegzés'!B24)","v":""},0,{"$f":"COUNTIF($F24:CS24, \"Sze\")","v":0},{"$f":"COUNTIF($F24:CS24, \"B\")","v":0}]
[{"$f":"IF(ISBLANK('Tárgyévi összegzés'!A25),\"\",'Tárgyévi összegzés'!A25)","v":""},{"$f":"IF(ISBLANK('Tárgyévi összegzés'!B25),\"\",'Tárgyévi összegzés'!B25)","v":""},0,{"$f":"COUNTIF($F25:CS25, \"Sze\")","v":0},{"$f":"COUNTIF($F25:CS25, \"B\")","v":0}]
[{"$f":"IF(ISBLANK('Tárgyévi összegzés'!A26),\"\",'Tárgyévi összegzés'!A26)","v":""},{"$f":"IF(ISBLANK('Tárgyévi összegzés'!B26),\"\",'Tárgyévi összegzés'!B26)","v":""},0,{"$f":"COUNTIF($F26:CS26, \"Sze\")","v":0},{"$f":"COUNTIF($F26:CS26, \"B\")","v":0}]
[{"$f":"IF(ISBLANK('Tárgyévi összegzés'!A27),\"\",'Tárgyévi összegzés'!A27)","v":""},{"$f":"IF(ISBLANK('Tárgyévi összegzés'!B27),\"\",'Tárgyévi összegzés'!B27)","v":""},0,{"$f":"COUNTIF($F27:CS27, \"Sze\")","v":0},{"$f":"COUNTIF($F27:CS27, \"B\")","v":0}]
[{"$f":"IF(ISBLANK('Tárgyévi összegzés'!A28),\"\",'Tárgyévi összegzés'!A28)","v":""},{"$f":"IF(ISBLANK('Tárgyévi összegzés'!B28),\"\",'Tárgyévi összegzés'!B28)","v":""},0,{"$f":"COUNTIF($F28:CS28, \"Sze\")","v":0},{"$f":"COUNTIF($F28:CS28, \"B\")","v":0}]
[{"$f":"IF(ISBLANK('Tárgyévi összegzés'!A29),\"\",'Tárgyévi összegzés'!A29)","v":""},{"$f":"IF(ISBLANK('Tárgyévi összegzés'!B29),\"\",'Tárgyévi összegzés'!B29)","v":""},0,{"$f":"COUNTIF($F29:CS29, \"Sze\")","v":0},{"$f":"COUNTIF($F29:CS29, \"B\")","v":0}]
[{"$f":"IF(ISBLANK('Tárgyévi összegzés'!A30),\"\",'Tárgyévi összegzés'!A30)","v":""},{"$f":"IF(ISBLANK('Tárgyévi összegzés'!B30),\"\",'Tárgyévi összegzés'!B30)","v":""},0,{"$f":"COUNTIF($F30:CS30, \"Sze\")","v":0},{"$f":"COUNTIF($F30:CS30, \"B\")","v":0}]
[{"$f":"IF(ISBLANK('Tárgyévi összegzés'!A31),\"\",'Tárgyévi összegzés'!A31)","v":""},{"$f":"IF(ISBLANK('Tárgyévi összegzés'!B31),\"\",'Tárgyévi összegzés'!B31)","v":""},0,{"$f":"COUNTIF($F31:CS31, \"Sze\")","v":0},{"$f":"COUNTIF($F31:CS31, \"B\")","v":0}]
[{"$f":"IF(ISBLANK('Tárgyévi összegzés'!A32),\"\",'Tárgyévi összegzés'!A32)","v":""},{"$f":"IF(ISBLANK('Tárgyévi összegzés'!B32),\"\",'Tárgyévi összegzés'!B32)","v":""},0,{"$f":"COUNTIF($F32:CS32, \"Sze\")","v":0},{"$f":"COUNTIF($F32:CS32, \"B\")","v":0}]
[{"$f":"IF(ISBLANK('Tárgyévi összegzés'!A33),\"\",'Tárgyévi összegzés'!A33)","v":""},{"$f":"IF(ISBLANK('Tárgyévi összegzés'!B33),\"\",'Tárgyévi összegzés'!B33)","v":""},0,{"$f":"COUNTIF($F33:CS33, \"Sze\")","v":0},{"$f":"COUNTIF($F33:CS33, \"B\")","v":0}]
[{"$f":"IF(ISBLANK('Tárgyévi összegzés'!A34),\"\",'Tárgyévi összegzés'!A34)","v":""},{"$f":"IF(ISBLANK('Tárgyévi összegzés'!B34),\"\",'Tárgyévi összegzés'!B34)","v":""},0,{"$f":"COUNTIF($F34:CS34, \"Sze\")","v":0},{"$f":"COUNTIF($F34:CS34, \"B\")","v":0}]
[{"$f":"IF(ISBLANK('Tárgyévi összegzés'!A35),\"\",'Tárgyévi összegzés'!A35)","v":""},{"$f":"IF(ISBLANK('Tárgyévi összegzés'!B35),\"\",'Tárgyévi összegzés'!B35)","v":""},0,{"$f":"COUNTIF($F35:CS35, \"Sze\")","v":0},{"$f":"COUNTIF($F35:CS35, \"B\")","v":0}]
[{"$f":"IF(ISBLANK('Tárgyévi összegzés'!A36),\"\",'Tárgyévi összegzés'!A36)","v":""},{"$f":"IF(ISBLANK('Tárgyévi összegzés'!B36),\"\",'Tárgyévi összegzés'!B36)","v":""},0,{"$f":"COUNTIF($F36:CS36, \"Sze\")","v":0},{"$f":"COUNTIF($F36:CS36, \"B\")","v":0}]