{"text_format":"3","workbook":"xlsx","n_sheets":2,"sheets":["Vremenska tablica zaposlenika","Radni_dan_traženje"],"not_rendered":{"defined_names":27},"read":"whole","date_system":"1900"}

{"sheet":"Vremenska tablica zaposlenika","index":0,"n_rows":36,"n_cols":26,"rows_kept":36,"merged":[[0,1,2,4],[0,5,2,9],[0,10,2,14],[0,15,3,23],[0,24,3,24],[3,1,3,3],[3,5,3,9],[3,10,3,14],[4,1,6,3],[4,4,6,6],[5,14,7,14],[5,22,7,22],[5,23,7,23],[5,24,7,24],[21,1,21,6],[22,1,23,3],[22,4,23,6],[23,14,24,14],[23,22,24,22],[23,23,24,23],[23,24,24,24],[32,1,32,6],[32,24,33,24],[32,25,33,25],[33,1,33,6],[34,1,34,6],[35,1,35,3],[35,4,35,5],[35,6,35,7],[35,8,35,14],[35,15,35,16],[35,17,35,23]]}
[null,"VREMENSKA TABLICA OPERACIJA ZAPOSLENIKA",{"$nulls":3},"Ime i prezime zaposlenika",{"$nulls":9},"Odaberite Da u ćeliji na desnoj strani ako je \npotrebna autorizacija"]
[]
[]
[null,"Datum završetka platnog razdoblja",null,null,{"$f":"V7","v":"2025-06-14"},"Broj zaposlenika"]
[null,"REDOVNO RADNO VRIJEME:",null,null,"Datum:"]
[{"$nulls":14},"Ukupno\n1. tjedan\nRedovni rad",{"$nulls":7},"Ukupno\n2. tjedan\nRedovni rad","Ukupno \nRedovni rad Sati","Plaća\nKoristi samo\nKod za plaćanja"]
[{"$nulls":7},"2025-06-01",{"$f":"Prvi_dan+1","v":"2025-06-02"},{"$f":"Prvi_dan+2","v":"2025-06-03"},{"$f":"Prvi_dan+3","v":"2025-06-04"},{"$f":"Prvi_dan+4","v":"2025-06-05"},{"$f":"Prvi_dan+5","v":"2025-06-06"},{"$f":"Prvi_dan+6","v":"2025-06-07"},null,{"$f":"Prvi_dan+7","v":"2025-06-08"},{"$f":"Prvi_dan+8","v":"2025-06-09"},{"$f":"Prvi_dan+9","v":"2025-06-10"},{"$f":"Prvi_dan+10","v":"2025-06-11"},{"$f":"Prvi_dan+11","v":"2025-06-12"},{"$f":"Prvi_dan+12","v":"2025-06-13"},{"$f":"Prvi_dan+13","v":"2025-06-14"}]
[null,"Zadatak","Lok","Broj radnog naloga","Opis posla","Poslovna funkcija","Broj naslova",{"$f":"VLOOKUP(WEEKDAY(Prvi_dan),Radni_dan_traženje!$B$2:$C$8,2)","v":"Ned"},{"$f":"VLOOKUP(WEEKDAY(I7),Radni_dan_traženje!$B$2:$C$8,2)","v":"Pon"},{"$f":"VLOOKUP(WEEKDAY(J7),Radni_dan_traženje!$B$2:$C$8,2)","v":"Uto"},{"$f":"VLOOKUP(WEEKDAY(K7),Radni_dan_traženje!$B$2:$C$8,2)","v":"Sri"},{"$f":"VLOOKUP(WEEKDAY(L7),Radni_dan_traženje!$B$2:$C$8,2)","v":"Čet"},{"$f":"VLOOKUP(WEEKDAY(M7),Radni_dan_traženje!$B$2:$C$8,2)","v":"Pet"},{"$f":"VLOOKUP(WEEKDAY(N7),Radni_dan_traženje!$B$2:$C$8,2)","v":"Sub"},null,{"$f":"VLOOKUP(WEEKDAY(P7),Radni_dan_traženje!$B$2:$C$8,2)","v":"Ned"},{"$f":"VLOOKUP(WEEKDAY(Q7),Radni_dan_traženje!$B$2:$C$8,2)","v":"Pon"},{"$f":"VLOOKUP(WEEKDAY(R7),Radni_dan_traženje!$B$2:$C$8,2)","v":"Uto"},{"$f":"VLOOKUP(WEEKDAY(S7),Radni_dan_traženje!$B$2:$C$8,2)","v":"Sri"},{"$f":"VLOOKUP(WEEKDAY(T7),Radni_dan_traženje!$B$2:$C$8,2)","v":"Čet"},{"$f":"VLOOKUP(WEEKDAY(U7),Radni_dan_traženje!$B$2:$C$8,2)","v":"Pet"},{"$f":"VLOOKUP(WEEKDAY(V7),Radni_dan_traženje!$B$2:$C$8,2)","v":"Sub"}]
[{"$nulls":14},{"$f":"SUM(H9:N9)","v":{"v":0,"d":"0.00"}},{"$nulls":7},{"$f":"SUM(P9:V9)","v":{"v":0,"d":"0.00"}},{"$f":"O9+W9","v":{"v":0,"d":"0.00"}}]
[{"$nulls":14},{"v":0,"d":"0.00"},{"$nulls":7},{"v":0,"d":"0.00"},{"v":0,"d":"0.00"}]
[{"$nulls":14},{"v":0,"d":"0.00"},{"$nulls":7},{"v":0,"d":"0.00"},{"v":0,"d":"0.00"}]
[{"$nulls":14},{"v":0,"d":"0.00"},{"$nulls":7},{"v":0,"d":"0.00"},{"v":0,"d":"0.00"}]
[{"$nulls":14},{"v":0,"d":"0.00"},{"$nulls":7},{"v":0,"d":"0.00"},{"v":0,"d":"0.00"}]
[{"$nulls":14},{"v":0,"d":"0.00"},{"$nulls":7},{"v":0,"d":"0.00"},{"v":0,"d":"0.00"}]
[{"$nulls":14},{"v":0,"d":"0.00"},{"$nulls":7},{"v":0,"d":"0.00"},{"v":0,"d":"0.00"}]
[{"$nulls":14},{"$f":"SUM(H16:N16)","v":{"v":0,"d":"0.00"}},{"$nulls":7},{"$f":"SUM(P16:V16)","v":{"v":0,"d":"0.00"}},{"$f":"O16+W16","v":{"v":0,"d":"0.00"}}]
[{"$nulls":14},{"v":0,"d":"0.00"},{"$nulls":7},{"v":0,"d":"0.00"},{"v":0,"d":"0.00"}]
[{"$nulls":14},{"v":0,"d":"0.00"},{"$nulls":7},{"v":0,"d":"0.00"},{"v":0,"d":"0.00"}]
[{"$nulls":14},{"v":0,"d":"0.00"},{"$nulls":7},{"v":0,"d":"0.00"},{"v":0,"d":"0.00"}]
[{"$nulls":14},{"v":0,"d":"0.00"},{"$nulls":7},{"v":0,"d":"0.00"},{"v":0,"d":"0.00"}]
[{"$nulls":14},{"v":0,"d":"0.00"},{"$nulls":7},{"v":0,"d":"0.00"},{"v":0,"d":"0.00"}]
[null,"Ukupan broj redovnih sati   ",{"$nulls":5},{"$f":"SUM(H9:H21)","v":{"v":0,"d":"0.00"}},{"v":0,"d":"0.00"},{"v":0,"d":"0.00"},{"v":0,"d":"0.00"},{"v":0,"d":"0.00"},{"v":0,"d":"0.00"},{"v":0,"d":"0.00"},{"v":0,"d":"0.00"},{"v":0,"d":"0.00"},{"$f":"SUM(Q9:Q21)","v":{"v":0,"d":"0.00"}},{"v":0,"d":"0.00"},{"v":0,"d":"0.00"},{"v":0,"d":"0.00"},{"v":0,"d":"0.00"},{"v":0,"d":"0.00"},{"$f":"SUM(W9:W21)","v":{"v":0,"d":"0.00"}},{"$f":"SUM(X9:X21)","v":{"v":0,"d":"0.00"}}]
[null,"PREKOVREMENI SATI:",null,null,"Datum:"]
[{"$nulls":7},{"$f":"Prvi_dan","v":"2025-06-01"},{"$f":"Prvi_dan+1","v":"2025-06-02"},{"$f":"Prvi_dan+2","v":"2025-06-03"},{"$f":"Prvi_dan+3","v":"2025-06-04"},{"$f":"Prvi_dan+4","v":"2025-06-05"},{"$f":"Prvi_dan+5","v":"2025-06-06"},{"$f":"Prvi_dan+6","v":"2025-06-07"},"1. tjedan prekovremeni",{"$f":"Prvi_dan+7","v":"2025-06-08"},{"$f":"Prvi_dan+8","v":"2025-06-09"},{"$f":"Prvi_dan+9","v":"2025-06-10"},{"$f":"Prvi_dan+10","v":"2025-06-11"},{"$f":"Prvi_dan+11","v":"2025-06-12"},{"$f":"Prvi_dan+12","v":"2025-06-13"},{"$f":"Prvi_dan+13","v":"2025-06-14"},"2. tjedan prekovremeno","Ukupno prekovremeno","Prekovremeni rad\nŠifra"]
[null,"Zadatak","Lok","Broj radnog naloga","Opis posla","Poslovna funkcija","Broj naslova",{"$f":"VLOOKUP(WEEKDAY(Prvi_dan),Radni_dan_traženje!$B$2:$C$8,2)","v":"Ned"},{"$f":"VLOOKUP(WEEKDAY(I24),Radni_dan_traženje!$B$2:$C$8,2)","v":"Pon"},{"$f":"VLOOKUP(WEEKDAY(J24),Radni_dan_traženje!$B$2:$C$8,2)","v":"Uto"},{"$f":"VLOOKUP(WEEKDAY(K24),Radni_dan_traženje!$B$2:$C$8,2)","v":"Sri"},{"$f":"VLOOKUP(WEEKDAY(L24),Radni_dan_traženje!$B$2:$C$8,2)","v":"Čet"},{"$f":"VLOOKUP(WEEKDAY(M24),Radni_dan_traženje!$B$2:$C$8,2)","v":"Pet"},{"$f":"VLOOKUP(WEEKDAY(N24),Radni_dan_traženje!$B$2:$C$8,2)","v":"Sub"},null,{"$f":"VLOOKUP(WEEKDAY(P24),Radni_dan_traženje!$B$2:$C$8,2)","v":"Ned"},{"$f":"VLOOKUP(WEEKDAY(Q24),Radni_dan_traženje!$B$2:$C$8,2)","v":"Pon"},{"$f":"VLOOKUP(WEEKDAY(R24),Radni_dan_traženje!$B$2:$C$8,2)","v":"Uto"},{"$f":"VLOOKUP(WEEKDAY(S24),Radni_dan_traženje!$B$2:$C$8,2)","v":"Sri"},{"$f":"VLOOKUP(WEEKDAY(T24),Radni_dan_traženje!$B$2:$C$8,2)","v":"Čet"},{"$f":"VLOOKUP(WEEKDAY(U24),Radni_dan_traženje!$B$2:$C$8,2)","v":"Pet"},{"$f":"VLOOKUP(WEEKDAY(V24),Radni_dan_traženje!$B$2:$C$8,2)","v":"Sub"}]
[{"$nulls":14},{"$f":"SUM(H26:N26)","v":{"v":0,"d":"0.00"}},{"$nulls":7},{"$f":"SUM(P26:V26)","v":{"v":0,"d":"0.00"}},{"$f":"O26+W26","v":{"v":0,"d":"0.00"}}]
[{"$nulls":14},{"v":0,"d":"0.00"},{"$nulls":7},{"v":0,"d":"0.00"},{"v":0,"d":"0.00"}]
[{"$nulls":14},{"v":0,"d":"0.00"},{"$nulls":7},{"v":0,"d":"0.00"},{"v":0,"d":"0.00"}]
[{"$nulls":14},{"v":0,"d":"0.00"},{"$nulls":7},{"v":0,"d":"0.00"},{"v":0,"d":"0.00"}]
[{"$nulls":14},{"v":0,"d":"0.00"},{"$nulls":7},{"v":0,"d":"0.00"},{"v":0,"d":"0.00"}]
[{"$nulls":14},{"v":0,"d":"0.00"},{"$nulls":7},{"v":0,"d":"0.00"},{"v":0,"d":"0.00"}]
[{"$nulls":14},{"v":0,"d":"0.00"},{"$nulls":7},{"v":0,"d":"0.00"},{"v":0,"d":"0.00"}]
[null,"Ukupan broj prekovremenih sati     ",{"$nulls":5},{"$f":"SUM(H26:H32)","v":{"v":0,"d":"0.00"}},{"v":0,"d":"0.00"},{"v":0,"d":"0.00"},{"v":0,"d":"0.00"},{"v":0,"d":"0.00"},{"v":0,"d":"0.00"},{"v":0,"d":"0.00"},{"$f":"SUM(O26:O32)","v":{"v":0,"d":"0.00"}},{"v":0,"d":"0.00"},{"v":0,"d":"0.00"},{"v":0,"d":"0.00"},{"v":0,"d":"0.00"},{"v":0,"d":"0.00"},{"v":0,"d":"0.00"},{"v":0,"d":"0.00"},{"v":0,"d":"0.00"},{"$f":"SUM(X26:X32)","v":{"v":0,"d":"0.00"}},"Ukupno\nSati\nOdrađenih sati","Ukupno\nSati\nPlaćeno"]
[null,"Kompenzacija za prekovremene sate     ",{"$nulls":12},{"$f":"IF(SUM(H34:N34)<=O33,SUM(H34:N34),O33)","v":{"v":0,"d":"0.00"}},{"$nulls":7},{"$f":"IF(SUM(P34:V34)<=W33,SUM(P34:V34),W33)","v":{"v":0,"d":"0.00"}},{"$f":"IF(SUM(Q34:W34)<=X33,SUM(Q34:W34),X33)","v":{"v":0,"d":"0.00"}}]
[null,"Plaćeni prekovremeni sati     ",{"$nulls":5},{"$f":"IF(H33>=H34,H33-H34,H33)","v":{"v":0,"d":"0.00"}},{"$f":"IF(I33>=I34,I33-I34,I33)","v":{"v":0,"d":"0.00"}},{"v":0,"d":"0.00"},{"v":0,"d":"0.00"},{"v":0,"d":"0.00"},{"v":0,"d":"0.00"},{"v":0,"d":"0.00"},{"v":0,"d":"0.00"},{"v":0,"d":"0.00"},{"v":0,"d":"0.00"},{"v":0,"d":"0.00"},{"v":0,"d":"0.00"},{"v":0,"d":"0.00"},{"v":0,"d":"0.00"},{"v":0,"d":"0.00"},{"$f":"IF(W33>=W34,W33-W34,W33)","v":{"v":0,"d":"0.00"}},{"$f":"IF(X33>=X34,X33-X34,X33)","v":{"v":0,"d":"0.00"}},{"$f":"$X$22+$X$33","v":{"v":0,"d":"0.00"}},{"$f":"X22+X35","v":{"v":0,"d":"0.00"}}]
[null,"Zaposlenik ",{"$nulls":4},"Nadzornik ",{"$nulls":8},"Nadzornik "]

{"sheet":"Radni_dan_traženje","index":1,"n_rows":8,"n_cols":3,"rows_kept":8}
[null,"Radni dan\nCijeli broj","Radni dan\nPočetno"]
[null,1,"Ned"]
[null,2,"Pon"]
[null,3,"Uto"]
[null,4,"Sri"]
[null,5,"Čet"]
[null,6,"Pet"]
[null,7,"Sub"]