{"text_format":"3","workbook":"xlsx","n_sheets":4,"sheets":["התחלה","פרמטרי הפרוייקט","פרטי הפרוייקט","סכומי הפרוייקט"],"not_rendered":{"charts":2,"defined_names":3,"pivot_tables":1},"read":"whole","date_system":"1900"}

{"sheet":"התחלה","index":0,"n_rows":7,"n_cols":2,"rows_kept":7}
[null,"אודות תבנית זו"]
[null,"עקוב אחר פרמטרי הפרוייקט, פרטי הפרוייקט וסכומי הפרוייקט בחוברת עבודה זו של כלי מעקב עבור תכנון אירוע."]
[null,"הזן מידע בגליון העבודה 'פרמטרי פרוייקט', כדי לעדכן את תרשימי הטורים, ובגליון העבודה 'פרטי פרוייקט'. ה- PivotTable בגליון העבודה 'סכומי פרוייקט' מתעדכן באופן אוטומטי."]
[null,"מלא את שם החברה בגליון העבודה 'פרמטרי פרוייקט', והוא יתעדכן באופן אוטומטי בגליונות העבודה האחרים."]
[null,"הערה:  "]
[null,"הוראות נוספות סופקו בעמודה A בכל גליון עבודה שבחוברת העבודה 'כלי מעקב עבור תכנון אירוע'. טקסט זה הוסתר במכוון. כדי להסיר את הטקסט, בחר את עמודה A ולאחר מכן הקש DELETE. כדי לבטל את הסתרת הטקסט, בחר את עמודה A ולאחר מכן שנה את צבע הגופן."]
[null,"לקבלת מידע נוסף אודות הטבלאות בגיליונות העבודה, הקש SHIFT ולאחר מכן F10 בתוך טבלה, בחר את האפשרות 'טבלה' ולאחר מכן בחר 'טקסט חלופי'."]

{"sheet":"פרמטרי הפרוייקט","index":1,"n_rows":19,"n_cols":9,"rows_kept":19,"merged":[[23,1,42,3]]}
[null,"שם החברה"]
[null,"כלי מעקב אחר פרוייקט ניהול אירוע"]
[null,{"$f":"B1&\" סודי\"","v":"שם החברה סודי"}]
[null,"התאים המוצללים מחושבים עבורך. אין צורך להזין בהם ערך."]
[null,"סוג הפרוייקט","מנהל תיק לקוח","מנהל פרוייקט","מנהל אסטרטגיה","מעצב מומחה","צוות אירוע","צוות אדמיניסטרטיבי","סך הכל"]
[null,"פיתוח אסטרטגיית אירוע",{"v":0.2,"d":"20%"},{"v":0.1,"d":"10%"},{"v":0.6,"d":"60%"},{"v":0,"d":"0%"},{"v":0,"d":"0%"},{"v":0.1,"d":"10%"},{"$f":"SUM(פרמטרים[[#This Row],[מנהל תיק לקוח]:[צוות אדמיניסטרטיבי]])","v":{"v":1,"d":"100%"}}]
[null,"תכנון אירוע",{"v":0.2,"d":"20%"},{"v":0.5,"d":"50%"},{"v":0.1,"d":"10%"},{"v":0.1,"d":"10%"},{"v":0,"d":"0%"},{"v":0.1,"d":"10%"},{"$f":"SUM(פרמטרים[[#This Row],[מנהל תיק לקוח]:[צוות אדמיניסטרטיבי]])","v":{"v":0.9999999999999999,"d":"100%"}}]
[null,"עיצוב אירוע",{"v":0.2,"d":"20%"},{"v":0.2,"d":"20%"},{"v":0,"d":"0%"},{"v":0.5,"d":"50%"},{"v":0,"d":"0%"},{"v":0.1,"d":"10%"},{"$f":"SUM(פרמטרים[[#This Row],[מנהל תיק לקוח]:[צוות אדמיניסטרטיבי]])","v":{"v":1,"d":"100%"}}]
{"$rows_left_out":12}
{"sheet":"פרטי הפרוייקט","index":2,"n_rows":10,"n_cols":23,"rows_kept":10}
[null,{"$f":"'פרמטרי הפרוייקט'!B1","v":"שם החברה"}]
[null,"כלי מעקב אחר פרוייקט ניהול אירוע"]
[null,{"$f":"'פרמטרי הפרוייקט'!B3","v":"שם החברה סודי"}]
["הזן מידע בטבלה 'פרטי פרויקט' שמתחילה בתא משמאל.\nמידע\nכדי להוסיף שורה בטבלה משמאל, בחר את התא השמאלי התחתון בגוף הטבלה (לא את שורת הסכומים) והקש Tab. לחלופין, הקש SHIFT+F10 במקום שבו ברצונך להוסיף את השורה ולאחר מכן בחר 'הוסף' | 'שורות טבלה מעל/מתחת'.\nהקפד למחוק את כל השורות שאינן נמצאות בשימוש, מכיוון שה- PivotTable 'סכומי פרוייקט' משתמש בכל תאי הטבלה, ולכן עלול להציג תוצאות שגויות.","שם הפרוייקט","סוג הפרוייקט","תאריך התחלה משוער","תאריך סיום משוער","תאריך התחלה בפועל","תאריך סיום בפועל","שעות עבודה משוערות","שעות עבודה בפועל","משך משוער","משך בפועל","מנהל תיק לקוח","מנהל פרוייקט","מנהל אסטרטגיה","מעצב מומחה","צוות אירוע","צוות אדמיניסטרטיבי","מנהל תיק לקוח ","מנהל פרוייקט ","מנהל אסטרטגיה ","מעצב מומחה ","צוות אירוע ","צוות אדמיניסטרטיבי "]
[null,"פרוייקט 1","פיתוח אסטרטגיית אירוע",{"$f":"DATE(YEAR(TODAY()),6,9)","v":"2022-06-09"},{"$f":" DATE(YEAR(TODAY()),8,7)","v":"2022-08-07"},{"$f":"DATE(YEAR(TODAY()),6,29)","v":"2022-06-29"},{"$f":"DATE(YEAR(TODAY()),9,3)","v":"2022-09-03"},200,220,{"$f":"DAYS360(פרטי_פרויקט[[#This Row],[תאריך התחלה משוער]],פרטי_פרויקט[[#This Row],[תאריך סיום משוער]],FALSE)","v":58},{"$f":"DAYS360(פרטי_פרויקט[[#This Row],[תאריך התחלה בפועל]],פרטי_פרויקט[[#This Row],[תאריך סיום בפועל]],FALSE)","v":64},{"$f":"INDEX(פרמטרים[],MATCH(פרטי_פרויקט[[#This Row],[סוג הפרוייקט]],פרמטרים[סוג הפרוייקט],0),MATCH(פרטי_פרויקט[[#Headers],[מנהל תיק לקוח]],פרמטרים[#Headers],0))*INDEX('פרמטרי הפרוייקט'!$B$12:$H$12,1,MATCH(פרטי_פרויקט[[#Headers],[מנהל תיק לקוח]],פרמטרים[#Headers],0))*פרטי_פרויקט[[#This Row],[שעות עבודה משוערות]]","v":{"v":7200,"d":"₪ 7,200"}},{"$f":"INDEX(פרמטרים[],MATCH(פרטי_פרויקט[[#This Row],[סוג הפרוייקט]],פרמטרים[סוג הפרוייקט],0),MATCH(פרטי_פרויקט[[#Headers],[מנהל פרוייקט]],פרמטרים[#Headers],0))*INDEX('פרמטרי הפרוייקט'!$B$12:$H$12,1,MATCH(פרטי_פרויקט[[#Headers],[מנהל פרוייקט]],פרמטרים[#Headers],0))*פרטי_פרויקט[[#This Row],[שעות עבודה משוערות]]","v":{"v":2400,"d":"₪ 2,400"}},{"$f":"INDEX(פרמטרים[],MATCH(פרטי_פרויקט[[#This Row],[סוג הפרוייקט]],פרמטרים[סוג הפרוייקט],0),MATCH(פרטי_פרויקט[[#Headers],[מנהל אסטרטגיה]],פרמטרים[#Headers],0))*INDEX('פרמטרי הפרוייקט'!$B$12:$H$12,1,MATCH(פרטי_פרויקט[[#Headers],[מנהל אסטרטגיה]],פרמטרים[#Headers],0))*פרטי_פרויקט[[#This Row],[שעות עבודה משוערות]]","v":{"v":18000,"d":"₪ 18,000"}},{"$f":"INDEX(פרמטרים[],MATCH(פרטי_פרויקט[[#This Row],[סוג הפרוייקט]],פרמטרים[סוג הפרוייקט],0),MATCH(פרטי_פרויקט[[#Headers],[מעצב מומחה]],פרמטרים[#Headers],0))*INDEX('פרמטרי הפרוייקט'!$B$12:$H$12,1,MATCH(פרטי_פרויקט[[#Headers],[מעצב מומחה]],פרמטרים[#Headers],0))*פרטי_פרויקט[[#This Row],[שעות עבודה משוערות]]","v":{"v":0,"d":"₪ 0"}},{"$f":"INDEX(פרמטרים[],MATCH(פרטי_פרויקט[[#This Row],[סוג הפרוייקט]],פרמטרים[סוג הפרוייקט],0),MATCH(פרטי_פרויקט[[#Headers],[צוות אירוע]],פרמטרים[#Headers],0))*INDEX('פרמטרי הפרוייקט'!$B$12:$H$12,1,MATCH(פרטי_פרויקט[[#Headers],[צוות אירוע]],פרמטרים[#Headers],0))*פרטי_פרויקט[[#This Row],[שעות עבודה משוערות]]","v":{"v":0,"d":"₪ 0"}},{"$f":"INDEX(פרמטרים[],MATCH(פרטי_פרויקט[[#This Row],[סוג הפרוייקט]],פרמטרים[סוג הפרוייקט],0),MATCH(פרטי_פרויקט[[#Headers],[צוות אדמיניסטרטיבי]],פרמטרים[#Headers],0))*INDEX('פרמטרי הפרוייקט'!$B$12:$H$12,1,MATCH(פרטי_פרויקט[[#Headers],[צוות אדמיניסטרטיבי]],פרמטרים[#Headers],0))*פרטי_פרויקט[[#This Row],[שעות עבודה משוערות]]","v":{"v":1200,"d":"₪ 1,200"}},{"$f":"INDEX(פרמטרים[],MATCH(פרטי_פרויקט[[#This Row],[סוג הפרוייקט]],פרמטרים[סוג הפרוייקט],0),MATCH(פרטי_פרויקט[[#Headers],[מנהל תיק לקוח]],פרמטרים[#Headers],0))*INDEX('פרמטרי הפרוייקט'!$B$12:$H$12,1,MATCH(פרטי_פרויקט[[#Headers],[מנהל תיק לקוח]],פרמטרים[#Headers],0))*פרטי_פרויקט[[#This Row],[שעות עבודה בפועל]]","v":{"v":7920,"d":"₪ 7,920"}},{"$f":"INDEX(פרמטרים[],MATCH(פרטי_פרויקט[[#This Row],[סוג הפרוייקט]],פרמטרים[סוג הפרוייקט],0),MATCH(פרטי_פרויקט[[#Headers],[מנהל פרוייקט]],פרמטרים[#Headers],0))*INDEX('פרמטרי הפרוייקט'!$B$12:$H$12,1,MATCH(פרטי_פרויקט[[#Headers],[מנהל פרוייקט]],פרמטרים[#Headers],0))*פרטי_פרויקט[[#This Row],[שעות עבודה בפועל]]","v":{"v":2640,"d":"₪ 2,640"}},{"$f":"INDEX(פרמטרים[],MATCH(פרטי_פרויקט[[#This Row],[סוג הפרוייקט]],פרמטרים[סוג הפרוייקט],0),MATCH(פרטי_פרויקט[[#Headers],[מנהל אסטרטגיה]],פרמטרים[#Headers],0))*INDEX('פרמטרי הפרוייקט'!$B$12:$H$12,1,MATCH(פרטי_פרויקט[[#Headers],[מנהל אסטרטגיה]],פרמטרים[#Headers],0))*פרטי_פרויקט[[#This Row],[שעות עבודה בפועל]]","v":{"v":19800,"d":"₪ 19,800"}},{"$f":"INDEX(פרמטרים[],MATCH(פרטי_פרויקט[[#This Row],[סוג הפרוייקט]],פרמטרים[סוג הפרוייקט],0),MATCH(פרטי_פרויקט[[#Headers],[מעצב מומחה]],פרמטרים[#Headers],0))*INDEX('פרמטרי הפרוייקט'!$B$12:$H$12,1,MATCH(פרטי_פרויקט[[#Headers],[מעצב מומחה]],פרמטרים[#Headers],0))*פרטי_פרויקט[[#This Row],[שעות עבודה בפועל]]","v":{"v":0,"d":"₪ 0"}},{"$f":"INDEX(פרמטרים[],MATCH(פרטי_פרויקט[[#This Row],[סוג הפרוייקט]],פרמטרים[סוג הפרוייקט],0),MATCH(פרטי_פרויקט[[#Headers],[צוות אירוע]],פרמטרים[#Headers],0))*INDEX('פרמטרי הפרוייקט'!$B$12:$H$12,1,MATCH(פרטי_פרויקט[[#Headers],[צוות אירוע]],פרמטרים[#Headers],0))*פרטי_פרויקט[[#This Row],[שעות עבודה בפועל]]","v":{"v":0,"d":"₪ 0"}},{"$f":"INDEX(פרמטרים[],MATCH(פרטי_פרויקט[[#This Row],[סוג הפרוייקט]],פרמטרים[סוג הפרוייקט],0),MATCH(פרטי_פרויקט[[#Headers],[צוות אדמיניסטרטיבי]],פרמטרים[#Headers],0))*INDEX('פרמטרי הפרוייקט'!$B$12:$H$12,1,MATCH(פרטי_פרויקט[[#Headers],[צוות אדמיניסטרטיבי]],פרמטרים[#Headers],0))*פרטי_פרויקט[[#This Row],[שעות עבודה בפועל]]","v":{"v":1320,"d":"₪ 1,320"}}]
[null,"פרוייקט 2","תכנון אירוע",{"$f":"DATE(YEAR(TODAY())+1,6,25)","v":"2023-06-25"},{"$f":"DATE(YEAR(TODAY())+1,7,27)","v":"2023-07-27"},{"$f":"DATE(YEAR(TODAY()),7,15)","v":"2022-07-15"},{"$f":"DATE(YEAR(TODAY())+1,8,25)","v":"2023-08-25"},400,390,{"$f":"DAYS360(פרטי_פרויקט[[#This Row],[תאריך התחלה משוער]],פרטי_פרויקט[[#This Row],[תאריך סיום משוער]],FALSE)","v":32},{"$f":"DAYS360(פרטי_פרויקט[[#This Row],[תאריך התחלה בפועל]],פרטי_פרויקט[[#This Row],[תאריך סיום בפועל]],FALSE)","v":400},{"$f":"INDEX(פרמטרים[],MATCH(פרטי_פרויקט[[#This Row],[סוג הפרוייקט]],פרמטרים[סוג הפרוייקט],0),MATCH(פרטי_פרויקט[[#Headers],[מנהל תיק לקוח]],פרמטרים[#Headers],0))*INDEX('פרמטרי הפרוייקט'!$B$12:$H$12,1,MATCH(פרטי_פרויקט[[#Headers],[מנהל תיק לקוח]],פרמטרים[#Headers],0))*פרטי_פרויקט[[#This Row],[שעות עבודה משוערות]]","v":{"v":14400,"d":"₪ 14,400"}},{"$f":"INDEX(פרמטרים[],MATCH(פרטי_פרויקט[[#This Row],[סוג הפרוייקט]],פרמטרים[סוג הפרוייקט],0),MATCH(פרטי_פרויקט[[#Headers],[מנהל פרוייקט]],פרמטרים[#Headers],0))*INDEX('פרמטרי הפרוייקט'!$B$12:$H$12,1,MATCH(פרטי_פרויקט[[#Headers],[מנהל פרוייקט]],פרמטרים[#Headers],0))*פרטי_פרויקט[[#This Row],[שעות עבודה משוערות]]","v":{"v":24000,"d":"₪ 24,000"}},{"$f":"INDEX(פרמטרים[],MATCH(פרטי_פרויקט[[#This Row],[סוג הפרוייקט]],פרמטרים[סוג הפרוייקט],0),MATCH(פרטי_פרויקט[[#Headers],[מנהל אסטרטגיה]],פרמטרים[#Headers],0))*INDEX('פרמטרי הפרוייקט'!$B$12:$H$12,1,MATCH(פרטי_פרויקט[[#Headers],[מנהל אסטרטגיה]],פרמטרים[#Headers],0))*פרטי_פרויקט[[#This Row],[שעות עבודה משוערות]]","v":{"v":6000,"d":"₪ 6,000"}},{"$f":"INDEX(פרמטרים[],MATCH(פרטי_פרויקט[[#This Row],[סוג הפרוייקט]],פרמטרים[סוג הפרוייקט],0),MATCH(פרטי_פרויקט[[#Headers],[מעצב מומחה]],פרמטרים[#Headers],0))*INDEX('פרמטרי הפרוייקט'!$B$12:$H$12,1,MATCH(פרטי_פרויקט[[#Headers],[מעצב מומחה]],פרמטרים[#Headers],0))*פרטי_פרויקט[[#This Row],[שעות עבודה משוערות]]","v":{"v":4000,"d":"₪ 4,000"}},{"$f":"INDEX(פרמטרים[],MATCH(פרטי_פרויקט[[#This Row],[סוג הפרוייקט]],פרמטרים[סוג הפרוייקט],0),MATCH(פרטי_פרויקט[[#Headers],[צוות אירוע]],פרמטרים[#Headers],0))*INDEX('פרמטרי הפרוייקט'!$B$12:$H$12,1,MATCH(פרטי_פרויקט[[#Headers],[צוות אירוע]],פרמטרים[#Headers],0))*פרטי_פרויקט[[#This Row],[שעות עבודה משוערות]]","v":{"v":0,"d":"₪ 0"}},{"$f":"INDEX(פרמטרים[],MATCH(פרטי_פרויקט[[#This Row],[סוג הפרוייקט]],פרמטרים[סוג הפרוייקט],0),MATCH(פרטי_פרויקט[[#Headers],[צוות אדמיניסטרטיבי]],פרמטרים[#Headers],0))*INDEX('פרמטרי הפרוייקט'!$B$12:$H$12,1,MATCH(פרטי_פרויקט[[#Headers],[צוות אדמיניסטרטיבי]],פרמטרים[#Headers],0))*פרטי_פרויקט[[#This Row],[שעות עבודה משוערות]]","v":{"v":2400,"d":"₪ 2,400"}},{"$f":"INDEX(פרמטרים[],MATCH(פרטי_פרויקט[[#This Row],[סוג הפרוייקט]],פרמטרים[סוג הפרוייקט],0),MATCH(פרטי_פרויקט[[#Headers],[מנהל תיק לקוח]],פרמטרים[#Headers],0))*INDEX('פרמטרי הפרוייקט'!$B$12:$H$12,1,MATCH(פרטי_פרויקט[[#Headers],[מנהל תיק לקוח]],פרמטרים[#Headers],0))*פרטי_פרויקט[[#This Row],[שעות עבודה בפועל]]","v":{"v":14040,"d":"₪ 14,040"}},{"$f":"INDEX(פרמטרים[],MATCH(פרטי_פרויקט[[#This Row],[סוג הפרוייקט]],פרמטרים[סוג הפרוייקט],0),MATCH(פרטי_פרויקט[[#Headers],[מנהל פרוייקט]],פרמטרים[#Headers],0))*INDEX('פרמטרי הפרוייקט'!$B$12:$H$12,1,MATCH(פרטי_פרויקט[[#Headers],[מנהל פרוייקט]],פרמטרים[#Headers],0))*פרטי_פרויקט[[#This Row],[שעות עבודה בפועל]]","v":{"v":23400,"d":"₪ 23,400"}},{"$f":"INDEX(פרמטרים[],MATCH(פרטי_פרויקט[[#This Row],[סוג הפרוייקט]],פרמטרים[סוג הפרוייקט],0),MATCH(פרטי_פרויקט[[#Headers],[מנהל אסטרטגיה]],פרמטרים[#Headers],0))*INDEX('פרמטרי הפרוייקט'!$B$12:$H$12,1,MATCH(פרטי_פרויקט[[#Headers],[מנהל אסטרטגיה]],פרמטרים[#Headers],0))*פרטי_פרויקט[[#This Row],[שעות עבודה בפועל]]","v":{"v":5850,"d":"₪ 5,850"}},{"$f":"INDEX(פרמטרים[],MATCH(פרטי_פרויקט[[#This Row],[סוג הפרוייקט]],פרמטרים[סוג הפרוייקט],0),MATCH(פרטי_פרויקט[[#Headers],[מעצב מומחה]],פרמטרים[#Headers],0))*INDEX('פרמטרי הפרוייקט'!$B$12:$H$12,1,MATCH(פרטי_פרויקט[[#Headers],[מעצב מומחה]],פרמטרים[#Headers],0))*פרטי_פרויקט[[#This Row],[שעות עבודה בפועל]]","v":{"v":3900,"d":"₪ 3,900"}},{"$f":"INDEX(פרמטרים[],MATCH(פרטי_פרויקט[[#This Row],[סוג הפרוייקט]],פרמטרים[סוג הפרוייקט],0),MATCH(פרטי_פרויקט[[#Headers],[צוות אירוע]],פרמטרים[#Headers],0))*INDEX('פרמטרי הפרוייקט'!$B$12:$H$12,1,MATCH(פרטי_פרויקט[[#Headers],[צוות אירוע]],פרמטרים[#Headers],0))*פרטי_פרויקט[[#This Row],[שעות עבודה בפועל]]","v":{"v":0,"d":"₪ 0"}},{"$f":"INDEX(פרמטרים[],MATCH(פרטי_פרויקט[[#This Row],[סוג הפרוייקט]],פרמטרים[סוג הפרוייקט],0),MATCH(פרטי_פרויקט[[#Headers],[צוות אדמיניסטרטיבי]],פרמטרים[#Headers],0))*INDEX('פרמטרי הפרוייקט'!$B$12:$H$12,1,MATCH(פרטי_פרויקט[[#Headers],[צוות אדמיניסטרטיבי]],פרמטרים[#Headers],0))*פרטי_פרויקט[[#This Row],[שעות עבודה בפועל]]","v":{"v":2340,"d":"₪ 2,340"}}]
[null,"פרוייקט 3","עיצוב אירוע",{"$f":"DATE(YEAR(TODAY())+2,7,12)","v":"2024-07-12"},{"$f":"DATE(YEAR(TODAY())+2,9,19)","v":"2024-09-19"},"2025-08-07","2025-10-10",500,500,{"$f":"DAYS360(פרטי_פרויקט[[#This Row],[תאריך התחלה משוער]],פרטי_פרויקט[[#This Row],[תאריך סיום משוער]],FALSE)","v":67},{"$f":"DAYS360(פרטי_פרויקט[[#This Row],[תאריך התחלה בפועל]],פרטי_פרויקט[[#This Row],[תאריך סיום בפועל]],FALSE)","v":63},{"$f":"INDEX(פרמטרים[],MATCH(פרטי_פרויקט[[#This Row],[סוג הפרוייקט]],פרמטרים[סוג הפרוייקט],0),MATCH(פרטי_פרויקט[[#Headers],[מנהל תיק לקוח]],פרמטרים[#Headers],0))*INDEX('פרמטרי הפרוייקט'!$B$12:$H$12,1,MATCH(פרטי_פרויקט[[#Headers],[מנהל תיק לקוח]],פרמטרים[#Headers],0))*פרטי_פרויקט[[#This Row],[שעות עבודה משוערות]]","v":{"v":18000,"d":"₪ 18,000"}},{"$f":"INDEX(פרמטרים[],MATCH(פרטי_פרויקט[[#This Row],[סוג הפרוייקט]],פרמטרים[סוג הפרוייקט],0),MATCH(פרטי_פרויקט[[#Headers],[מנהל פרוייקט]],פרמטרים[#Headers],0))*INDEX('פרמטרי הפרוייקט'!$B$12:$H$12,1,MATCH(פרטי_פרויקט[[#Headers],[מנהל פרוייקט]],פרמטרים[#Headers],0))*פרטי_פרויקט[[#This Row],[שעות עבודה משוערות]]","v":{"v":12000,"d":"₪ 12,000"}},{"$f":"INDEX(פרמטרים[],MATCH(פרטי_פרויקט[[#This Row],[סוג הפרוייקט]],פרמטרים[סוג הפרוייקט],0),MATCH(פרטי_פרויקט[[#Headers],[מנהל אסטרטגיה]],פרמטרים[#Headers],0))*INDEX('פרמטרי הפרוייקט'!$B$12:$H$12,1,MATCH(פרטי_פרויקט[[#Headers],[מנהל אסטרטגיה]],פרמטרים[#Headers],0))*פרטי_פרויקט[[#This Row],[שעות עבודה משוערות]]","v":{"v":0,"d":"₪ 0"}},{"$f":"INDEX(פרמטרים[],MATCH(פרטי_פרויקט[[#This Row],[סוג הפרוייקט]],פרמטרים[סוג הפרוייקט],0),MATCH(פרטי_פרויקט[[#Headers],[מעצב מומחה]],פרמטרים[#Headers],0))*INDEX('פרמטרי הפרוייקט'!$B$12:$H$12,1,MATCH(פרטי_פרויקט[[#Headers],[מעצב מומחה]],פרמטרים[#Headers],0))*פרטי_פרויקט[[#This Row],[שעות עבודה משוערות]]","v":{"v":25000,"d":"₪ 25,000"}},{"$f":"INDEX(פרמטרים[],MATCH(פרטי_פרויקט[[#This Row],[סוג הפרוייקט]],פרמטרים[סוג הפרוייקט],0),MATCH(פרטי_פרויקט[[#Headers],[צוות אירוע]],פרמטרים[#Headers],0))*INDEX('פרמטרי הפרוייקט'!$B$12:$H$12,1,MATCH(פרטי_פרויקט[[#Headers],[צוות אירוע]],פרמטרים[#Headers],0))*פרטי_פרויקט[[#This Row],[שעות עבודה משוערות]]","v":{"v":0,"d":"₪ 0"}},{"$f":"INDEX(פרמטרים[],MATCH(פרטי_פרויקט[[#This Row],[סוג הפרוייקט]],פרמטרים[סוג הפרוייקט],0),MATCH(פרטי_פרויקט[[#Headers],[צוות אדמיניסטרטיבי]],פרמטרים[#Headers],0))*INDEX('פרמטרי הפרוייקט'!$B$12:$H$12,1,MATCH(פרטי_פרויקט[[#Headers],[צוות אדמיניסטרטיבי]],פרמטרים[#Headers],0))*פרטי_פרויקט[[#This Row],[שעות עבודה משוערות]]","v":{"v":3000,"d":"₪ 3,000"}},{"$f":"INDEX(פרמטרים[],MATCH(פרטי_פרויקט[[#This Row],[סוג הפרוייקט]],פרמטרים[סוג הפרוייקט],0),MATCH(פרטי_פרויקט[[#Headers],[מנהל תיק לקוח]],פרמטרים[#Headers],0))*INDEX('פרמטרי הפרוייקט'!$B$12:$H$12,1,MATCH(פרטי_פרויקט[[#Headers],[מנהל תיק לקוח]],פרמטרים[#Headers],0))*פרטי_פרויקט[[#This Row],[שעות עבודה בפועל]]","v":{"v":18000,"d":"₪ 18,000"}},{"$f":"INDEX(פרמטרים[],MATCH(פרטי_פרויקט[[#This Row],[סוג הפרוייקט]],פרמטרים[סוג הפרוייקט],0),MATCH(פרטי_פרויקט[[#Headers],[מנהל פרוייקט]],פרמטרים[#Headers],0))*INDEX('פרמטרי הפרוייקט'!$B$12:$H$12,1,MATCH(פרטי_פרויקט[[#Headers],[מנהל פרוייקט]],פרמטרים[#Headers],0))*פרטי_פרויקט[[#This Row],[שעות עבודה בפועל]]","v":{"v":12000,"d":"₪ 12,000"}},{"$f":"INDEX(פרמטרים[],MATCH(פרטי_פרויקט[[#This Row],[סוג הפרוייקט]],פרמטרים[סוג הפרוייקט],0),MATCH(פרטי_פרויקט[[#Headers],[מנהל אסטרטגיה]],פרמטרים[#Headers],0))*INDEX('פרמטרי הפרוייקט'!$B$12:$H$12,1,MATCH(פרטי_פרויקט[[#Headers],[מנהל אסטרטגיה]],פרמטרים[#Headers],0))*פרטי_פרויקט[[#This Row],[שעות עבודה בפועל]]","v":{"v":0,"d":"₪ 0"}},{"$f":"INDEX(פרמטרים[],MATCH(פרטי_פרויקט[[#This Row],[סוג הפרוייקט]],פרמטרים[סוג הפרוייקט],0),MATCH(פרטי_פרויקט[[#Headers],[מעצב מומחה]],פרמטרים[#Headers],0))*INDEX('פרמטרי הפרוייקט'!$B$12:$H$12,1,MATCH(פרטי_פרויקט[[#Headers],[מעצב מומחה]],פרמטרים[#Headers],0))*פרטי_פרויקט[[#This Row],[שעות עבודה בפועל]]","v":{"v":25000,"d":"₪ 25,000"}},{"$f":"INDEX(פרמטרים[],MATCH(פרטי_פרויקט[[#This Row],[סוג הפרוייקט]],פרמטרים[סוג הפרוייקט],0),MATCH(פרטי_פרויקט[[#Headers],[צוות אירוע]],פרמטרים[#Headers],0))*INDEX('פרמטרי הפרוייקט'!$B$12:$H$12,1,MATCH(פרטי_פרויקט[[#Headers],[צוות אירוע]],פרמטרים[#Headers],0))*פרטי_פרויקט[[#This Row],[שעות עבודה בפועל]]","v":{"v":0,"d":"₪ 0"}},{"$f":"INDEX(פרמטרים[],MATCH(פרטי_פרויקט[[#This Row],[סוג הפרוייקט]],פרמטרים[סוג הפרוייקט],0),MATCH(פרטי_פרויקט[[#Headers],[צוות אדמיניסטרטיבי]],פרמטרים[#Headers],0))*INDEX('פרמטרי הפרוייקט'!$B$12:$H$12,1,MATCH(פרטי_פרויקט[[#Headers],[צוות אדמיניסטרטיבי]],פרמטרים[#Headers],0))*פרטי_פרויקט[[#This Row],[שעות עבודה בפועל]]","v":{"v":3000,"d":"₪ 3,000"}}]
[null,"פרוייקט 4","לוגיסטיקת אירוע",{"$f":"DATE(YEAR(TODAY())+3,7,30)","v":"2025-07-30"},{"$f":"DATE(YEAR(TODAY())+3,9,28)","v":"2025-09-28"},{"$f":"DATE(YEAR(TODAY())+3,9,14)","v":"2025-09-14"},{"$f":"DATE(YEAR(TODAY())+3,11,13)","v":"2025-11-13"},150,145,{"$f":"DAYS360(פרטי_פרויקט[[#This Row],[תאריך התחלה משוער]],פרטי_פרויקט[[#This Row],[תאריך סיום משוער]],FALSE)","v":58},{"$f":"DAYS360(פרטי_פרויקט[[#This Row],[תאריך התחלה בפועל]],פרטי_פרויקט[[#This Row],[תאריך סיום בפועל]],FALSE)","v":59},{"$f":"INDEX(פרמטרים[],MATCH(פרטי_פרויקט[[#This Row],[סוג הפרוייקט]],פרמטרים[סוג הפרוייקט],0),MATCH(פרטי_פרויקט[[#Headers],[מנהל תיק לקוח]],פרמטרים[#Headers],0))*INDEX('פרמטרי הפרוייקט'!$B$12:$H$12,1,MATCH(פרטי_פרויקט[[#Headers],[מנהל תיק לקוח]],פרמטרים[#Headers],0))*פרטי_פרויקט[[#This Row],[שעות עבודה משוערות]]","v":{"v":5400,"d":"₪ 5,400"}},{"$f":"INDEX(פרמטרים[],MATCH(פרטי_פרויקט[[#This Row],[סוג הפרוייקט]],פרמטרים[סוג הפרוייקט],0),MATCH(פרטי_פרויקט[[#Headers],[מנהל פרוייקט]],פרמטרים[#Headers],0))*INDEX('פרמטרי הפרוייקט'!$B$12:$H$12,1,MATCH(פרטי_פרויקט[[#Headers],[מנהל פרוייקט]],פרמטרים[#Headers],0))*פרטי_פרויקט[[#This Row],[שעות עבודה משוערות]]","v":{"v":10800,"d":"₪ 10,800"}},{"$f":"INDEX(פרמטרים[],MATCH(פרטי_פרויקט[[#This Row],[סוג הפרוייקט]],פרמטרים[סוג הפרוייקט],0),MATCH(פרטי_פרויקט[[#Headers],[מנהל אסטרטגיה]],פרמטרים[#Headers],0))*INDEX('פרמטרי הפרוייקט'!$B$12:$H$12,1,MATCH(פרטי_פרויקט[[#Headers],[מנהל אסטרטגיה]],פרמטרים[#Headers],0))*פרטי_פרויקט[[#This Row],[שעות עבודה משוערות]]","v":{"v":0,"d":"₪ 0"}},{"$f":"INDEX(פרמטרים[],MATCH(פרטי_פרויקט[[#This Row],[סוג הפרוייקט]],פרמטרים[סוג הפרוייקט],0),MATCH(פרטי_פרויקט[[#Headers],[מעצב מומחה]],פרמטרים[#Headers],0))*INDEX('פרמטרי הפרוייקט'!$B$12:$H$12,1,MATCH(פרטי_פרויקט[[#Headers],[מעצב מומחה]],פרמטרים[#Headers],0))*פרטי_פרויקט[[#This Row],[שעות עבודה משוערות]]","v":{"v":0,"d":"₪ 0"}},{"$f":"INDEX(פרמטרים[],MATCH(פרטי_פרויקט[[#This Row],[סוג הפרוייקט]],פרמטרים[סוג הפרוייקט],0),MATCH(פרטי_פרויקט[[#Headers],[צוות אירוע]],פרמטרים[#Headers],0))*INDEX('פרמטרי הפרוייקט'!$B$12:$H$12,1,MATCH(פרטי_פרויקט[[#Headers],[צוות אירוע]],פרמטרים[#Headers],0))*פרטי_פרויקט[[#This Row],[שעות עבודה משוערות]]","v":{"v":1200,"d":"₪ 1,200"}},{"$f":"INDEX(פרמטרים[],MATCH(פרטי_פרויקט[[#This Row],[סוג הפרוייקט]],פרמטרים[סוג הפרוייקט],0),MATCH(פרטי_פרויקט[[#Headers],[צוות אדמיניסטרטיבי]],פרמטרים[#Headers],0))*INDEX('פרמטרי הפרוייקט'!$B$12:$H$12,1,MATCH(פרטי_פרויקט[[#Headers],[צוות אדמיניסטרטיבי]],פרמטרים[#Headers],0))*פרטי_פרויקט[[#This Row],[שעות עבודה משוערות]]","v":{"v":900,"d":"₪ 900"}},{"$f":"INDEX(פרמטרים[],MATCH(פרטי_פרויקט[[#This Row],[סוג הפרוייקט]],פרמטרים[סוג הפרוייקט],0),MATCH(פרטי_פרויקט[[#Headers],[מנהל תיק לקוח]],פרמטרים[#Headers],0))*INDEX('פרמטרי הפרוייקט'!$B$12:$H$12,1,MATCH(פרטי_פרויקט[[#Headers],[מנהל תיק לקוח]],פרמטרים[#Headers],0))*פרטי_פרויקט[[#This Row],[שעות עבודה בפועל]]","v":{"v":5220,"d":"₪ 5,220"}},{"$f":"INDEX(פרמטרים[],MATCH(פרטי_פרויקט[[#This Row],[סוג הפרוייקט]],פרמטרים[סוג הפרוייקט],0),MATCH(פרטי_פרויקט[[#Headers],[מנהל פרוייקט]],פרמטרים[#Headers],0))*INDEX('פרמטרי הפרוייקט'!$B$12:$H$12,1,MATCH(פרטי_פרויקט[[#Headers],[מנהל פרוייקט]],פרמטרים[#Headers],0))*פרטי_פרויקט[[#This Row],[שעות עבודה בפועל]]","v":{"v":10440,"d":"₪ 10,440"}},{"$f":"INDEX(פרמטרים[],MATCH(פרטי_פרויקט[[#This Row],[סוג הפרוייקט]],פרמטרים[סוג הפרוייקט],0),MATCH(פרטי_פרויקט[[#Headers],[מנהל אסטרטגיה]],פרמטרים[#Headers],0))*INDEX('פרמטרי הפרוייקט'!$B$12:$H$12,1,MATCH(פרטי_פרויקט[[#Headers],[מנהל אסטרטגיה]],פרמטרים[#Headers],0))*פרטי_פרויקט[[#This Row],[שעות עבודה בפועל]]","v":{"v":0,"d":"₪ 0"}},{"$f":"INDEX(פרמטרים[],MATCH(פרטי_פרויקט[[#This Row],[סוג הפרוייקט]],פרמטרים[סוג הפרוייקט],0),MATCH(פרטי_פרויקט[[#Headers],[מעצב מומחה]],פרמטרים[#Headers],0))*INDEX('פרמטרי הפרוייקט'!$B$12:$H$12,1,MATCH(פרטי_פרויקט[[#Headers],[מעצב מומחה]],פרמטרים[#Headers],0))*פרטי_פרויקט[[#This Row],[שעות עבודה בפועל]]","v":{"v":0,"d":"₪ 0"}},{"$f":"INDEX(פרמטרים[],MATCH(פרטי_פרויקט[[#This Row],[סוג הפרוייקט]],פרמטרים[סוג הפרוייקט],0),MATCH(פרטי_פרויקט[[#Headers],[צוות אירוע]],פרמטרים[#Headers],0))*INDEX('פרמטרי הפרוייקט'!$B$12:$H$12,1,MATCH(פרטי_פרויקט[[#Headers],[צוות אירוע]],פרמטרים[#Headers],0))*פרטי_פרויקט[[#This Row],[שעות עבודה בפועל]]","v":{"v":1160,"d":"₪ 1,160"}},{"$f":"INDEX(פרמטרים[],MATCH(פרטי_פרויקט[[#This Row],[סוג הפרוייקט]],פרמטרים[סוג הפרוייקט],0),MATCH(פרטי_פרויקט[[#Headers],[צוות אדמיניסטרטיבי]],פרמטרים[#Headers],0))*INDEX('פרמטרי הפרוייקט'!$B$12:$H$12,1,MATCH(פרטי_פרויקט[[#Headers],[צוות אדמיניסטרטיבי]],פרמטרים[#Headers],0))*פרטי_פרויקט[[#This Row],[שעות עבודה בפועל]]","v":{"v":870,"d":"₪ 870"}}]
{"$rows_left_out":3}
{"sheet":"סכומי הפרוייקט","index":3,"n_rows":10,"n_cols":14,"rows_kept":10}
[null,{"$f":"'פרמטרי הפרוייקט'!B1","v":"שם החברה"}]
[null,"כלי מעקב אחר פרוייקט ניהול אירוע"]
[null,{"$f":"'פרמטרי הפרוייקט'!B3","v":"שם החברה סודי"}]
["ה- PivotTable שמתחיל בתא משמאל מתעדכן באופן אוטומטי.\nמידע\nכדי לרענן את ה- PivotTable משמאל, בחר תא כלשהו בתוך ה- PivotTable ולאחר מכן, בכרטיסיית רצועת הכלים 'כלי PivotTable | ניתוח', בחר 'רענן'. לחלופין, הקש SHIFT+F10 בתא כלשהו ב- PivotTable ולאחר מכן בחר 'רענן'.","שם הפרוייקט","סכום של מנהל תיק לקוח","סכום של מנהל פרוייקט","סכום של מנהל אסטרטגיה","סכום של מעצב מומחה","סכום של צוות אירוע","סכום של צוות אדמיניסטרטיבי","סכום של מנהל תיק לקוח ","סכום של מנהל פרוייקט ","סכום של מנהל אסטרטגיה ","סכום של מעצב מומחה ","סכום של צוות אירוע ","סכום של צוות אדמיניסטרטיבי "]
[null,"פרוייקט 1",{"v":7200,"d":"₪ 7,200.00"},{"v":2400,"d":"₪ 2,400.00"},{"v":18000,"d":"₪ 18,000.00"},{"v":0,"d":"₪ 0.00"},{"v":0,"d":"₪ 0.00"},{"v":1200,"d":"₪ 1,200.00"},{"v":7920,"d":"₪ 7,920.00"},{"v":2640,"d":"₪ 2,640.00"},{"v":19800,"d":"₪ 19,800.00"},{"v":0,"d":"₪ 0.00"},{"v":0,"d":"₪ 0.00"},{"v":1320,"d":"₪ 1,320.00"}]
[null,"פרוייקט 2",{"v":14400,"d":"₪ 14,400.00"},{"v":24000,"d":"₪ 24,000.00"},{"v":6000,"d":"₪ 6,000.00"},{"v":4000,"d":"₪ 4,000.00"},{"v":0,"d":"₪ 0.00"},{"v":2400,"d":"₪ 2,400.00"},{"v":14040,"d":"₪ 14,040.00"},{"v":23400,"d":"₪ 23,400.00"},{"v":5850,"d":"₪ 5,850.00"},{"v":3900,"d":"₪ 3,900.00"},{"v":0,"d":"₪ 0.00"},{"v":2340,"d":"₪ 2,340.00"}]
[null,"פרוייקט 3",{"v":18000,"d":"₪ 18,000.00"},{"v":12000,"d":"₪ 12,000.00"},{"v":0,"d":"₪ 0.00"},{"v":25000,"d":"₪ 25,000.00"},{"v":0,"d":"₪ 0.00"},{"v":3000,"d":"₪ 3,000.00"},{"v":18000,"d":"₪ 18,000.00"},{"v":12000,"d":"₪ 12,000.00"},{"v":0,"d":"₪ 0.00"},{"v":25000,"d":"₪ 25,000.00"},{"v":0,"d":"₪ 0.00"},{"v":3000,"d":"₪ 3,000.00"}]
[null,"פרוייקט 4",{"v":5400,"d":"₪ 5,400.00"},{"v":10800,"d":"₪ 10,800.00"},{"v":0,"d":"₪ 0.00"},{"v":0,"d":"₪ 0.00"},{"v":1200,"d":"₪ 1,200.00"},{"v":900,"d":"₪ 900.00"},{"v":5220,"d":"₪ 5,220.00"},{"v":10440,"d":"₪ 10,440.00"},{"v":0,"d":"₪ 0.00"},{"v":0,"d":"₪ 0.00"},{"v":1160,"d":"₪ 1,160.00"},{"v":870,"d":"₪ 870.00"}]
{"$rows_left_out":2}