{"text_format":"3","workbook":"xlsx","n_sheets":4,"sheets":["התחלה","פרמטרי פרוייקט","פרטי פרוייקט","סכומי פרוייקט"],"not_rendered":{"charts":2,"defined_names":3,"pivot_tables":1},"read":"whole","date_system":"1900"}

{"sheet":"התחלה","index":0,"n_rows":8,"n_cols":2,"rows_kept":8}
[null,"אודות תבנית זו"]
[]
[null,"השתמש בחוברת עבודה זו כדי לעקוב אחר פרמטרי פרוייקט, פרטי פרוייקט וסכומי פרוייקט במהלך תכנון פרוייקט עבור משרדי עורכי דין."]
[null,"מלא את שם החברה בגליון העבודה 'פרמטרי פרוייקט', והוא יתעדכן באופן אוטומטי בגליונות העבודה האחרים."]
[null,"הזן מידע בגליון העבודה 'פרמטרי פרוייקט', כדי לעדכן את תרשימי הטורים, ובגליון העבודה 'פרטי פרוייקט'. ה- PivotTable בגליון העבודה 'סכומי פרוייקט' מתעדכן באופן אוטומטי."]
[null,"הערה:  "]
[null,"הוראות נוספות סופקו בעמודה A בכל גליון עבודה. טקסט זה הוסתר במכוון. כדי להסיר את הטקסט, בחר את עמודה A ולאחר מכן בחר DELETE. כדי לבטל את הסתרת הטקסט, בחר את עמודה A ולאחר מכן שנה את צבע הגופן."]
[null,"לקבלת מידע נוסף על הטבלאות בגליונות העבודה, הקש SHIFT ולאחר מכן F10 בתוך טבלה, בחר את האפשרות 'טבלה' ולאחר מכן בחר 'טקסט חלופי'. עבור ה- PivotTable בגליון העבודה 'סכומי פרוייקט', הקש SHIFT ולאחר מכן F10 בתוך הטבלה, בחר 'אפשרויות PivotTable' ולאחר מכן בחר את הכרטיסיה 'טקסט חלופי'."]
{"$rows_left_out":1}
{"sheet":"פרמטרי פרוייקט","index":1,"n_rows":19,"n_cols":9,"rows_kept":19}
["צור פרמטרי פרוייקט בגליון עבודה זה. הזן את שם החברה בתא משמאל. הוראות שימושיות מופיעות בתאים בעמודה זו.","שם החברה"]
["הכותרת של גליון עבודה זה מופיעה בתא משמאל.","תכנון פרוייקט עבור משרדי עורכי דין"]
["הודעה לגבי סודיות מופיעה בתא משמאל.",{"$f":"B1&\" - סודי\"","v":"שם החברה - סודי"}]
["העצה מופיעה בתא משמאל.","התאים המוצללים מחושבים עבורך. אין צורך להזין בהם ערך."]
["הזן פרטים בטבלה 'פרמטרים' שמתחילה בתא משמאל. ההוראה הבאה מופיעה בתא A12.","סוג הפרוייקט","שותף כללי","עורך דין עסקי","עורך דין שמתמחה בליטיגציה","עורך דין שמתמחה בקניין רוחני","עורך דין שמתמחה בפשיטות רגל","צוות אדמיניסטרטיבי","סה\"כ"]
[null,"רישום חברה",{"v":0.1,"d":"10%"},{"v":0.4,"d":"40%"},{"v":0,"d":"0%"},{"v":0,"d":"0%"},{"v":0,"d":"0%"},{"v":0.5,"d":"50%"},{"$f":"SUM(פרמטרים[[#This Row],[שותף כללי]:[צוות אדמיניסטרטיבי]])","v":{"v":1,"d":"100%"}}]
[null,"רכישת עסק",{"v":0.1,"d":"10%"},{"v":0.4,"d":"40%"},{"v":0,"d":"0%"},{"v":0.1,"d":"10%"},{"v":0,"d":"0%"},{"v":0.4,"d":"40%"},{"$f":"SUM(פרמטרים[[#This Row],[שותף כללי]:[צוות אדמיניסטרטיבי]])","v":{"v":1,"d":"100%"}}]
[null,"ביטוח חבות מוצר",{"v":0.2,"d":"20%"},{"v":0,"d":"0%"},{"v":0.5,"d":"50%"},{"v":0,"d":"0%"},{"v":0,"d":"0%"},{"v":0.3,"d":"30%"},{"$f":"SUM(פרמטרים[[#This Row],[שותף כללי]:[צוות אדמיניסטרטיבי]])","v":{"v":1,"d":"100%"}}]
{"$rows_left_out":12}
{"sheet":"פרטי פרוייקט","index":2,"n_rows":10,"n_cols":25,"rows_kept":10,"merged":[[1,24,8,28]]}
["צור פרטי פרוייקט בגליון עבודה זה. שם החברה מתעדכן באופן אוטומטי בתא משמאל. הוראות שימושיות מופיעות בתאים בעמודה זו. הקש על החץ למטה כדי להתחיל.",{"$f":"'פרמטרי פרוייקט'!B1","v":"שם החברה"}]
["הכותרת של גליון עבודה זה מופיעה בתא משמאל, ועצת המידע מופיעה בתא Y2.",{"$f":"'פרמטרי פרוייקט'!B2","v":"תכנון פרוייקט עבור משרדי עורכי דין"},{"$nulls":22},"מידע:\nכדי להוסיף שורה, בחר את התא השמאלי התחתון בגוף הטבלה (לא את שורת הסכומים) והקש Tab. לחלופין, הקש SHIFT ולאחר מכן F10 בתוך הטבלה, במקום שבו ברצונך להוסיף את השורה, ולאחר מכן בחר 'הוסף' | 'שורות טבלה מעל/מתחת'.\nהקפד למחוק את כל השורות שאינן נמצאות בשימוש, מכיוון שה- PivotTable 'סכומי פרוייקט' משתמש בכל תאי הטבלה, ולכן עלול להציג תוצאות שגויות."]
["הודעה לגבי סודיות מופיעה בתא משמאל.",{"$f":"'פרמטרי פרוייקט'!B3","v":"שם החברה - סודי"}]
["הזן מידע בטבלה 'פרטים' שמתחילה בתא משמאל. סוגי הפרוייקטים בטבלה 'פרטים' משמאל מתעדכנים באופן אוטומטי מהטבלה 'פרמטרים' שבגליון העבודה 'פרמטרי פרוייקט'.","שם הפרוייקט","סוג הפרוייקט","תאריך התחלה משוער","תאריך סיום משוער","תאריך התחלה בפועל","תאריך סיום בפועל","שעות עבודה משוערות","שעות עבודה בפועל","משך משוער","משך בפועל","שותף כללי","עורך דין עסקי","עורך דין שמתמחה בליטיגציה","עורך דין שמתמחה בקניין רוחני","עורך דין שמתמחה בפשיטות רגל","צוות אדמיניסטרטיבי","שותף כללי 2","עורך דין עסקי 2","עורך דין שמתמחה בליטיגציה 2","עורך דין שמתמחה בקניין רוחני 2","עורך דין שמתמחה בפשיטות רגל 2","צוות אדמיניסטרטיבי 2"]
[null,"פרוייקט 1","רישום חברה",{"$f":"TODAY()","v":"2019-02-19"},{"$f":"TODAY()+60","v":"2019-04-20"},{"$f":"TODAY()+10","v":"2019-03-01"},{"$f":"TODAY()+65","v":"2019-04-25"},200,220,{"$f":"DAYS360(פרטים[[#This Row],[תאריך התחלה משוער]],פרטים[[#This Row],[תאריך סיום משוער]],FALSE)","v":61},{"$f":"DAYS360(פרטים[[#This Row],[תאריך התחלה בפועל]],פרטים[[#This Row],[תאריך סיום בפועל]],FALSE)","v":54},{"$f":"INDEX(פרמטרים[],MATCH(פרטים[[#This Row],[סוג הפרוייקט]],פרמטרים[סוג הפרוייקט],0),MATCH(פרטים[[#Headers],[שותף כללי]],פרמטרים[#Headers],0))*INDEX('פרמטרי פרוייקט'!$B$12:$H$12,1,MATCH(פרטים[[#Headers],[שותף כללי]],פרמטרים[#Headers],0))*פרטים[[#This Row],[שעות עבודה משוערות]]","v":{"v":7000,"d":"₪ 7,000"}},{"$f":"INDEX(פרמטרים[],MATCH(פרטים[[#This Row],[סוג הפרוייקט]],פרמטרים[סוג הפרוייקט],0),MATCH(פרטים[[#Headers],[עורך דין עסקי]],פרמטרים[#Headers],0))*INDEX('פרמטרי פרוייקט'!$B$12:$H$12,1,MATCH(פרטים[[#Headers],[עורך דין עסקי]],פרמטרים[#Headers],0))*פרטים[[#This Row],[שעות עבודה משוערות]]","v":{"v":20000,"d":"₪ 20,000"}},{"$f":"INDEX(פרמטרים[],MATCH(פרטים[[#This Row],[סוג הפרוייקט]],פרמטרים[סוג הפרוייקט],0),MATCH(פרטים[[#Headers],[עורך דין שמתמחה בליטיגציה]],פרמטרים[#Headers],0))*INDEX('פרמטרי פרוייקט'!$B$12:$H$12,1,MATCH(פרטים[[#Headers],[עורך דין שמתמחה בליטיגציה]],פרמטרים[#Headers],0))*פרטים[[#This Row],[שעות עבודה משוערות]]","v":{"v":0,"d":"₪ 0"}},{"$f":"INDEX(פרמטרים[],MATCH(פרטים[[#This Row],[סוג הפרוייקט]],פרמטרים[סוג הפרוייקט],0),MATCH(פרטים[[#Headers],[עורך דין שמתמחה בקניין רוחני]],פרמטרים[#Headers],0))*INDEX('פרמטרי פרוייקט'!$B$12:$H$12,1,MATCH(פרטים[[#Headers],[עורך דין שמתמחה בקניין רוחני]],פרמטרים[#Headers],0))*פרטים[[#This Row],[שעות עבודה משוערות]]","v":{"v":0,"d":"₪ 0"}},{"$f":"INDEX(פרמטרים[],MATCH(פרטים[[#This Row],[סוג הפרוייקט]],פרמטרים[סוג הפרוייקט],0),MATCH(פרטים[[#Headers],[עורך דין שמתמחה בפשיטות רגל]],פרמטרים[#Headers],0))*INDEX('פרמטרי פרוייקט'!$B$12:$H$12,1,MATCH(פרטים[[#Headers],[עורך דין שמתמחה בפשיטות רגל]],פרמטרים[#Headers],0))*פרטים[[#This Row],[שעות עבודה משוערות]]","v":{"v":0,"d":"₪ 0"}},{"$f":"INDEX(פרמטרים[],MATCH(פרטים[[#This Row],[סוג הפרוייקט]],פרמטרים[סוג הפרוייקט],0),MATCH(פרטים[[#Headers],[צוות אדמיניסטרטיבי]],פרמטרים[#Headers],0))*INDEX('פרמטרי פרוייקט'!$B$12:$H$12,1,MATCH(פרטים[[#Headers],[צוות אדמיניסטרטיבי]],פרמטרים[#Headers],0))*פרטים[[#This Row],[שעות עבודה משוערות]]","v":{"v":12500,"d":"₪ 12,500"}},{"$f":"INDEX(פרמטרים[],MATCH(פרטים[[#This Row],[סוג הפרוייקט]],פרמטרים[סוג הפרוייקט],0),MATCH(פרטים[[#Headers],[שותף כללי]],פרמטרים[#Headers],0))*INDEX('פרמטרי פרוייקט'!$B$12:$H$12,1,MATCH(פרטים[[#Headers],[שותף כללי]],פרמטרים[#Headers],0))*פרטים[[#This Row],[שעות עבודה בפועל]]","v":{"v":7700,"d":"₪ 7,700"}},{"$f":"INDEX(פרמטרים[],MATCH(פרטים[[#This Row],[סוג הפרוייקט]],פרמטרים[סוג הפרוייקט],0),MATCH(פרטים[[#Headers],[עורך דין עסקי]],פרמטרים[#Headers],0))*INDEX('פרמטרי פרוייקט'!$B$12:$H$12,1,MATCH(פרטים[[#Headers],[עורך דין עסקי]],פרמטרים[#Headers],0))*פרטים[[#This Row],[שעות עבודה בפועל]]","v":{"v":22000,"d":"₪ 22,000"}},{"$f":"INDEX(פרמטרים[],MATCH(פרטים[[#This Row],[סוג הפרוייקט]],פרמטרים[סוג הפרוייקט],0),MATCH(פרטים[[#Headers],[עורך דין שמתמחה בליטיגציה]],פרמטרים[#Headers],0))*INDEX('פרמטרי פרוייקט'!$B$12:$H$12,1,MATCH(פרטים[[#Headers],[עורך דין שמתמחה בליטיגציה]],פרמטרים[#Headers],0))*פרטים[[#This Row],[שעות עבודה בפועל]]","v":{"v":0,"d":"₪ 0"}},{"$f":"INDEX(פרמטרים[],MATCH(פרטים[[#This Row],[סוג הפרוייקט]],פרמטרים[סוג הפרוייקט],0),MATCH(פרטים[[#Headers],[עורך דין שמתמחה בקניין רוחני]],פרמטרים[#Headers],0))*INDEX('פרמטרי פרוייקט'!$B$12:$H$12,1,MATCH(פרטים[[#Headers],[עורך דין שמתמחה בקניין רוחני]],פרמטרים[#Headers],0))*פרטים[[#This Row],[שעות עבודה בפועל]]","v":{"v":0,"d":"₪ 0"}},{"$f":"INDEX(פרמטרים[],MATCH(פרטים[[#This Row],[סוג הפרוייקט]],פרמטרים[סוג הפרוייקט],0),MATCH(פרטים[[#Headers],[עורך דין שמתמחה בפשיטות רגל]],פרמטרים[#Headers],0))*INDEX('פרמטרי פרוייקט'!$B$12:$H$12,1,MATCH(פרטים[[#Headers],[עורך דין שמתמחה בפשיטות רגל]],פרמטרים[#Headers],0))*פרטים[[#This Row],[שעות עבודה בפועל]]","v":{"v":0,"d":"₪ 0"}},{"$f":"INDEX(פרמטרים[],MATCH(פרטים[[#This Row],[סוג הפרוייקט]],פרמטרים[סוג הפרוייקט],0),MATCH(פרטים[[#Headers],[צוות אדמיניסטרטיבי]],פרמטרים[#Headers],0))*INDEX('פרמטרי פרוייקט'!$B$12:$H$12,1,MATCH(פרטים[[#Headers],[צוות אדמיניסטרטיבי]],פרמטרים[#Headers],0))*פרטים[[#This Row],[שעות עבודה בפועל]]","v":{"v":13750,"d":"₪ 13,750"}}]
[null,"פרוייקט 2","רכישת עסק",{"$f":"TODAY()+30","v":"2019-03-21"},{"$f":"TODAY()+100","v":"2019-05-30"},{"$f":"TODAY()+40","v":"2019-03-31"},{"$f":"TODAY()+110","v":"2019-06-09"},400,390,{"$f":"DAYS360(פרטים[[#This Row],[תאריך התחלה משוער]],פרטים[[#This Row],[תאריך סיום משוער]],FALSE)","v":69},{"$f":"DAYS360(פרטים[[#This Row],[תאריך התחלה בפועל]],פרטים[[#This Row],[תאריך סיום בפועל]],FALSE)","v":69},{"$f":"INDEX(פרמטרים[],MATCH(פרטים[[#This Row],[סוג הפרוייקט]],פרמטרים[סוג הפרוייקט],0),MATCH(פרטים[[#Headers],[שותף כללי]],פרמטרים[#Headers],0))*INDEX('פרמטרי פרוייקט'!$B$12:$H$12,1,MATCH(פרטים[[#Headers],[שותף כללי]],פרמטרים[#Headers],0))*פרטים[[#This Row],[שעות עבודה משוערות]]","v":{"v":14000,"d":"₪ 14,000"}},{"$f":"INDEX(פרמטרים[],MATCH(פרטים[[#This Row],[סוג הפרוייקט]],פרמטרים[סוג הפרוייקט],0),MATCH(פרטים[[#Headers],[עורך דין עסקי]],פרמטרים[#Headers],0))*INDEX('פרמטרי פרוייקט'!$B$12:$H$12,1,MATCH(פרטים[[#Headers],[עורך דין עסקי]],פרמטרים[#Headers],0))*פרטים[[#This Row],[שעות עבודה משוערות]]","v":{"v":40000,"d":"₪ 40,000"}},{"$f":"INDEX(פרמטרים[],MATCH(פרטים[[#This Row],[סוג הפרוייקט]],פרמטרים[סוג הפרוייקט],0),MATCH(פרטים[[#Headers],[עורך דין שמתמחה בליטיגציה]],פרמטרים[#Headers],0))*INDEX('פרמטרי פרוייקט'!$B$12:$H$12,1,MATCH(פרטים[[#Headers],[עורך דין שמתמחה בליטיגציה]],פרמטרים[#Headers],0))*פרטים[[#This Row],[שעות עבודה משוערות]]","v":{"v":0,"d":"₪ 0"}},{"$f":"INDEX(פרמטרים[],MATCH(פרטים[[#This Row],[סוג הפרוייקט]],פרמטרים[סוג הפרוייקט],0),MATCH(פרטים[[#Headers],[עורך דין שמתמחה בקניין רוחני]],פרמטרים[#Headers],0))*INDEX('פרמטרי פרוייקט'!$B$12:$H$12,1,MATCH(פרטים[[#Headers],[עורך דין שמתמחה בקניין רוחני]],פרמטרים[#Headers],0))*פרטים[[#This Row],[שעות עבודה משוערות]]","v":{"v":11000,"d":"₪ 11,000"}},{"$f":"INDEX(פרמטרים[],MATCH(פרטים[[#This Row],[סוג הפרוייקט]],פרמטרים[סוג הפרוייקט],0),MATCH(פרטים[[#Headers],[עורך דין שמתמחה בפשיטות רגל]],פרמטרים[#Headers],0))*INDEX('פרמטרי פרוייקט'!$B$12:$H$12,1,MATCH(פרטים[[#Headers],[עורך דין שמתמחה בפשיטות רגל]],פרמטרים[#Headers],0))*פרטים[[#This Row],[שעות עבודה משוערות]]","v":{"v":0,"d":"₪ 0"}},{"$f":"INDEX(פרמטרים[],MATCH(פרטים[[#This Row],[סוג הפרוייקט]],פרמטרים[סוג הפרוייקט],0),MATCH(פרטים[[#Headers],[צוות אדמיניסטרטיבי]],פרמטרים[#Headers],0))*INDEX('פרמטרי פרוייקט'!$B$12:$H$12,1,MATCH(פרטים[[#Headers],[צוות אדמיניסטרטיבי]],פרמטרים[#Headers],0))*פרטים[[#This Row],[שעות עבודה משוערות]]","v":{"v":20000,"d":"₪ 20,000"}},{"$f":"INDEX(פרמטרים[],MATCH(פרטים[[#This Row],[סוג הפרוייקט]],פרמטרים[סוג הפרוייקט],0),MATCH(פרטים[[#Headers],[שותף כללי]],פרמטרים[#Headers],0))*INDEX('פרמטרי פרוייקט'!$B$12:$H$12,1,MATCH(פרטים[[#Headers],[שותף כללי]],פרמטרים[#Headers],0))*פרטים[[#This Row],[שעות עבודה בפועל]]","v":{"v":13650,"d":"₪ 13,650"}},{"$f":"INDEX(פרמטרים[],MATCH(פרטים[[#This Row],[סוג הפרוייקט]],פרמטרים[סוג הפרוייקט],0),MATCH(פרטים[[#Headers],[עורך דין עסקי]],פרמטרים[#Headers],0))*INDEX('פרמטרי פרוייקט'!$B$12:$H$12,1,MATCH(פרטים[[#Headers],[עורך דין עסקי]],פרמטרים[#Headers],0))*פרטים[[#This Row],[שעות עבודה בפועל]]","v":{"v":39000,"d":"₪ 39,000"}},{"$f":"INDEX(פרמטרים[],MATCH(פרטים[[#This Row],[סוג הפרוייקט]],פרמטרים[סוג הפרוייקט],0),MATCH(פרטים[[#Headers],[עורך דין שמתמחה בליטיגציה]],פרמטרים[#Headers],0))*INDEX('פרמטרי פרוייקט'!$B$12:$H$12,1,MATCH(פרטים[[#Headers],[עורך דין שמתמחה בליטיגציה]],פרמטרים[#Headers],0))*פרטים[[#This Row],[שעות עבודה בפועל]]","v":{"v":0,"d":"₪ 0"}},{"$f":"INDEX(פרמטרים[],MATCH(פרטים[[#This Row],[סוג הפרוייקט]],פרמטרים[סוג הפרוייקט],0),MATCH(פרטים[[#Headers],[עורך דין שמתמחה בקניין רוחני]],פרמטרים[#Headers],0))*INDEX('פרמטרי פרוייקט'!$B$12:$H$12,1,MATCH(פרטים[[#Headers],[עורך דין שמתמחה בקניין רוחני]],פרמטרים[#Headers],0))*פרטים[[#This Row],[שעות עבודה בפועל]]","v":{"v":10725,"d":"₪ 10,725"}},{"$f":"INDEX(פרמטרים[],MATCH(פרטים[[#This Row],[סוג הפרוייקט]],פרמטרים[סוג הפרוייקט],0),MATCH(פרטים[[#Headers],[עורך דין שמתמחה בפשיטות רגל]],פרמטרים[#Headers],0))*INDEX('פרמטרי פרוייקט'!$B$12:$H$12,1,MATCH(פרטים[[#Headers],[עורך דין שמתמחה בפשיטות רגל]],פרמטרים[#Headers],0))*פרטים[[#This Row],[שעות עבודה בפועל]]","v":{"v":0,"d":"₪ 0"}},{"$f":"INDEX(פרמטרים[],MATCH(פרטים[[#This Row],[סוג הפרוייקט]],פרמטרים[סוג הפרוייקט],0),MATCH(פרטים[[#Headers],[צוות אדמיניסטרטיבי]],פרמטרים[#Headers],0))*INDEX('פרמטרי פרוייקט'!$B$12:$H$12,1,MATCH(פרטים[[#Headers],[צוות אדמיניסטרטיבי]],פרמטרים[#Headers],0))*פרטים[[#This Row],[שעות עבודה בפועל]]","v":{"v":19500,"d":"₪ 19,500"}}]
[null,"פרוייקט 3","ביטוח חבות מוצר",{"$f":"TODAY()+150","v":"2019-07-19"},{"$f":"TODAY()+150","v":"2019-07-19"},{"$f":"TODAY()+150","v":"2019-07-19"},{"$f":"TODAY()+170","v":"2019-08-08"},500,500,{"$f":"DAYS360(פרטים[[#This Row],[תאריך התחלה משוער]],פרטים[[#This Row],[תאריך סיום משוער]],FALSE)","v":0},{"$f":"DAYS360(פרטים[[#This Row],[תאריך התחלה בפועל]],פרטים[[#This Row],[תאריך סיום בפועל]],FALSE)","v":19},{"$f":"INDEX(פרמטרים[],MATCH(פרטים[[#This Row],[סוג הפרוייקט]],פרמטרים[סוג הפרוייקט],0),MATCH(פרטים[[#Headers],[שותף כללי]],פרמטרים[#Headers],0))*INDEX('פרמטרי פרוייקט'!$B$12:$H$12,1,MATCH(פרטים[[#Headers],[שותף כללי]],פרמטרים[#Headers],0))*פרטים[[#This Row],[שעות עבודה משוערות]]","v":{"v":35000,"d":"₪ 35,000"}},{"$f":"INDEX(פרמטרים[],MATCH(פרטים[[#This Row],[סוג הפרוייקט]],פרמטרים[סוג הפרוייקט],0),MATCH(פרטים[[#Headers],[עורך דין עסקי]],פרמטרים[#Headers],0))*INDEX('פרמטרי פרוייקט'!$B$12:$H$12,1,MATCH(פרטים[[#Headers],[עורך דין עסקי]],פרמטרים[#Headers],0))*פרטים[[#This Row],[שעות עבודה משוערות]]","v":{"v":0,"d":"₪ 0"}},{"$f":"INDEX(פרמטרים[],MATCH(פרטים[[#This Row],[סוג הפרוייקט]],פרמטרים[סוג הפרוייקט],0),MATCH(פרטים[[#Headers],[עורך דין שמתמחה בליטיגציה]],פרמטרים[#Headers],0))*INDEX('פרמטרי פרוייקט'!$B$12:$H$12,1,MATCH(פרטים[[#Headers],[עורך דין שמתמחה בליטיגציה]],פרמטרים[#Headers],0))*פרטים[[#This Row],[שעות עבודה משוערות]]","v":{"v":75000,"d":"₪ 75,000"}},{"$f":"INDEX(פרמטרים[],MATCH(פרטים[[#This Row],[סוג הפרוייקט]],פרמטרים[סוג הפרוייקט],0),MATCH(פרטים[[#Headers],[עורך דין שמתמחה בקניין רוחני]],פרמטרים[#Headers],0))*INDEX('פרמטרי פרוייקט'!$B$12:$H$12,1,MATCH(פרטים[[#Headers],[עורך דין שמתמחה בקניין רוחני]],פרמטרים[#Headers],0))*פרטים[[#This Row],[שעות עבודה משוערות]]","v":{"v":0,"d":"₪ 0"}},{"$f":"INDEX(פרמטרים[],MATCH(פרטים[[#This Row],[סוג הפרוייקט]],פרמטרים[סוג הפרוייקט],0),MATCH(פרטים[[#Headers],[עורך דין שמתמחה בפשיטות רגל]],פרמטרים[#Headers],0))*INDEX('פרמטרי פרוייקט'!$B$12:$H$12,1,MATCH(פרטים[[#Headers],[עורך דין שמתמחה בפשיטות רגל]],פרמטרים[#Headers],0))*פרטים[[#This Row],[שעות עבודה משוערות]]","v":{"v":0,"d":"₪ 0"}},{"$f":"INDEX(פרמטרים[],MATCH(פרטים[[#This Row],[סוג הפרוייקט]],פרמטרים[סוג הפרוייקט],0),MATCH(פרטים[[#Headers],[צוות אדמיניסטרטיבי]],פרמטרים[#Headers],0))*INDEX('פרמטרי פרוייקט'!$B$12:$H$12,1,MATCH(פרטים[[#Headers],[צוות אדמיניסטרטיבי]],פרמטרים[#Headers],0))*פרטים[[#This Row],[שעות עבודה משוערות]]","v":{"v":18750,"d":"₪ 18,750"}},{"$f":"INDEX(פרמטרים[],MATCH(פרטים[[#This Row],[סוג הפרוייקט]],פרמטרים[סוג הפרוייקט],0),MATCH(פרטים[[#Headers],[שותף כללי]],פרמטרים[#Headers],0))*INDEX('פרמטרי פרוייקט'!$B$12:$H$12,1,MATCH(פרטים[[#Headers],[שותף כללי]],פרמטרים[#Headers],0))*פרטים[[#This Row],[שעות עבודה בפועל]]","v":{"v":35000,"d":"₪ 35,000"}},{"$f":"INDEX(פרמטרים[],MATCH(פרטים[[#This Row],[סוג הפרוייקט]],פרמטרים[סוג הפרוייקט],0),MATCH(פרטים[[#Headers],[עורך דין עסקי]],פרמטרים[#Headers],0))*INDEX('פרמטרי פרוייקט'!$B$12:$H$12,1,MATCH(פרטים[[#Headers],[עורך דין עסקי]],פרמטרים[#Headers],0))*פרטים[[#This Row],[שעות עבודה בפועל]]","v":{"v":0,"d":"₪ 0"}},{"$f":"INDEX(פרמטרים[],MATCH(פרטים[[#This Row],[סוג הפרוייקט]],פרמטרים[סוג הפרוייקט],0),MATCH(פרטים[[#Headers],[עורך דין שמתמחה בליטיגציה]],פרמטרים[#Headers],0))*INDEX('פרמטרי פרוייקט'!$B$12:$H$12,1,MATCH(פרטים[[#Headers],[עורך דין שמתמחה בליטיגציה]],פרמטרים[#Headers],0))*פרטים[[#This Row],[שעות עבודה בפועל]]","v":{"v":75000,"d":"₪ 75,000"}},{"$f":"INDEX(פרמטרים[],MATCH(פרטים[[#This Row],[סוג הפרוייקט]],פרמטרים[סוג הפרוייקט],0),MATCH(פרטים[[#Headers],[עורך דין שמתמחה בקניין רוחני]],פרמטרים[#Headers],0))*INDEX('פרמטרי פרוייקט'!$B$12:$H$12,1,MATCH(פרטים[[#Headers],[עורך דין שמתמחה בקניין רוחני]],פרמטרים[#Headers],0))*פרטים[[#This Row],[שעות עבודה בפועל]]","v":{"v":0,"d":"₪ 0"}},{"$f":"INDEX(פרמטרים[],MATCH(פרטים[[#This Row],[סוג הפרוייקט]],פרמטרים[סוג הפרוייקט],0),MATCH(פרטים[[#Headers],[עורך דין שמתמחה בפשיטות רגל]],פרמטרים[#Headers],0))*INDEX('פרמטרי פרוייקט'!$B$12:$H$12,1,MATCH(פרטים[[#Headers],[עורך דין שמתמחה בפשיטות רגל]],פרמטרים[#Headers],0))*פרטים[[#This Row],[שעות עבודה בפועל]]","v":{"v":0,"d":"₪ 0"}},{"$f":"INDEX(פרמטרים[],MATCH(פרטים[[#This Row],[סוג הפרוייקט]],פרמטרים[סוג הפרוייקט],0),MATCH(פרטים[[#Headers],[צוות אדמיניסטרטיבי]],פרמטרים[#Headers],0))*INDEX('פרמטרי פרוייקט'!$B$12:$H$12,1,MATCH(פרטים[[#Headers],[צוות אדמיניסטרטיבי]],פרמטרים[#Headers],0))*פרטים[[#This Row],[שעות עבודה בפועל]]","v":{"v":18750,"d":"₪ 18,750"}}]
[null,"פרוייקט 4","הגשת בקשה לפטנט",{"$f":"TODAY()+200","v":"2019-09-07"},{"$f":"TODAY()+230","v":"2019-10-07"},{"$f":"TODAY()+230","v":"2019-10-07"},{"$f":"TODAY()+230","v":"2019-10-07"},150,145,{"$f":"DAYS360(פרטים[[#This Row],[תאריך התחלה משוער]],פרטים[[#This Row],[תאריך סיום משוער]],FALSE)","v":30},{"$f":"DAYS360(פרטים[[#This Row],[תאריך התחלה בפועל]],פרטים[[#This Row],[תאריך סיום בפועל]],FALSE)","v":0},{"$f":"INDEX(פרמטרים[],MATCH(פרטים[[#This Row],[סוג הפרוייקט]],פרמטרים[סוג הפרוייקט],0),MATCH(פרטים[[#Headers],[שותף כללי]],פרמטרים[#Headers],0))*INDEX('פרמטרי פרוייקט'!$B$12:$H$12,1,MATCH(פרטים[[#Headers],[שותף כללי]],פרמטרים[#Headers],0))*פרטים[[#This Row],[שעות עבודה משוערות]]","v":{"v":5250,"d":"₪ 5,250"}},{"$f":"INDEX(פרמטרים[],MATCH(פרטים[[#This Row],[סוג הפרוייקט]],פרמטרים[סוג הפרוייקט],0),MATCH(פרטים[[#Headers],[עורך דין עסקי]],פרמטרים[#Headers],0))*INDEX('פרמטרי פרוייקט'!$B$12:$H$12,1,MATCH(פרטים[[#Headers],[עורך דין עסקי]],פרמטרים[#Headers],0))*פרטים[[#This Row],[שעות עבודה משוערות]]","v":{"v":0,"d":"₪ 0"}},{"$f":"INDEX(פרמטרים[],MATCH(פרטים[[#This Row],[סוג הפרוייקט]],פרמטרים[סוג הפרוייקט],0),MATCH(פרטים[[#Headers],[עורך דין שמתמחה בליטיגציה]],פרמטרים[#Headers],0))*INDEX('פרמטרי פרוייקט'!$B$12:$H$12,1,MATCH(פרטים[[#Headers],[עורך דין שמתמחה בליטיגציה]],פרמטרים[#Headers],0))*פרטים[[#This Row],[שעות עבודה משוערות]]","v":{"v":0,"d":"₪ 0"}},{"$f":"INDEX(פרמטרים[],MATCH(פרטים[[#This Row],[סוג הפרוייקט]],פרמטרים[סוג הפרוייקט],0),MATCH(פרטים[[#Headers],[עורך דין שמתמחה בקניין רוחני]],פרמטרים[#Headers],0))*INDEX('פרמטרי פרוייקט'!$B$12:$H$12,1,MATCH(פרטים[[#Headers],[עורך דין שמתמחה בקניין רוחני]],פרמטרים[#Headers],0))*פרטים[[#This Row],[שעות עבודה משוערות]]","v":{"v":24750,"d":"₪ 24,750"}},{"$f":"INDEX(פרמטרים[],MATCH(פרטים[[#This Row],[סוג הפרוייקט]],פרמטרים[סוג הפרוייקט],0),MATCH(פרטים[[#Headers],[עורך דין שמתמחה בפשיטות רגל]],פרמטרים[#Headers],0))*INDEX('פרמטרי פרוייקט'!$B$12:$H$12,1,MATCH(פרטים[[#Headers],[עורך דין שמתמחה בפשיטות רגל]],פרמטרים[#Headers],0))*פרטים[[#This Row],[שעות עבודה משוערות]]","v":{"v":0,"d":"₪ 0"}},{"$f":"INDEX(פרמטרים[],MATCH(פרטים[[#This Row],[סוג הפרוייקט]],פרמטרים[סוג הפרוייקט],0),MATCH(פרטים[[#Headers],[צוות אדמיניסטרטיבי]],פרמטרים[#Headers],0))*INDEX('פרמטרי פרוייקט'!$B$12:$H$12,1,MATCH(פרטים[[#Headers],[צוות אדמיניסטרטיבי]],פרמטרים[#Headers],0))*פרטים[[#This Row],[שעות עבודה משוערות]]","v":{"v":5625,"d":"₪ 5,625"}},{"$f":"INDEX(פרמטרים[],MATCH(פרטים[[#This Row],[סוג הפרוייקט]],פרמטרים[סוג הפרוייקט],0),MATCH(פרטים[[#Headers],[שותף כללי]],פרמטרים[#Headers],0))*INDEX('פרמטרי פרוייקט'!$B$12:$H$12,1,MATCH(פרטים[[#Headers],[שותף כללי]],פרמטרים[#Headers],0))*פרטים[[#This Row],[שעות עבודה בפועל]]","v":{"v":5075,"d":"₪ 5,075"}},{"$f":"INDEX(פרמטרים[],MATCH(פרטים[[#This Row],[סוג הפרוייקט]],פרמטרים[סוג הפרוייקט],0),MATCH(פרטים[[#Headers],[עורך דין עסקי]],פרמטרים[#Headers],0))*INDEX('פרמטרי פרוייקט'!$B$12:$H$12,1,MATCH(פרטים[[#Headers],[עורך דין עסקי]],פרמטרים[#Headers],0))*פרטים[[#This Row],[שעות עבודה בפועל]]","v":{"v":0,"d":"₪ 0"}},{"$f":"INDEX(פרמטרים[],MATCH(פרטים[[#This Row],[סוג הפרוייקט]],פרמטרים[סוג הפרוייקט],0),MATCH(פרטים[[#Headers],[עורך דין שמתמחה בליטיגציה]],פרמטרים[#Headers],0))*INDEX('פרמטרי פרוייקט'!$B$12:$H$12,1,MATCH(פרטים[[#Headers],[עורך דין שמתמחה בליטיגציה]],פרמטרים[#Headers],0))*פרטים[[#This Row],[שעות עבודה בפועל]]","v":{"v":0,"d":"₪ 0"}},{"$f":"INDEX(פרמטרים[],MATCH(פרטים[[#This Row],[סוג הפרוייקט]],פרמטרים[סוג הפרוייקט],0),MATCH(פרטים[[#Headers],[עורך דין שמתמחה בקניין רוחני]],פרמטרים[#Headers],0))*INDEX('פרמטרי פרוייקט'!$B$12:$H$12,1,MATCH(פרטים[[#Headers],[עורך דין שמתמחה בקניין רוחני]],פרמטרים[#Headers],0))*פרטים[[#This Row],[שעות עבודה בפועל]]","v":{"v":23925,"d":"₪ 23,925"}},{"$f":"INDEX(פרמטרים[],MATCH(פרטים[[#This Row],[סוג הפרוייקט]],פרמטרים[סוג הפרוייקט],0),MATCH(פרטים[[#Headers],[עורך דין שמתמחה בפשיטות רגל]],פרמטרים[#Headers],0))*INDEX('פרמטרי פרוייקט'!$B$12:$H$12,1,MATCH(פרטים[[#Headers],[עורך דין שמתמחה בפשיטות רגל]],פרמטרים[#Headers],0))*פרטים[[#This Row],[שעות עבודה בפועל]]","v":{"v":0,"d":"₪ 0"}},{"$f":"INDEX(פרמטרים[],MATCH(פרטים[[#This Row],[סוג הפרוייקט]],פרמטרים[סוג הפרוייקט],0),MATCH(פרטים[[#Headers],[צוות אדמיניסטרטיבי]],פרמטרים[#Headers],0))*INDEX('פרמטרי פרוייקט'!$B$12:$H$12,1,MATCH(פרטים[[#Headers],[צוות אדמיניסטרטיבי]],פרמטרים[#Headers],0))*פרטים[[#This Row],[שעות עבודה בפועל]]","v":{"v":5437.5,"d":"₪ 5,438"}}]
{"$rows_left_out":3}
{"sheet":"סכומי פרוייקט","index":3,"n_rows":11,"n_cols":16,"rows_kept":11,"merged":[[3,2,3,7],[3,8,3,13],[3,15,14,19]]}
["קבל סכומי פרוייקט בגליון עבודה זה. שם החברה מתעדכן באופן אוטומטי בתא משמאל. הוראות שימושיות מופיעות בתאים בעמודה זו. הקש על החץ למטה כדי להתחיל.",{"$f":"'פרמטרי פרוייקט'!B1","v":"שם החברה"}]
["הכותרת של גליון עבודה זה מופיעה בתא משמאל.",{"$f":"'פרמטרי פרוייקט'!B2","v":"תכנון פרוייקט עבור משרדי עורכי דין"}]
["הודעה לגבי סודיות מופיעה בתא משמאל.",{"$f":"'פרמטרי פרוייקט'!B3","v":"שם החברה - סודי"}]
["התווית 'משוערת' מופיעה בתא C4, התווית 'בפועל' מופיעה בתא I4, ועצת המידע מופיעה בתא P4.",null,"משוערת",{"$nulls":5},"בפועל",{"$nulls":6},"מידע: \n‏PivotTable זה אינו מתרענן באופן אוטומטי.  כדי לרענן אותו, בחר תא כלשהו בתוך ה- PivotTable ולאחר מכן, בכרטיסיית רצועת הכלים 'כלי PivotTable | ניתוח', בחר 'רענן'.  לחלופין, הקש SHIFT + F10 לאחר בחירת ה- PivotTable ובחר 'רענן'."]
["ה- PivotTable שמתחיל בתא משמאל מתעדכן באופן אוטומטי","שם הפרוייקט","שותף כללי ","עסקי ","עורך דין שמתמחה בליטיגציה ","קניין רוחני ","פשיטת רגל ","צוות אדמיניסטרטיבי ","שותף כללי  ","עסקי  ","עורך דין שמתמחה בליטיגציה  ","פשיטת רגל  ","קניין רוחני  ","צוות אדמיניסטרטיבי  "]
[null,"פרוייקט 1",{"v":7000,"d":"₪ 7,000.00"},{"v":20000,"d":"₪ 20,000.00"},{"v":0,"d":"₪ 0.00"},{"v":0,"d":"₪ 0.00"},{"v":0,"d":"₪ 0.00"},{"v":12500,"d":"₪ 12,500.00"},{"v":7700,"d":"₪ 7,700.00"},{"v":22000,"d":"₪ 22,000.00"},{"v":0,"d":"₪ 0.00"},{"v":0,"d":"₪ 0.00"},{"v":0,"d":"₪ 0.00"},{"v":13750,"d":"₪ 13,750.00"}]
[null,"פרוייקט 2",{"v":14000,"d":"₪ 14,000.00"},{"v":40000,"d":"₪ 40,000.00"},{"v":0,"d":"₪ 0.00"},{"v":11000,"d":"₪ 11,000.00"},{"v":0,"d":"₪ 0.00"},{"v":20000,"d":"₪ 20,000.00"},{"v":13650,"d":"₪ 13,650.00"},{"v":39000,"d":"₪ 39,000.00"},{"v":0,"d":"₪ 0.00"},{"v":10725,"d":"₪ 10,725.00"},{"v":0,"d":"₪ 0.00"},{"v":19500,"d":"₪ 19,500.00"}]
[null,"פרוייקט 3",{"v":35000,"d":"₪ 35,000.00"},{"v":0,"d":"₪ 0.00"},{"v":75000,"d":"₪ 75,000.00"},{"v":0,"d":"₪ 0.00"},{"v":0,"d":"₪ 0.00"},{"v":18750,"d":"₪ 18,750.00"},{"v":35000,"d":"₪ 35,000.00"},{"v":0,"d":"₪ 0.00"},{"v":75000,"d":"₪ 75,000.00"},{"v":0,"d":"₪ 0.00"},{"v":0,"d":"₪ 0.00"},{"v":18750,"d":"₪ 18,750.00"}]
{"$rows_left_out":3}