{"text_format":"3","workbook":"xlsx","n_sheets":4,"sheets":["Données du diagramme","Diagramme de Gantt","Données dynamiques masquées","À propos"],"not_rendered":{"charts":1,"defined_names":4},"read":"whole","date_system":"1900"}

{"sheet":"Données du diagramme","index":0,"n_rows":26,"n_cols":11,"rows_kept":26,"merged":[[1,1,1,2]]}
["Créez un diagramme de Gantt Suivi de date dans cette feuille de calcul.\nLe titre de cette feuille de calcul figure dans la cellule B1. \nDes informations sur l’utilisation de cette feuille de calcul, notamment des instructions pour les lecteurs d’écran, figurent dans la feuille de calcul À propos de.\nContinuez à parcourir la colonne A pour des instructions supplémentaires.","Diagramme de Gantt Suivi de date"]
["Sélectionnez l’option Oui dans la cellule D2 si vous voulez mettre en évidence la date du jour dans la feuille de calcul du diagramme de Gantt. \nSélectionnez l’option Non dans la cellule D2 si vous ne voulez pas mettre en évidence la date du jour dans la feuille de calcul du diagramme de Gantt.\nDans la cellule D2, tapez ALT+Flèche bas pour accéder aux options.","Effectuer le suivi de la date d’aujourd’hui ?",null,"Oui"]
["L’en-tête Jalons pour le tableau de jalons figure dans la cellule B3.\nL’en-tête Tâches pour le tableau de tâches figure dans la cellule G3.","Jalons",{"$nulls":4},"Tâches"]
["Les informations sur les colonnes du tableau de jalons figurent sur cette ligne, dans les cellules B4 à E4.\nLes informations sur les colonnes dans le tableau de tâches figurent sur cette ligne, dans les cellules G4 à J4.","Cette colonne doit être ordonnée de façon séquentielle.","La colonne Position trace les jalons dans le diagramme des tâches.","Entrez la date d’un jalon dans cette colonne.","Entrez une description du jalon dans cette colonne. Ces descriptions apparaissent dans le diagramme.",null,"Cette colonne doit être ordonnée de façon séquentielle.","Entrez la date de début de chaque tâche ci-dessous. Pour obtenir des résultats optimaux, triez cette colonne dans un ordre croissant.","Entrez la date de fin de chaque tâche ou activité ci-dessous, dans cette colonne.","Entrez les tâches ou activités dans cette colonne.","Colonne calculée automatiquement utilisée pour tracer la durée de chaque tâche. Ne la supprimez ou modifiez pas."]
["Les en-têtes du tableau de jalons figurent dans les cellules B5 à E5. Les en-têtes de tableau de tâches figurent dans les cellules G5 à K5.\nLes exemples de données de jalons figurent dans les cellules B6 à E17. \nLes exemples de données de tâches figurent dans les cellules G6 à J17.\nL’instruction suivante figure dans la cellule A21.","N°","Position","date","Jalon",null,"N°","Date de début","Date de fin","Tâche","Durée en jours"]
[null,1,1,{"$f":"Date_Début+10","v":"2018-08-24"},"Jalon 1",null,1,{"$f":"TODAY()-1","v":"2018-08-14"},{"$f":"Tâches[[#This Row],[Date de début]]+1","v":"2018-08-15"},"Activité 1",{"$f":"IFERROR(IF(LEN(Tâches[[#This Row],[Date de début]])=0,\"\",(INT(Tâches[[#This Row],[Date de fin]])-INT(Tâches[[#This Row],[Date de début]]))-(INT(Tâches[[#This Row],[Date de début]])-INT(Tâches[[#This Row],[Date de début]]))+1),\"\")","v":2}]
[null,2,1,{"$f":"TODAY()+25","v":"2018-09-09"},"Jalon 2",null,2,{"$f":"TODAY()","v":"2018-08-15"},{"$f":"Tâches[[#This Row],[Date de début]]+1","v":"2018-08-16"},"Activité 2",{"$f":"IFERROR(IF(LEN(Tâches[[#This Row],[Date de début]])=0,\"\",(INT(Tâches[[#This Row],[Date de fin]])-INT(Tâches[[#This Row],[Date de début]]))-(INT(Tâches[[#This Row],[Date de début]])-INT(Tâches[[#This Row],[Date de début]]))+1),\"\")","v":2}]
[null,3,1,{"$f":"TODAY()+35","v":"2018-09-19"},"Jalon 3",null,3,{"$f":"TODAY()","v":"2018-08-15"},{"$f":"Tâches[[#This Row],[Date de début]]+5","v":"2018-08-20"},"Activité 3",{"$f":"IFERROR(IF(LEN(Tâches[[#This Row],[Date de début]])=0,\"\",(INT(Tâches[[#This Row],[Date de fin]])-INT(Tâches[[#This Row],[Date de début]]))-(INT(Tâches[[#This Row],[Date de début]])-INT(Tâches[[#This Row],[Date de début]]))+1),\"\")","v":6}]
[null,4,1,{"$f":"TODAY()+45","v":"2018-09-29"},"Jalon 4",null,4,{"$f":"TODAY()+1","v":"2018-08-16"},{"$f":"Tâches[[#This Row],[Date de début]]+7","v":"2018-08-23"},"Activité 4",{"$f":"IFERROR(IF(LEN(Tâches[[#This Row],[Date de début]])=0,\"\",(INT(Tâches[[#This Row],[Date de fin]])-INT(Tâches[[#This Row],[Date de début]]))-(INT(Tâches[[#This Row],[Date de début]])-INT(Tâches[[#This Row],[Date de début]]))+1),\"\")","v":8}]
[null,5,1,{"$f":"TODAY()+60","v":"2018-10-14"},"Jalon 5",null,5,{"$f":"TODAY()+8","v":"2018-08-23"},{"$f":"Tâches[[#This Row],[Date de début]]+10","v":"2018-09-02"},"Activité 5",{"$f":"IFERROR(IF(LEN(Tâches[[#This Row],[Date de début]])=0,\"\",(INT(Tâches[[#This Row],[Date de fin]])-INT(Tâches[[#This Row],[Date de début]]))-(INT(Tâches[[#This Row],[Date de début]])-INT(Tâches[[#This Row],[Date de début]]))+1),\"\")","v":11}]
[null,6,1,{"$f":"TODAY()+70","v":"2018-10-24"},"Jalon 6",null,6,{"$f":"TODAY()+12","v":"2018-08-27"},{"$f":"Tâches[[#This Row],[Date de début]]+30","v":"2018-09-26"},"Activité 6",{"$f":"IFERROR(IF(LEN(Tâches[[#This Row],[Date de début]])=0,\"\",(INT(Tâches[[#This Row],[Date de fin]])-INT(Tâches[[#This Row],[Date de début]]))-(INT(Tâches[[#This Row],[Date de début]])-INT(Tâches[[#This Row],[Date de début]]))+1),\"\")","v":31}]
[{"$nulls":6},7,{"$f":"TODAY()+15","v":"2018-08-30"},{"$f":"Tâches[[#This Row],[Date de début]]+15","v":"2018-09-14"},"Activité 7",{"$f":"IFERROR(IF(LEN(Tâches[[#This Row],[Date de début]])=0,\"\",(INT(Tâches[[#This Row],[Date de fin]])-INT(Tâches[[#This Row],[Date de début]]))-(INT(Tâches[[#This Row],[Date de début]])-INT(Tâches[[#This Row],[Date de début]]))+1),\"\")","v":16}]
[{"$nulls":6},8,{"$f":"TODAY()+25","v":"2018-09-09"},{"$f":"Tâches[[#This Row],[Date de début]]+5","v":"2018-09-14"},"Activité 8",{"$f":"IFERROR(IF(LEN(Tâches[[#This Row],[Date de début]])=0,\"\",(INT(Tâches[[#This Row],[Date de fin]])-INT(Tâches[[#This Row],[Date de début]]))-(INT(Tâches[[#This Row],[Date de début]])-INT(Tâches[[#This Row],[Date de début]]))+1),\"\")","v":6}]
[{"$nulls":6},9,{"$f":"TODAY()+34","v":"2018-09-18"},{"$f":"Tâches[[#This Row],[Date de début]]+2","v":"2018-09-20"},"Activité 9",{"$f":"IFERROR(IF(LEN(Tâches[[#This Row],[Date de début]])=0,\"\",(INT(Tâches[[#This Row],[Date de fin]])-INT(Tâches[[#This Row],[Date de début]]))-(INT(Tâches[[#This Row],[Date de début]])-INT(Tâches[[#This Row],[Date de début]]))+1),\"\")","v":3}]
[{"$nulls":6},10,{"$f":"TODAY()+40","v":"2018-09-24"},{"$f":"Tâches[[#This Row],[Date de début]]+30","v":"2018-10-24"},"Activité 10",{"$f":"IFERROR(IF(LEN(Tâches[[#This Row],[Date de début]])=0,\"\",(INT(Tâches[[#This Row],[Date de fin]])-INT(Tâches[[#This Row],[Date de début]]))-(INT(Tâches[[#This Row],[Date de début]])-INT(Tâches[[#This Row],[Date de début]]))+1),\"\")","v":31}]
[{"$nulls":6},11,{"$f":"TODAY()+42","v":"2018-09-26"},{"$f":"Tâches[[#This Row],[Date de début]]+23","v":"2018-10-19"},"Activité 11",{"$f":"IFERROR(IF(LEN(Tâches[[#This Row],[Date de début]])=0,\"\",(INT(Tâches[[#This Row],[Date de fin]])-INT(Tâches[[#This Row],[Date de début]]))-(INT(Tâches[[#This Row],[Date de début]])-INT(Tâches[[#This Row],[Date de début]]))+1),\"\")","v":24}]
[{"$nulls":6},12,{"$f":"TODAY()+50","v":"2018-10-04"},{"$f":"Tâches[[#This Row],[Date de début]]+5","v":"2018-10-09"},"Activité 12",{"$f":"IFERROR(IF(LEN(Tâches[[#This Row],[Date de début]])=0,\"\",(INT(Tâches[[#This Row],[Date de fin]])-INT(Tâches[[#This Row],[Date de début]]))-(INT(Tâches[[#This Row],[Date de début]])-INT(Tâches[[#This Row],[Date de début]]))+1),\"\")","v":6}]
[{"$nulls":10},{"$f":"IFERROR(IF(LEN(Tâches[[#This Row],[Date de début]])=0,\"\",(INT(Tâches[[#This Row],[Date de fin]])-INT(Tâches[[#This Row],[Date de début]]))-(INT(Tâches[[#This Row],[Date de début]])-INT(Tâches[[#This Row],[Date de début]]))+1),\"\")","v":""}]
[{"$nulls":10},{"$f":"IFERROR(IF(LEN(Tâches[[#This Row],[Date de début]])=0,\"\",(INT(Tâches[[#This Row],[Date de fin]])-INT(Tâches[[#This Row],[Date de début]]))-(INT(Tâches[[#This Row],[Date de début]])-INT(Tâches[[#This Row],[Date de début]]))+1),\"\")","v":""}]
[{"$nulls":10},{"$f":"IFERROR(IF(LEN(Tâches[[#This Row],[Date de début]])=0,\"\",(INT(Tâches[[#This Row],[Date de fin]])-INT(Tâches[[#This Row],[Date de début]]))-(INT(Tâches[[#This Row],[Date de début]])-INT(Tâches[[#This Row],[Date de début]]))+1),\"\")","v":""}]
{"$rows_left_out":7}
{"sheet":"Diagramme de Gantt","index":1,"n_rows":1,"n_cols":1,"rows_kept":1}
["Le diagramme de Gantt affichant Aujourd’hui, des jalons et des tâches dans une plage de dates, figure dans cette feuille de calcul. \nUne barre de défilement figure sur la ligne 1, dans les cellules B1 à R1, qui incrémente la plage de dates affichant des jalons futurs.\nLe diagramme est tracé à l’intérieur de la zone couverte par les cellules B2 à R3.\nCeci est la dernière instruction de cette feuille de calcul."]

{"sheet":"Données dynamiques masquées","index":2,"n_rows":32,"n_cols":10,"rows_kept":32,"hidden":true}
["Le titre de cette feuille de calcul figure dans la cellule B1.","Données de graphique dynamiques. Ne modifiez pas ou ne supprimez pas cette feuille de calcul !"]
["Le titre du tableau figure dans les cellules B2 et C2.",{"$f":"IF(TODAY()>=MIN(DonnéesTâcheDynamiques[Date de début]),\"Aujourd’hui\",\"\")","v":"Aujourd’hui"},"surbrillance"]
["L’en-tête du tableau figure dans les cellules B3 et C3. Ces coordonnées créent la surbrillance de Aujourd’hui dans le diagramme.\nLa première colonne marque le jour, et la deuxième indique de tracer la ligne qui met en surbrillance Aujourd’hui.\nLa date de la première colonne peut changer de façon à ce que la plage de dates du diagramme reste lisible à mesure que les dates progressent. Toutefois, une coordonnée y égale à 0 indique qu’aucune ligne n’est tracée.\nNe modifiez ou ne supprimez pas ce contenu, car cela pourrait interrompre le traçage du diagramme. Pour ne plus mettre en surbrillance la date d’Aujourd’hui, sélectionnez « non » dans la cellule D2 de la feuille de calcul Données du diagramme.\nL’instruction suivante figure dans la cellule A7.","coordonnée x de mise en surbrillance d’aujourd’hui","coordonnée y"]
[null,{"$f":"IFERROR(IF(TODAY()<MIN(DonnéesTâcheDynamiques[Date de début]),MIN($B$11,MIN(DonnéesTâcheDynamiques[Date de début])),TODAY()),TODAY())","v":"2018-08-15"},{"$f":"IFERROR(IF(Suivre_Ajourdhui=\"Oui\",IF(TODAY()<MIN(DonnéesTâcheDynamiques[Date de début]),0,9),0),0)","v":9}]
[null,{"$f":"IFERROR(IF(TODAY()<MIN(DonnéesTâcheDynamiques[Date de début]),MIN($B$11,MIN(DonnéesTâcheDynamiques[Date de début])),TODAY()),TODAY())","v":"2018-08-15"},{"$f":"IFERROR(IF(Suivre_Ajourdhui=\"Oui\",IF(TODAY()<MIN(DonnéesTâcheDynamiques[Date de début]),0,9),0),0)","v":9}]
[]
["L’en-tête du tableau figure dans la cellule B7.\nL’incrément de défilement dans la cellule B8 représente les données tracées qui apparaissent dans le diagramme de Gantt à un moment donné. \nLe défilement à l’aide de la barre de défilement en haut du diagramme dans la ligne 1 de la feuille de calcul Diagramme de Gantt a pour effet d’incrémenter ce nombre.\nLe traçage du diagramme fonctionne de façon optimale avec des incréments uniques.\nL’instruction suivante figure dans la cellule A10.","incrément de défilement"]
[null,0]
[]
["L’en-tête du tableau figure dans les cellules B10 et D10.\nLa Plage de graphique permet de sélectionner la plage appropriée de tâches et jalons. Ne modifiez pas ces champs.\nLe nombre ageoff conserve le graphique lisible en augmentant l’âge des tâches de la plage, seules celles qui s’inscrivent dans celle-ci étant tracées. Ne modifiez pas ce nombre.\nL’instruction suivante figure dans la cellule A14.\n\n","Plage pour le traçage du diagramme",null,"ageoff"]
[null,{"$f":"IFERROR(IF(IncrémentDéfilement[incrément de défilement]=0,Date_Début,IF(Date_Début+IncrémentDéfilement[incrément de défilement]*15<Date_Fin,Date_Début+IncrémentDéfilement[incrément de défilement]*15,Date_Fin-1)),\"\")","v":"2018-08-14"},null,45]
[null,{"$f":"IFERROR(IF($B$11+15<Date_Fin,$B$11+15,Date_Fin),\"\")","v":"2018-08-29"}]
[]
["L’en-tête du tableau pour les données dynamiques de jalon figure dans les cellules B14 à E14. Une note figure dans la cellule F14.\nCe tableau est utilisé pour créer le graphique dans la feuille de calcul Diagramme de Gantt, en traçant 7 jalons à la fois.\nLes données tracées dans ce diagramme sont générées automatiquement en fonction du contenu du tableau ci-dessus. \nNe modifiez ou ne supprimez pas ce tableau ou son contenu.\nL’instruction suivante figure dans la cellule A17.","Tâches","Date de début","Durée de la tâche en jours","position","<--Ce tableau génère le diagramme de Gantt, en traçant 7 jalons à la fois."]
[null,{"$f":"IFERROR(IF(LEN(OFFSET('Données du diagramme'!$H6,IncrémentDéfilement[incrément de défilement],0,1,1))=0,\"\",IF(OR(OFFSET('Données du diagramme'!$I6,IncrémentDéfilement[incrément de défilement],0,1,1)<=$B$12,OFFSET('Données du diagramme'!$H6,IncrémentDéfilement[incrément de défilement],0,1,1)>=($B$11-$D$11)),INDEX(Tâches[],OFFSET('Données du diagramme'!$G6,IncrémentDéfilement[incrément de défilement],0,1,1),4),\"\")),\"\")","v":"Activité 1"},{"$f":"IFERROR(IF(LEN(DonnéesTâcheDynamiques[[#This Row],[Tâches]])=0,$B$11,INDEX(Tâches[],OFFSET('Données du diagramme'!$G6,IncrémentDéfilement[incrément de défilement],0,1,1),2)),\"\")","v":"2018-08-14"},{"$f":"IFERROR(IF(LEN(DonnéesTâcheDynamiques[[#This Row],[Tâches]])=0,0,IF(AND('Données du diagramme'!$H6<=$B$12,'Données du diagramme'!$I6>=$B$12),ABS(OFFSET('Données du diagramme'!$H6,IncrémentDéfilement[incrément de défilement],0,1,1)-$B$12)+1,OFFSET('Données du diagramme'!$K6,IncrémentDéfilement[incrément de défilement],0,1,1))),\"\")","v":2},{"$f":"IFERROR(IF(LEN(DonnéesTâcheDynamiques[[#This Row],[Tâches]])=0,\"\",8),\"\")","v":8}]
[null,{"$f":"IFERROR(IF(LEN(OFFSET('Données du diagramme'!$H7,IncrémentDéfilement[incrément de défilement],0,1,1))=0,\"\",IF(OR(OFFSET('Données du diagramme'!$I7,IncrémentDéfilement[incrément de défilement],0,1,1)<=$B$12,OFFSET('Données du diagramme'!$H7,IncrémentDéfilement[incrément de défilement],0,1,1)>=($B$11-$D$11)),INDEX(Tâches[],OFFSET('Données du diagramme'!$G7,IncrémentDéfilement[incrément de défilement],0,1,1),4),\"\")),\"\")","v":"Activité 2"},{"$f":"IFERROR(IF(LEN(DonnéesTâcheDynamiques[[#This Row],[Tâches]])=0,$B$11,INDEX(Tâches[],OFFSET('Données du diagramme'!$G7,IncrémentDéfilement[incrément de défilement],0,1,1),2)),\"\")","v":"2018-08-15"},{"$f":"IFERROR(IF(LEN(DonnéesTâcheDynamiques[[#This Row],[Tâches]])=0,0,IF(AND('Données du diagramme'!$H7<=$B$12,'Données du diagramme'!$I7>=$B$12),ABS(OFFSET('Données du diagramme'!$H7,IncrémentDéfilement[incrément de défilement],0,1,1)-$B$12)+1,OFFSET('Données du diagramme'!$K7,IncrémentDéfilement[incrément de défilement],0,1,1))),\"\")","v":2},{"$f":"IFERROR(IF(LEN(DonnéesTâcheDynamiques[[#This Row],[Tâches]])=0,\"\",7),\"\")","v":7},null,"Traçage des jalons"]
["Les cellules G15 à I15 contiennent les en-têtes de tableau pour les données dynamiques de jalon. \nDans ce tableau, des données peuvent apparaître vides, ou des dates sembler incorrectes. En aucun cas, ne renseignez, n’éditez, ne supprimez ou ne modifiez de quelque façon que ce soit ces données, car cela pourrait avoir pour effet de remplacer des formules et d’altérer la fonctionnalité de traçage du diagramme.\nLe tableau permet de tracer 15 jalons. Pour tracer plus de 15 jalons, étendez simplement le tableau afin d’adapter celui-ci au nombre de jalons souhaité. N’oubliez pas que vous ne pouvez ajouter des jalons que dans la feuille de calcul Données du diagramme. N’ajoutez pas de contenu à ce tableau.\nUne note figure dans la cellule J15.\nL’instruction suivante figure dans la cellule A32.",{"$f":"IFERROR(IF(LEN(OFFSET('Données du diagramme'!$H8,IncrémentDéfilement[incrément de défilement],0,1,1))=0,\"\",IF(OR(OFFSET('Données du diagramme'!$I8,IncrémentDéfilement[incrément de défilement],0,1,1)<=$B$12,OFFSET('Données du diagramme'!$H8,IncrémentDéfilement[incrément de défilement],0,1,1)>=($B$11-$D$11)),INDEX(Tâches[],OFFSET('Données du diagramme'!$G8,IncrémentDéfilement[incrément de défilement],0,1,1),4),\"\")),\"\")","v":"Activité 3"},{"$f":"IFERROR(IF(LEN(DonnéesTâcheDynamiques[[#This Row],[Tâches]])=0,$B$11,INDEX(Tâches[],OFFSET('Données du diagramme'!$G8,IncrémentDéfilement[incrément de défilement],0,1,1),2)),\"\")","v":"2018-08-15"},{"$f":"IFERROR(IF(LEN(DonnéesTâcheDynamiques[[#This Row],[Tâches]])=0,0,IF(AND('Données du diagramme'!$H8<=$B$12,'Données du diagramme'!$I8>=$B$12),ABS(OFFSET('Données du diagramme'!$H8,IncrémentDéfilement[incrément de défilement],0,1,1)-$B$12)+1,OFFSET('Données du diagramme'!$K8,IncrémentDéfilement[incrément de défilement],0,1,1))),\"\")","v":6},{"$f":"IFERROR(IF(LEN(DonnéesTâcheDynamiques[[#This Row],[Tâches]])=0,\"\",6),\"\")","v":6},null,"Jalons","Date","Ligne de base","<--Ce tableau crée les marqueurs de jalon dans le diagramme de Gantt, en traçant uniquement les jalons qui s’inscrivent dans la plage de dates affichée, à raison 15 jalons maximum."]
[null,{"$f":"IFERROR(IF(LEN(OFFSET('Données du diagramme'!$H9,IncrémentDéfilement[incrément de défilement],0,1,1))=0,\"\",IF(OR(OFFSET('Données du diagramme'!$I9,IncrémentDéfilement[incrément de défilement],0,1,1)<=$B$12,OFFSET('Données du diagramme'!$H9,IncrémentDéfilement[incrément de défilement],0,1,1)>=($B$11-$D$11)),INDEX(Tâches[],OFFSET('Données du diagramme'!$G9,IncrémentDéfilement[incrément de défilement],0,1,1),4),\"\")),\"\")","v":"Activité 4"},{"$f":"IFERROR(IF(LEN(DonnéesTâcheDynamiques[[#This Row],[Tâches]])=0,$B$11,INDEX(Tâches[],OFFSET('Données du diagramme'!$G9,IncrémentDéfilement[incrément de défilement],0,1,1),2)),\"\")","v":"2018-08-16"},{"$f":"IFERROR(IF(LEN(DonnéesTâcheDynamiques[[#This Row],[Tâches]])=0,0,IF(AND('Données du diagramme'!$H9<=$B$12,'Données du diagramme'!$I9>=$B$12),ABS(OFFSET('Données du diagramme'!$H9,IncrémentDéfilement[incrément de défilement],0,1,1)-$B$12)+1,OFFSET('Données du diagramme'!$K9,IncrémentDéfilement[incrément de défilement],0,1,1))),\"\")","v":8},{"$f":"IFERROR(IF(LEN(DonnéesTâcheDynamiques[[#This Row],[Tâches]])=0,\"\",5),\"\")","v":5},null,{"$f":"IFERROR(IF(LEN('Données du diagramme'!D6)=0,\"\",IF(AND('Données du diagramme'!D6<=$B$12,'Données du diagramme'!D6>=$B$11-$D$11),'Données du diagramme'!E6,\"\")),\"\")","v":"Jalon 1"},{"$f":"IFERROR(IF(LEN(DonnéesJalonDynamiques[[#This Row],[Jalons]])=0,$B$12,'Données du diagramme'!$D6),2)","v":"2018-08-24"},{"$f":"IFERROR(IF(LEN(DonnéesJalonDynamiques[[#This Row],[Jalons]])=0,\"\",'Données du diagramme'!$C6),\"\")","v":1}]
[null,{"$f":"IFERROR(IF(LEN(OFFSET('Données du diagramme'!$H10,IncrémentDéfilement[incrément de défilement],0,1,1))=0,\"\",IF(OR(OFFSET('Données du diagramme'!$I10,IncrémentDéfilement[incrément de défilement],0,1,1)<=$B$12,OFFSET('Données du diagramme'!$H10,IncrémentDéfilement[incrément de défilement],0,1,1)>=($B$11-$D$11)),INDEX(Tâches[],OFFSET('Données du diagramme'!$G10,IncrémentDéfilement[incrément de défilement],0,1,1),4),\"\")),\"\")","v":"Activité 5"},{"$f":"IFERROR(IF(LEN(DonnéesTâcheDynamiques[[#This Row],[Tâches]])=0,$B$11,INDEX(Tâches[],OFFSET('Données du diagramme'!$G10,IncrémentDéfilement[incrément de défilement],0,1,1),2)),\"\")","v":"2018-08-23"},{"$f":"IFERROR(IF(LEN(DonnéesTâcheDynamiques[[#This Row],[Tâches]])=0,0,IF(AND('Données du diagramme'!$H10<=$B$12,'Données du diagramme'!$I10>=$B$12),ABS(OFFSET('Données du diagramme'!$H10,IncrémentDéfilement[incrément de défilement],0,1,1)-$B$12)+1,OFFSET('Données du diagramme'!$K10,IncrémentDéfilement[incrément de défilement],0,1,1))),\"\")","v":7},{"$f":"IFERROR(IF(LEN(DonnéesTâcheDynamiques[[#This Row],[Tâches]])=0,\"\",4),\"\")","v":4},null,{"$f":"IFERROR(IF(LEN('Données du diagramme'!D7)=0,\"\",IF(AND('Données du diagramme'!D7<=$B$12,'Données du diagramme'!D7>=$B$11-$D$11),'Données du diagramme'!E7,\"\")),\"\")","v":""},{"$f":"IFERROR(IF(LEN(DonnéesJalonDynamiques[[#This Row],[Jalons]])=0,$B$12,'Données du diagramme'!$D7),2)","v":"2018-08-29"},{"$f":"IFERROR(IF(LEN(DonnéesJalonDynamiques[[#This Row],[Jalons]])=0,\"\",'Données du diagramme'!$C7),\"\")","v":""}]
[null,{"$f":"IFERROR(IF(LEN(OFFSET('Données du diagramme'!$H11,IncrémentDéfilement[incrément de défilement],0,1,1))=0,\"\",IF(OR(OFFSET('Données du diagramme'!$I11,IncrémentDéfilement[incrément de défilement],0,1,1)<=$B$12,OFFSET('Données du diagramme'!$H11,IncrémentDéfilement[incrément de défilement],0,1,1)>=($B$11-$D$11)),INDEX(Tâches[],OFFSET('Données du diagramme'!$G11,IncrémentDéfilement[incrément de défilement],0,1,1),4),\"\")),\"\")","v":"Activité 6"},{"$f":"IFERROR(IF(LEN(DonnéesTâcheDynamiques[[#This Row],[Tâches]])=0,$B$11,INDEX(Tâches[],OFFSET('Données du diagramme'!$G11,IncrémentDéfilement[incrément de défilement],0,1,1),2)),\"\")","v":"2018-08-27"},{"$f":"IFERROR(IF(LEN(DonnéesTâcheDynamiques[[#This Row],[Tâches]])=0,0,IF(AND('Données du diagramme'!$H11<=$B$12,'Données du diagramme'!$I11>=$B$12),ABS(OFFSET('Données du diagramme'!$H11,IncrémentDéfilement[incrément de défilement],0,1,1)-$B$12)+1,OFFSET('Données du diagramme'!$K11,IncrémentDéfilement[incrément de défilement],0,1,1))),\"\")","v":3},{"$f":"IFERROR(IF(LEN(DonnéesTâcheDynamiques[[#This Row],[Tâches]])=0,\"\",3),\"\")","v":3},null,{"$f":"IFERROR(IF(LEN('Données du diagramme'!D8)=0,\"\",IF(AND('Données du diagramme'!D8<=$B$12,'Données du diagramme'!D8>=$B$11-$D$11),'Données du diagramme'!E8,\"\")),\"\")","v":""},{"$f":"IFERROR(IF(LEN(DonnéesJalonDynamiques[[#This Row],[Jalons]])=0,$B$12,'Données du diagramme'!$D8),2)","v":"2018-08-29"},{"$f":"IFERROR(IF(LEN(DonnéesJalonDynamiques[[#This Row],[Jalons]])=0,\"\",'Données du diagramme'!$C8),\"\")","v":""}]
{"$rows_left_out":13}
{"sheet":"À propos","index":3,"n_rows":11,"n_cols":1,"rows_kept":11}
["À propos de ce classeur"]
["Entrez les informations de jalons et de tâches dans la feuille de calcul Données du diagramme. Pour tracer les jalons de la chronologie, entrez 0 dans la colonne N°, puis modifiez la position de l’étiquette afin qu’elle figure « en dessous » pour éviter tout chevauchement d’étiquettes.\n\nLa colonne Position dans le tableau de jalons a pour effet que les jalons du diagramme des tâches sont tracés sur une même ligne ou sur des lignes empilées. Pour les tracer sur une même ligne, entrez le même numéro pour chaque jalon dans cette colonne. Pour les tracer sur des lignes différentes, entrez des numéros différents. Avec les exemples de données, tous les jalons sont tracés le long de la position de ligne 2.\n"]
["Guide pour les lecteurs d’écran"]
["\nCe classeur contient quatre feuilles de calcul. \n\nDonnées du diagramme\nDiagramme de Gantt\nDonnées de graphique dynamiques (Masqué)\nÀ propos\n\nLes instructions relatives à chaque feuille de calcul figurent dans la colonne A à partir de la cellule A1. Elles sont rédigées en texte masqué. Chaque étape vous explique comment utiliser les informations décrites dans la ligne. Les étapes suivantes sont décrites dans les cellules A2, A3, etc. sauf mention contraire. Par exemple, l’instruction peut indiquer de « consulter la cellule A6 » pour l’étape suivante. \n\nLe texte masqué n’est pas imprimé.\nPour supprimer ces instructions d’une feuille de calcul, supprimez simplement la colonne A.\n"]
["Données de graphique dynamiques (Masqué)"]
["\nNe supprimez ou ne modifiez pas le contenu de la feuille de calcul Masqué. Cette opération peut compromettre l’intégrité du diagramme de Gantt.\n\nDes données peuvent apparaître vides, ou des dates sembler incorrectes. En aucun cas, ne renseignez, n’éditez, ne supprimez ou ne modifiez de quelque façon que ce soit ces données, car cela pourrait avoir pour effet de remplacer des formules et d’altérer la fonctionnalité de traçage du diagramme.\n\nLe tableau de jalons dynamiques permet de tracer 15 jalons. Pour tracer plus de 15 jalons, étendez simplement le tableau afin d’adapter celui-ci au nombre de jalons souhaité. N’oubliez pas que vous ne pouvez ajouter les données de jalons réels que dans la feuille de calcul Données du diagramme.\n"]
["Conseils"]
["\nPar défaut, les jalons sont tracés sur la ligne 1 du diagramme de Gantt en utilisant la colonne Position de la feuille de calcul Données du diagramme, à partir de la cellule C5. Pour tracer les jalons sur des lignes différentes, modifiez simplement le numéro. \n"]
["Le paramètre par défaut consiste à mettre en surbrillance la date du jour dans le diagramme de Gantt. Pour ne plus mettre en surbrillance la date d’Aujourd’hui, sélectionnez « non » dans la cellule D2 de la feuille de calcul Données du diagramme.\n"]
["La chronologie de dates du diagramme de Gantt est tracée avec un intervalle de 5 dates entre les dates affichées. Pour changer cela, sélectionnez la chronologie dans la feuille de calcul Diagramme de Gantt, puis sélectionnez Format de l’axe. Modifiez l’Unité principale de 5 en 1 ou 10, par exemple. \n"]
["Ceci est la dernière instruction de cette feuille de calcul."]