{"text_format":"3","workbook":"xlsx","n_sheets":4,"sheets":["DÉBUT","PARAMÈTRES DU PROJET","DÉTAILS DU PROJET","TOTAUX DU PROJET"],"not_rendered":{"charts":2,"defined_names":3,"pivot_tables":1},"read":"whole","date_system":"1900"}

{"sheet":"DÉBUT","index":0,"n_rows":7,"n_cols":2,"rows_kept":7}
[null,"À PROPOS DE CE MODÈLE"]
[null,"Effectuez le suivi des paramètres, des détails et des totaux d’un projet dans ce classeur Suivi de planification d’événement."]
[null,"Entrez des informations dans la feuille de calcul Paramètres du projet pour mettre à jour les histogrammes, et dans la feuille de calcul Détails du projet. Le tableau croisé dynamique de la feuille de calcul Totaux du projet est automatiquement mis à jour."]
[null,"Entrez le nom de l’entreprise dans la feuille de calcul Paramètres. Les autres feuilles de calcul seront automatiquement mises à jour."]
[null,"Remarque :  "]
[null,"Des instructions supplémentaires sont disponibles dans la colonne A de chaque feuille de calcul du classeur SUIVI DE PLANIFICATION D’ÉVÉNEMENT. Ce texte a été intentionnellement masqué. Pour supprimer le texte, sélectionnez la colonne A et choisissez SUPPRIMER. Pour afficher le texte, sélectionnez la colonne A et changez la couleur de la police."]
{"$rows_left_out":2}
{"sheet":"PARAMÈTRES DU PROJET","index":1,"n_rows":19,"n_cols":9,"rows_kept":19,"merged":[[23,1,42,3]]}
[null,"Nom de la société"]
[null,"Suivi de projet de gestion d’événement"]
[null,{"$f":"B1&\" Confidentiel\"","v":"Nom de la société Confidentiel"}]
[null,"Les cellules ombrées sont calculées automatiquement. Vous n’avez pas besoin d’y entrer des valeurs."]
[null,"TYPE DE PROJET","GESTIONNAIRE DE COMPTE","RESPONSABLE DE PROJET","RESPONSABLE DE STRATÉGIE","SPÉCIALISTE DE LA CONCEPTION","PERSONNEL DE L’ÉVÉNEMENT","PERSONNEL ADMINISTRATIF","Total"]
[null,"Développement de stratégie d’événement",{"v":0.2,"d":"20%"},{"v":0.1,"d":"10%"},{"v":0.6,"d":"60%"},{"v":0,"d":"0%"},{"v":0,"d":"0%"},{"v":0.1,"d":"10%"},{"$f":"SUM(Paramètres[[#This Row],[GESTIONNAIRE DE COMPTE]:[PERSONNEL ADMINISTRATIF]])","v":{"v":1,"d":"100%"}}]
{"$rows_left_out":14}
{"sheet":"DÉTAILS DU PROJET","index":2,"n_rows":10,"n_cols":23,"rows_kept":10}
[null,{"$f":"'PARAMÈTRES DU PROJET'!B1","v":"Nom de la société"}]
[null,"Suivi de projet de gestion d’événement"]
[null,{"$f":"'PARAMÈTRES DU PROJET'!B3","v":"Nom de la société Confidentiel"}]
["Entrez des informations dans le tableau Détails du projet, à partir de la cellule de droite.\nINFORMATIONS\nPour ajouter une ligne au tableau de droite, cliquez dans la cellule située le plus en bas à droite dans le corps du tableau (au-dessus de la ligne de total) et appuyez sur Tab, ou appuyez sur Maj+F10 là où vous voulez insérer la ligne et sélectionnez Insertion | Lignes de tableau au-dessus/en dessous.\nVeillez à supprimer toutes les lignes non utilisées, sans quoi le tableau croisé dynamique TOTAUX DU PROJET, qui utilise l’ensemble des cellules des tableaux, produirait des résultats erronés.","NOM DU PROJET","TYPE DE PROJET","DATE DE DÉBUT ESTIMÉE","DATE DE FIN ESTIMÉE","DATE DE DÉBUT RÉELLE","DATE DE FIN RÉELLE","HEURES DE TRAVAIL (ESTIMÉES)","HEURES DE TRAVAIL (RÉELLES)","DURÉE ESTIMÉE","DURÉE RÉELLE","GESTIONNAIRE DE COMPTE","RESPONSABLE DE PROJET","RESPONSABLE DE STRATÉGIE","SPÉCIALISTE DE LA CONCEPTION","PERSONNEL DE L’ÉVÉNEMENT","PERSONNEL ADMINISTRATIF","GESTIONNAIRE DE COMPTE ","RESPONSABLE DE PROJET ","RESPONSABLE DE STRATÉGIE ","SPÉCIALISTE DE LA CONCEPTION ","PERSONNEL DE L’ÉVÉNEMENT ","PERSONNEL ADMINISTRATIF "]
[null,"Projet 1","Développement de stratégie d’événement",{"$f":"DATE(YEAR(TODAY()),6,9)","v":"2022-06-09"},{"$f":" DATE(YEAR(TODAY()),8,7)","v":"2022-08-07"},{"$f":"DATE(YEAR(TODAY()),6,29)","v":"2022-06-29"},{"$f":"DATE(YEAR(TODAY()),9,3)","v":"2022-09-03"},200,220,{"$f":"DAYS360(DétailsDuProjet[[#This Row],[DATE DE DÉBUT ESTIMÉE]],DétailsDuProjet[[#This Row],[DATE DE FIN ESTIMÉE]],FALSE)","v":58},{"$f":"DAYS360(DétailsDuProjet[[#This Row],[DATE DE DÉBUT RÉELLE]],DétailsDuProjet[[#This Row],[DATE DE FIN RÉELLE]],FALSE)","v":64},{"$f":"INDEX(Paramètres[],MATCH(DétailsDuProjet[[#This Row],[TYPE DE PROJET]],Paramètres[TYPE DE PROJET],0),MATCH(DétailsDuProjet[[#Headers],[GESTIONNAIRE DE COMPTE]],Paramètres[#Headers],0))*INDEX('PARAMÈTRES DU PROJET'!$B$12:$H$12,1,MATCH(DétailsDuProjet[[#Headers],[GESTIONNAIRE DE COMPTE]],Paramètres[#Headers],0))*DétailsDuProjet[[#This Row],[HEURES DE TRAVAIL (ESTIMÉES)]]","v":{"v":7200,"d":"7,200 €"}},{"$f":"INDEX(Paramètres[],MATCH(DétailsDuProjet[[#This Row],[TYPE DE PROJET]],Paramètres[TYPE DE PROJET],0),MATCH(DétailsDuProjet[[#Headers],[RESPONSABLE DE PROJET]],Paramètres[#Headers],0))*INDEX('PARAMÈTRES DU PROJET'!$B$12:$H$12,1,MATCH(DétailsDuProjet[[#Headers],[RESPONSABLE DE PROJET]],Paramètres[#Headers],0))*DétailsDuProjet[[#This Row],[HEURES DE TRAVAIL (ESTIMÉES)]]","v":{"v":2400,"d":"2,400 €"}},{"$f":"INDEX(Paramètres[],MATCH(DétailsDuProjet[[#This Row],[TYPE DE PROJET]],Paramètres[TYPE DE PROJET],0),MATCH(DétailsDuProjet[[#Headers],[RESPONSABLE DE STRATÉGIE]],Paramètres[#Headers],0))*INDEX('PARAMÈTRES DU PROJET'!$B$12:$H$12,1,MATCH(DétailsDuProjet[[#Headers],[RESPONSABLE DE STRATÉGIE]],Paramètres[#Headers],0))*DétailsDuProjet[[#This Row],[HEURES DE TRAVAIL (ESTIMÉES)]]","v":{"v":18000,"d":"18,000 €"}},{"$f":"INDEX(Paramètres[],MATCH(DétailsDuProjet[[#This Row],[TYPE DE PROJET]],Paramètres[TYPE DE PROJET],0),MATCH(DétailsDuProjet[[#Headers],[SPÉCIALISTE DE LA CONCEPTION]],Paramètres[#Headers],0))*INDEX('PARAMÈTRES DU PROJET'!$B$12:$H$12,1,MATCH(DétailsDuProjet[[#Headers],[SPÉCIALISTE DE LA CONCEPTION]],Paramètres[#Headers],0))*DétailsDuProjet[[#This Row],[HEURES DE TRAVAIL (ESTIMÉES)]]","v":{"v":0,"d":"0 €"}},{"$f":"INDEX(Paramètres[],MATCH(DétailsDuProjet[[#This Row],[TYPE DE PROJET]],Paramètres[TYPE DE PROJET],0),MATCH(DétailsDuProjet[[#Headers],[PERSONNEL DE L’ÉVÉNEMENT]],Paramètres[#Headers],0))*INDEX('PARAMÈTRES DU PROJET'!$B$12:$H$12,1,MATCH(DétailsDuProjet[[#Headers],[PERSONNEL DE L’ÉVÉNEMENT]],Paramètres[#Headers],0))*DétailsDuProjet[[#This Row],[HEURES DE TRAVAIL (ESTIMÉES)]]","v":{"v":0,"d":"0 €"}},{"$f":"INDEX(Paramètres[],MATCH(DétailsDuProjet[[#This Row],[TYPE DE PROJET]],Paramètres[TYPE DE PROJET],0),MATCH(DétailsDuProjet[[#Headers],[PERSONNEL ADMINISTRATIF]],Paramètres[#Headers],0))*INDEX('PARAMÈTRES DU PROJET'!$B$12:$H$12,1,MATCH(DétailsDuProjet[[#Headers],[PERSONNEL ADMINISTRATIF]],Paramètres[#Headers],0))*DétailsDuProjet[[#This Row],[HEURES DE TRAVAIL (ESTIMÉES)]]","v":{"v":1200,"d":"1,200 €"}},{"$f":"INDEX(Paramètres[],MATCH(DétailsDuProjet[[#This Row],[TYPE DE PROJET]],Paramètres[TYPE DE PROJET],0),MATCH(DétailsDuProjet[[#Headers],[GESTIONNAIRE DE COMPTE]],Paramètres[#Headers],0))*INDEX('PARAMÈTRES DU PROJET'!$B$12:$H$12,1,MATCH(DétailsDuProjet[[#Headers],[GESTIONNAIRE DE COMPTE]],Paramètres[#Headers],0))*DétailsDuProjet[[#This Row],[HEURES DE TRAVAIL (RÉELLES)]]","v":{"v":7920,"d":"7,920 €"}},{"$f":"INDEX(Paramètres[],MATCH(DétailsDuProjet[[#This Row],[TYPE DE PROJET]],Paramètres[TYPE DE PROJET],0),MATCH(DétailsDuProjet[[#Headers],[RESPONSABLE DE PROJET]],Paramètres[#Headers],0))*INDEX('PARAMÈTRES DU PROJET'!$B$12:$H$12,1,MATCH(DétailsDuProjet[[#Headers],[RESPONSABLE DE PROJET]],Paramètres[#Headers],0))*DétailsDuProjet[[#This Row],[HEURES DE TRAVAIL (RÉELLES)]]","v":{"v":2640,"d":"2,640 €"}},{"$f":"INDEX(Paramètres[],MATCH(DétailsDuProjet[[#This Row],[TYPE DE PROJET]],Paramètres[TYPE DE PROJET],0),MATCH(DétailsDuProjet[[#Headers],[RESPONSABLE DE STRATÉGIE]],Paramètres[#Headers],0))*INDEX('PARAMÈTRES DU PROJET'!$B$12:$H$12,1,MATCH(DétailsDuProjet[[#Headers],[RESPONSABLE DE STRATÉGIE]],Paramètres[#Headers],0))*DétailsDuProjet[[#This Row],[HEURES DE TRAVAIL (RÉELLES)]]","v":{"v":19800,"d":"19,800 €"}},{"$f":"INDEX(Paramètres[],MATCH(DétailsDuProjet[[#This Row],[TYPE DE PROJET]],Paramètres[TYPE DE PROJET],0),MATCH(DétailsDuProjet[[#Headers],[SPÉCIALISTE DE LA CONCEPTION]],Paramètres[#Headers],0))*INDEX('PARAMÈTRES DU PROJET'!$B$12:$H$12,1,MATCH(DétailsDuProjet[[#Headers],[SPÉCIALISTE DE LA CONCEPTION]],Paramètres[#Headers],0))*DétailsDuProjet[[#This Row],[HEURES DE TRAVAIL (RÉELLES)]]","v":{"v":0,"d":"0 €"}},{"$f":"INDEX(Paramètres[],MATCH(DétailsDuProjet[[#This Row],[TYPE DE PROJET]],Paramètres[TYPE DE PROJET],0),MATCH(DétailsDuProjet[[#Headers],[PERSONNEL DE L’ÉVÉNEMENT]],Paramètres[#Headers],0))*INDEX('PARAMÈTRES DU PROJET'!$B$12:$H$12,1,MATCH(DétailsDuProjet[[#Headers],[PERSONNEL DE L’ÉVÉNEMENT]],Paramètres[#Headers],0))*DétailsDuProjet[[#This Row],[HEURES DE TRAVAIL (RÉELLES)]]","v":{"v":0,"d":"0 €"}},{"$f":"INDEX(Paramètres[],MATCH(DétailsDuProjet[[#This Row],[TYPE DE PROJET]],Paramètres[TYPE DE PROJET],0),MATCH(DétailsDuProjet[[#Headers],[PERSONNEL ADMINISTRATIF]],Paramètres[#Headers],0))*INDEX('PARAMÈTRES DU PROJET'!$B$12:$H$12,1,MATCH(DétailsDuProjet[[#Headers],[PERSONNEL ADMINISTRATIF]],Paramètres[#Headers],0))*DétailsDuProjet[[#This Row],[HEURES DE TRAVAIL (RÉELLES)]]","v":{"v":1320,"d":"1,320 €"}}]
[null,"Projet 2","Planification d’événement",{"$f":"DATE(YEAR(TODAY())+1,6,25)","v":"2023-06-25"},{"$f":"DATE(YEAR(TODAY())+1,7,27)","v":"2023-07-27"},{"$f":"DATE(YEAR(TODAY()),7,15)","v":"2022-07-15"},{"$f":"DATE(YEAR(TODAY())+1,8,25)","v":"2023-08-25"},400,390,{"$f":"DAYS360(DétailsDuProjet[[#This Row],[DATE DE DÉBUT ESTIMÉE]],DétailsDuProjet[[#This Row],[DATE DE FIN ESTIMÉE]],FALSE)","v":32},{"$f":"DAYS360(DétailsDuProjet[[#This Row],[DATE DE DÉBUT RÉELLE]],DétailsDuProjet[[#This Row],[DATE DE FIN RÉELLE]],FALSE)","v":400},{"$f":"INDEX(Paramètres[],MATCH(DétailsDuProjet[[#This Row],[TYPE DE PROJET]],Paramètres[TYPE DE PROJET],0),MATCH(DétailsDuProjet[[#Headers],[GESTIONNAIRE DE COMPTE]],Paramètres[#Headers],0))*INDEX('PARAMÈTRES DU PROJET'!$B$12:$H$12,1,MATCH(DétailsDuProjet[[#Headers],[GESTIONNAIRE DE COMPTE]],Paramètres[#Headers],0))*DétailsDuProjet[[#This Row],[HEURES DE TRAVAIL (ESTIMÉES)]]","v":{"v":14400,"d":"14,400 €"}},{"$f":"INDEX(Paramètres[],MATCH(DétailsDuProjet[[#This Row],[TYPE DE PROJET]],Paramètres[TYPE DE PROJET],0),MATCH(DétailsDuProjet[[#Headers],[RESPONSABLE DE PROJET]],Paramètres[#Headers],0))*INDEX('PARAMÈTRES DU PROJET'!$B$12:$H$12,1,MATCH(DétailsDuProjet[[#Headers],[RESPONSABLE DE PROJET]],Paramètres[#Headers],0))*DétailsDuProjet[[#This Row],[HEURES DE TRAVAIL (ESTIMÉES)]]","v":{"v":24000,"d":"24,000 €"}},{"$f":"INDEX(Paramètres[],MATCH(DétailsDuProjet[[#This Row],[TYPE DE PROJET]],Paramètres[TYPE DE PROJET],0),MATCH(DétailsDuProjet[[#Headers],[RESPONSABLE DE STRATÉGIE]],Paramètres[#Headers],0))*INDEX('PARAMÈTRES DU PROJET'!$B$12:$H$12,1,MATCH(DétailsDuProjet[[#Headers],[RESPONSABLE DE STRATÉGIE]],Paramètres[#Headers],0))*DétailsDuProjet[[#This Row],[HEURES DE TRAVAIL (ESTIMÉES)]]","v":{"v":6000,"d":"6,000 €"}},{"$f":"INDEX(Paramètres[],MATCH(DétailsDuProjet[[#This Row],[TYPE DE PROJET]],Paramètres[TYPE DE PROJET],0),MATCH(DétailsDuProjet[[#Headers],[SPÉCIALISTE DE LA CONCEPTION]],Paramètres[#Headers],0))*INDEX('PARAMÈTRES DU PROJET'!$B$12:$H$12,1,MATCH(DétailsDuProjet[[#Headers],[SPÉCIALISTE DE LA CONCEPTION]],Paramètres[#Headers],0))*DétailsDuProjet[[#This Row],[HEURES DE TRAVAIL (ESTIMÉES)]]","v":{"v":4000,"d":"4,000 €"}},{"$f":"INDEX(Paramètres[],MATCH(DétailsDuProjet[[#This Row],[TYPE DE PROJET]],Paramètres[TYPE DE PROJET],0),MATCH(DétailsDuProjet[[#Headers],[PERSONNEL DE L’ÉVÉNEMENT]],Paramètres[#Headers],0))*INDEX('PARAMÈTRES DU PROJET'!$B$12:$H$12,1,MATCH(DétailsDuProjet[[#Headers],[PERSONNEL DE L’ÉVÉNEMENT]],Paramètres[#Headers],0))*DétailsDuProjet[[#This Row],[HEURES DE TRAVAIL (ESTIMÉES)]]","v":{"v":0,"d":"0 €"}},{"$f":"INDEX(Paramètres[],MATCH(DétailsDuProjet[[#This Row],[TYPE DE PROJET]],Paramètres[TYPE DE PROJET],0),MATCH(DétailsDuProjet[[#Headers],[PERSONNEL ADMINISTRATIF]],Paramètres[#Headers],0))*INDEX('PARAMÈTRES DU PROJET'!$B$12:$H$12,1,MATCH(DétailsDuProjet[[#Headers],[PERSONNEL ADMINISTRATIF]],Paramètres[#Headers],0))*DétailsDuProjet[[#This Row],[HEURES DE TRAVAIL (ESTIMÉES)]]","v":{"v":2400,"d":"2,400 €"}},{"$f":"INDEX(Paramètres[],MATCH(DétailsDuProjet[[#This Row],[TYPE DE PROJET]],Paramètres[TYPE DE PROJET],0),MATCH(DétailsDuProjet[[#Headers],[GESTIONNAIRE DE COMPTE]],Paramètres[#Headers],0))*INDEX('PARAMÈTRES DU PROJET'!$B$12:$H$12,1,MATCH(DétailsDuProjet[[#Headers],[GESTIONNAIRE DE COMPTE]],Paramètres[#Headers],0))*DétailsDuProjet[[#This Row],[HEURES DE TRAVAIL (RÉELLES)]]","v":{"v":14040,"d":"14,040 €"}},{"$f":"INDEX(Paramètres[],MATCH(DétailsDuProjet[[#This Row],[TYPE DE PROJET]],Paramètres[TYPE DE PROJET],0),MATCH(DétailsDuProjet[[#Headers],[RESPONSABLE DE PROJET]],Paramètres[#Headers],0))*INDEX('PARAMÈTRES DU PROJET'!$B$12:$H$12,1,MATCH(DétailsDuProjet[[#Headers],[RESPONSABLE DE PROJET]],Paramètres[#Headers],0))*DétailsDuProjet[[#This Row],[HEURES DE TRAVAIL (RÉELLES)]]","v":{"v":23400,"d":"23,400 €"}},{"$f":"INDEX(Paramètres[],MATCH(DétailsDuProjet[[#This Row],[TYPE DE PROJET]],Paramètres[TYPE DE PROJET],0),MATCH(DétailsDuProjet[[#Headers],[RESPONSABLE DE STRATÉGIE]],Paramètres[#Headers],0))*INDEX('PARAMÈTRES DU PROJET'!$B$12:$H$12,1,MATCH(DétailsDuProjet[[#Headers],[RESPONSABLE DE STRATÉGIE]],Paramètres[#Headers],0))*DétailsDuProjet[[#This Row],[HEURES DE TRAVAIL (RÉELLES)]]","v":{"v":5850,"d":"5,850 €"}},{"$f":"INDEX(Paramètres[],MATCH(DétailsDuProjet[[#This Row],[TYPE DE PROJET]],Paramètres[TYPE DE PROJET],0),MATCH(DétailsDuProjet[[#Headers],[SPÉCIALISTE DE LA CONCEPTION]],Paramètres[#Headers],0))*INDEX('PARAMÈTRES DU PROJET'!$B$12:$H$12,1,MATCH(DétailsDuProjet[[#Headers],[SPÉCIALISTE DE LA CONCEPTION]],Paramètres[#Headers],0))*DétailsDuProjet[[#This Row],[HEURES DE TRAVAIL (RÉELLES)]]","v":{"v":3900,"d":"3,900 €"}},{"$f":"INDEX(Paramètres[],MATCH(DétailsDuProjet[[#This Row],[TYPE DE PROJET]],Paramètres[TYPE DE PROJET],0),MATCH(DétailsDuProjet[[#Headers],[PERSONNEL DE L’ÉVÉNEMENT]],Paramètres[#Headers],0))*INDEX('PARAMÈTRES DU PROJET'!$B$12:$H$12,1,MATCH(DétailsDuProjet[[#Headers],[PERSONNEL DE L’ÉVÉNEMENT]],Paramètres[#Headers],0))*DétailsDuProjet[[#This Row],[HEURES DE TRAVAIL (RÉELLES)]]","v":{"v":0,"d":"0 €"}},{"$f":"INDEX(Paramètres[],MATCH(DétailsDuProjet[[#This Row],[TYPE DE PROJET]],Paramètres[TYPE DE PROJET],0),MATCH(DétailsDuProjet[[#Headers],[PERSONNEL ADMINISTRATIF]],Paramètres[#Headers],0))*INDEX('PARAMÈTRES DU PROJET'!$B$12:$H$12,1,MATCH(DétailsDuProjet[[#Headers],[PERSONNEL ADMINISTRATIF]],Paramètres[#Headers],0))*DétailsDuProjet[[#This Row],[HEURES DE TRAVAIL (RÉELLES)]]","v":{"v":2340,"d":"2,340 €"}}]
{"$rows_left_out":5}
{"sheet":"TOTAUX DU PROJET","index":3,"n_rows":10,"n_cols":14,"rows_kept":10}
[null,{"$f":"'PARAMÈTRES DU PROJET'!B1","v":"Nom de la société"}]
[null,"Suivi de projet de gestion d’événement"]
[null,{"$f":"'PARAMÈTRES DU PROJET'!B3","v":"Nom de la société Confidentiel"}]
["Le tableau croisé dynamique qui commence dans la cellule de droite est automatiquement mis à jour.\nINFORMATIONS\nPour actualiser le tableau croisé dynamique situé à droite, cliquez dans l’une de ses cellules, puis dans l’onglet OUTILS DE TABLEAU CROISÉ DYNAMIQUE | ANALYSE, sélectionnez Actualiser. Vous pouvez également appuyer sur Maj+F10 dans n’importe quelle cellule du tableau croisé dynamique, puis sélectionner Actualiser.","NOM DU PROJET","GESTIONNAIRE DE COMPTE (ESTIMATION)","PROJECT MANAGER ESTIMATE","RESPONSABLE DE STRATÉGIE (ESTIMATION)","SPÉCIALISTE DE LA CONCEPTION (ESTIMATION)","RECRUTEMENT DE PERSONNEL (ESTIMATION)","PERSONNEL ADMINISTRATIF (ESTIMATION)","GESTIONNAIRE DE COMPTE (RÉEL)","RESPONSABLE DE PROJET (RÉEL)","RESPONSABLE DE STRATÉGIE (RÉEL)","SPÉCIALISTE DE LA CONCEPTION (RÉEL)","RECRUTEMENT DE PERSONNEL (RÉEL)","PERSONNEL ADMINISTRATIF (RÉEL)"]
[null,"Projet 1",{"v":7200,"d":"7,200.00 €"},{"v":2400,"d":"2,400.00 €"},{"v":18000,"d":"18,000.00 €"},{"v":0,"d":"0.00 €"},{"v":0,"d":"0.00 €"},{"v":1200,"d":"1,200.00 €"},{"v":7920,"d":"7,920.00 €"},{"v":2640,"d":"2,640.00 €"},{"v":19800,"d":"19,800.00 €"},{"v":0,"d":"0.00 €"},{"v":0,"d":"0.00 €"},{"v":1320,"d":"1,320.00 €"}]
[null,"Projet 2",{"v":14400,"d":"14,400.00 €"},{"v":24000,"d":"24,000.00 €"},{"v":6000,"d":"6,000.00 €"},{"v":4000,"d":"4,000.00 €"},{"v":0,"d":"0.00 €"},{"v":2400,"d":"2,400.00 €"},{"v":14040,"d":"14,040.00 €"},{"v":23400,"d":"23,400.00 €"},{"v":5850,"d":"5,850.00 €"},{"v":3900,"d":"3,900.00 €"},{"v":0,"d":"0.00 €"},{"v":2340,"d":"2,340.00 €"}]
{"$rows_left_out":4}