{"text_format":"3","workbook":"xlsx","n_sheets":4,"sheets":["Début","PARAMÈTRES DU PROJET","DÉTAILS DU PROJET","TOTAUX DU PROJET"],"not_rendered":{"charts":2,"defined_names":3,"pivot_tables":1},"read":"whole","date_system":"1900"}

{"sheet":"Début","index":0,"n_rows":8,"n_cols":2,"rows_kept":8}
[null,"À PROPOS DE CE MODÈLE"]
[]
[null,"Utilisez ce classeur pour suivre les paramètres du projet, les détails du projet et les totaux du projet pendant la planification de projet pour les cabinets d’avocats."]
[null,"Renseignez votre propre nom d’entreprise dans la feuille de calcul des paramètres du projet et il est mis à jour automatiquement dans d’autres feuilles de calcul."]
[null,"Entrez des informations dans la feuille de calcul des paramètres du projet pour mettre à jour les histogrammes et dans la feuille de calcul détails du projet. Le tableau croisé dynamique dans la feuille de calcul totaux du projet est mis à jour automatiquement"]
[null,"Remarque :  "]
{"$rows_left_out":3}
{"sheet":"PARAMÈTRES DU PROJET","index":1,"n_rows":19,"n_cols":9,"rows_kept":19}
[null,"Mitchell, Morris, Ward, & Cook"]
[null,"Planification de projet pour les cabinets d’avocats"]
[null,{"$f":"B1&\" Confidentiel\"","v":"Mitchell, Morris, Ward, & Cook Confidentiel"}]
[null,"Les cellules ombrées sont calculées automatiquement. Vous n’avez pas besoin d’y entrer des valeurs."]
[null,"TYPE DE PROJET","PARTENAIRE GÉNÉRAL","AVOCAT D’AFFAIRES","AVOCAT PLAIDANT","AVOCAT SPÉCIALISTE DE LA PROPRIÉTÉ INTELLECTUELLE","AVOCAT SPÉCIALISTE DU DROIT DE LA FAILLITE","PERSONNEL ADMINISTRATIF","TOTAL"]
[null,"Fusion de société",{"v":0.1,"d":"10%"},{"v":0.4,"d":"40%"},{"v":0,"d":"0%"},{"v":0,"d":"0%"},{"v":0,"d":"0%"},{"v":0.5,"d":"50%"},{"$f":"SUM(Paramètres[[#This Row],[PARTENAIRE GÉNÉRAL]:[PERSONNEL ADMINISTRATIF]])","v":{"v":1,"d":"100%"}}]
{"$rows_left_out":14}
{"sheet":"DÉTAILS DU PROJET","index":2,"n_rows":10,"n_cols":25,"rows_kept":10,"merged":[[1,24,8,28]]}
[null,{"$f":"'PARAMÈTRES DU PROJET'!B1","v":"Mitchell, Morris, Ward, & Cook"}]
[null,{"$f":"'PARAMÈTRES DU PROJET'!B2","v":"Planification de projet pour les cabinets d’avocats"},{"$nulls":22},"INFORMATIONS :\nPour ajouter une ligne, cliquez dans la cellule située le plus en bas à droite dans le corps du tableau (au-dessus de la ligne de total) et appuyez sur Tab, ou appuyez sur Maj puis sur F10 là où vous voulez insérer la ligne et sélectionnez Insertion | Lignes de tableau au-dessus/en dessous.\nVeillez à supprimer toutes les lignes non utilisées, sans quoi le tableau croisé dynamique TOTAUX DU PROJET, qui utilise l’ensemble des cellules des tableaux, produirait des résultats erronés."]
[null,{"$f":"'PARAMÈTRES DU PROJET'!B3","v":"Mitchell, Morris, Ward, & Cook Confidentiel"}]
[null,"NOM DU PROJET","TYPE DE PROJET","DATE DE DÉBUT ESTIMÉE","DATE DE FIN ESTIMÉE","DATE DE DÉBUT RÉELLE","DATE DE FIN RÉELLE","HEURES DE TRAVAIL (ESTIMÉES)","HEURES DE TRAVAIL (RÉELLES)","DURÉE ESTIMÉE","DURÉE RÉELLE","PARTENAIRE GÉNÉRAL","AVOCAT D’AFFAIRES","AVOCAT PLAIDANT","AVOCAT SPÉCIALISTE DE LA PROPRIÉTÉ INTELLECTUELLE","AVOCAT SPÉCIALISTE DU DROIT DE LA FAILLITE","PERSONNEL ADMINISTRATIF","PARTENAIRE GÉNÉRAL 2","AVOCAT D’AFFAIRES 2","AVOCAT PLAIDANT 2","AVOCAT SPÉCIALISTE DE LA PROPRIÉTÉ INTELLECTUELLE 2","AVOCAT SPÉCIALISTE DU DROIT DE LA FAILLITE 2","PERSONNEL ADMINISTRATIF 2"]
[null,"Europe","Fusion de société",{"$f":"TODAY()","v":"2023-03-29"},{"$f":"TODAY()+60","v":"2023-05-28"},{"$f":"TODAY()+10","v":"2023-04-08"},{"$f":"TODAY()+65","v":"2023-06-02"},200,220,{"$f":"DAYS360(Détails[[#This Row],[DATE DE DÉBUT ESTIMÉE]],Détails[[#This Row],[DATE DE FIN ESTIMÉE]],FALSE)","v":59},{"$f":"DAYS360(Détails[[#This Row],[DATE DE DÉBUT RÉELLE]],Détails[[#This Row],[DATE DE FIN RÉELLE]],FALSE)","v":54},{"$f":"INDEX(Paramètres[],MATCH(Détails[[#This Row],[TYPE DE PROJET]],Paramètres[TYPE DE PROJET],0),MATCH(Détails[[#Headers],[PARTENAIRE GÉNÉRAL]],Paramètres[#Headers],0))*INDEX('PARAMÈTRES DU PROJET'!$B$12:$H$12,1,MATCH(Détails[[#Headers],[PARTENAIRE GÉNÉRAL]],Paramètres[#Headers],0))*Détails[[#This Row],[HEURES DE TRAVAIL (ESTIMÉES)]]","v":{"v":7000,"d":"7,000 €"}},{"$f":"INDEX(Paramètres[],MATCH(Détails[[#This Row],[TYPE DE PROJET]],Paramètres[TYPE DE PROJET],0),MATCH(Détails[[#Headers],[AVOCAT D’AFFAIRES]],Paramètres[#Headers],0))*INDEX('PARAMÈTRES DU PROJET'!$B$12:$H$12,1,MATCH(Détails[[#Headers],[AVOCAT D’AFFAIRES]],Paramètres[#Headers],0))*Détails[[#This Row],[HEURES DE TRAVAIL (ESTIMÉES)]]","v":{"v":20000,"d":"20,000 €"}},{"$f":"INDEX(Paramètres[],MATCH(Détails[[#This Row],[TYPE DE PROJET]],Paramètres[TYPE DE PROJET],0),MATCH(Détails[[#Headers],[AVOCAT PLAIDANT]],Paramètres[#Headers],0))*INDEX('PARAMÈTRES DU PROJET'!$B$12:$H$12,1,MATCH(Détails[[#Headers],[AVOCAT PLAIDANT]],Paramètres[#Headers],0))*Détails[[#This Row],[HEURES DE TRAVAIL (ESTIMÉES)]]","v":{"v":0,"d":"0 €"}},{"$f":"INDEX(Paramètres[],MATCH(Détails[[#This Row],[TYPE DE PROJET]],Paramètres[TYPE DE PROJET],0),MATCH(Détails[[#Headers],[AVOCAT SPÉCIALISTE DE LA PROPRIÉTÉ INTELLECTUELLE]],Paramètres[#Headers],0))*INDEX('PARAMÈTRES DU PROJET'!$B$12:$H$12,1,MATCH(Détails[[#Headers],[AVOCAT SPÉCIALISTE DE LA PROPRIÉTÉ INTELLECTUELLE]],Paramètres[#Headers],0))*Détails[[#This Row],[HEURES DE TRAVAIL (ESTIMÉES)]]","v":{"v":0,"d":"0 €"}},{"$f":"INDEX(Paramètres[],MATCH(Détails[[#This Row],[TYPE DE PROJET]],Paramètres[TYPE DE PROJET],0),MATCH(Détails[[#Headers],[AVOCAT SPÉCIALISTE DU DROIT DE LA FAILLITE]],Paramètres[#Headers],0))*INDEX('PARAMÈTRES DU PROJET'!$B$12:$H$12,1,MATCH(Détails[[#Headers],[AVOCAT SPÉCIALISTE DU DROIT DE LA FAILLITE]],Paramètres[#Headers],0))*Détails[[#This Row],[HEURES DE TRAVAIL (ESTIMÉES)]]","v":{"v":0,"d":"0 €"}},{"$f":"INDEX(Paramètres[],MATCH(Détails[[#This Row],[TYPE DE PROJET]],Paramètres[TYPE DE PROJET],0),MATCH(Détails[[#Headers],[PERSONNEL ADMINISTRATIF]],Paramètres[#Headers],0))*INDEX('PARAMÈTRES DU PROJET'!$B$12:$H$12,1,MATCH(Détails[[#Headers],[PERSONNEL ADMINISTRATIF]],Paramètres[#Headers],0))*Détails[[#This Row],[HEURES DE TRAVAIL (ESTIMÉES)]]","v":{"v":12500,"d":"12,500 €"}},{"$f":"INDEX(Paramètres[],MATCH(Détails[[#This Row],[TYPE DE PROJET]],Paramètres[TYPE DE PROJET],0),MATCH(Détails[[#Headers],[PARTENAIRE GÉNÉRAL]],Paramètres[#Headers],0))*INDEX('PARAMÈTRES DU PROJET'!$B$12:$H$12,1,MATCH(Détails[[#Headers],[PARTENAIRE GÉNÉRAL]],Paramètres[#Headers],0))*Détails[[#This Row],[HEURES DE TRAVAIL (RÉELLES)]]","v":{"v":7700,"d":"7,700 €"}},{"$f":"INDEX(Paramètres[],MATCH(Détails[[#This Row],[TYPE DE PROJET]],Paramètres[TYPE DE PROJET],0),MATCH(Détails[[#Headers],[AVOCAT D’AFFAIRES]],Paramètres[#Headers],0))*INDEX('PARAMÈTRES DU PROJET'!$B$12:$H$12,1,MATCH(Détails[[#Headers],[AVOCAT D’AFFAIRES]],Paramètres[#Headers],0))*Détails[[#This Row],[HEURES DE TRAVAIL (RÉELLES)]]","v":{"v":22000,"d":"22,000 €"}},{"$f":"INDEX(Paramètres[],MATCH(Détails[[#This Row],[TYPE DE PROJET]],Paramètres[TYPE DE PROJET],0),MATCH(Détails[[#Headers],[AVOCAT PLAIDANT]],Paramètres[#Headers],0))*INDEX('PARAMÈTRES DU PROJET'!$B$12:$H$12,1,MATCH(Détails[[#Headers],[AVOCAT PLAIDANT]],Paramètres[#Headers],0))*Détails[[#This Row],[HEURES DE TRAVAIL (RÉELLES)]]","v":{"v":0,"d":"0 €"}},{"$f":"INDEX(Paramètres[],MATCH(Détails[[#This Row],[TYPE DE PROJET]],Paramètres[TYPE DE PROJET],0),MATCH(Détails[[#Headers],[AVOCAT SPÉCIALISTE DE LA PROPRIÉTÉ INTELLECTUELLE]],Paramètres[#Headers],0))*INDEX('PARAMÈTRES DU PROJET'!$B$12:$H$12,1,MATCH(Détails[[#Headers],[AVOCAT SPÉCIALISTE DE LA PROPRIÉTÉ INTELLECTUELLE]],Paramètres[#Headers],0))*Détails[[#This Row],[HEURES DE TRAVAIL (RÉELLES)]]","v":{"v":0,"d":"0 €"}},{"$f":"INDEX(Paramètres[],MATCH(Détails[[#This Row],[TYPE DE PROJET]],Paramètres[TYPE DE PROJET],0),MATCH(Détails[[#Headers],[AVOCAT SPÉCIALISTE DU DROIT DE LA FAILLITE]],Paramètres[#Headers],0))*INDEX('PARAMÈTRES DU PROJET'!$B$12:$H$12,1,MATCH(Détails[[#Headers],[AVOCAT SPÉCIALISTE DU DROIT DE LA FAILLITE]],Paramètres[#Headers],0))*Détails[[#This Row],[HEURES DE TRAVAIL (RÉELLES)]]","v":{"v":0,"d":"0 €"}},{"$f":"INDEX(Paramètres[],MATCH(Détails[[#This Row],[TYPE DE PROJET]],Paramètres[TYPE DE PROJET],0),MATCH(Détails[[#Headers],[PERSONNEL ADMINISTRATIF]],Paramètres[#Headers],0))*INDEX('PARAMÈTRES DU PROJET'!$B$12:$H$12,1,MATCH(Détails[[#Headers],[PERSONNEL ADMINISTRATIF]],Paramètres[#Headers],0))*Détails[[#This Row],[HEURES DE TRAVAIL (RÉELLES)]]","v":{"v":13750,"d":"13,750 €"}}]
[null,"Poisson rouge","Acquisition d’entreprise",{"$f":"TODAY()+30","v":"2023-04-28"},{"$f":"TODAY()+100","v":"2023-07-07"},{"$f":"TODAY()+40","v":"2023-05-08"},{"$f":"TODAY()+110","v":"2023-07-17"},400,390,{"$f":"DAYS360(Détails[[#This Row],[DATE DE DÉBUT ESTIMÉE]],Détails[[#This Row],[DATE DE FIN ESTIMÉE]],FALSE)","v":69},{"$f":"DAYS360(Détails[[#This Row],[DATE DE DÉBUT RÉELLE]],Détails[[#This Row],[DATE DE FIN RÉELLE]],FALSE)","v":69},{"$f":"INDEX(Paramètres[],MATCH(Détails[[#This Row],[TYPE DE PROJET]],Paramètres[TYPE DE PROJET],0),MATCH(Détails[[#Headers],[PARTENAIRE GÉNÉRAL]],Paramètres[#Headers],0))*INDEX('PARAMÈTRES DU PROJET'!$B$12:$H$12,1,MATCH(Détails[[#Headers],[PARTENAIRE GÉNÉRAL]],Paramètres[#Headers],0))*Détails[[#This Row],[HEURES DE TRAVAIL (ESTIMÉES)]]","v":{"v":14000,"d":"14,000 €"}},{"$f":"INDEX(Paramètres[],MATCH(Détails[[#This Row],[TYPE DE PROJET]],Paramètres[TYPE DE PROJET],0),MATCH(Détails[[#Headers],[AVOCAT D’AFFAIRES]],Paramètres[#Headers],0))*INDEX('PARAMÈTRES DU PROJET'!$B$12:$H$12,1,MATCH(Détails[[#Headers],[AVOCAT D’AFFAIRES]],Paramètres[#Headers],0))*Détails[[#This Row],[HEURES DE TRAVAIL (ESTIMÉES)]]","v":{"v":40000,"d":"40,000 €"}},{"$f":"INDEX(Paramètres[],MATCH(Détails[[#This Row],[TYPE DE PROJET]],Paramètres[TYPE DE PROJET],0),MATCH(Détails[[#Headers],[AVOCAT PLAIDANT]],Paramètres[#Headers],0))*INDEX('PARAMÈTRES DU PROJET'!$B$12:$H$12,1,MATCH(Détails[[#Headers],[AVOCAT PLAIDANT]],Paramètres[#Headers],0))*Détails[[#This Row],[HEURES DE TRAVAIL (ESTIMÉES)]]","v":{"v":0,"d":"0 €"}},{"$f":"INDEX(Paramètres[],MATCH(Détails[[#This Row],[TYPE DE PROJET]],Paramètres[TYPE DE PROJET],0),MATCH(Détails[[#Headers],[AVOCAT SPÉCIALISTE DE LA PROPRIÉTÉ INTELLECTUELLE]],Paramètres[#Headers],0))*INDEX('PARAMÈTRES DU PROJET'!$B$12:$H$12,1,MATCH(Détails[[#Headers],[AVOCAT SPÉCIALISTE DE LA PROPRIÉTÉ INTELLECTUELLE]],Paramètres[#Headers],0))*Détails[[#This Row],[HEURES DE TRAVAIL (ESTIMÉES)]]","v":{"v":11000,"d":"11,000 €"}},{"$f":"INDEX(Paramètres[],MATCH(Détails[[#This Row],[TYPE DE PROJET]],Paramètres[TYPE DE PROJET],0),MATCH(Détails[[#Headers],[AVOCAT SPÉCIALISTE DU DROIT DE LA FAILLITE]],Paramètres[#Headers],0))*INDEX('PARAMÈTRES DU PROJET'!$B$12:$H$12,1,MATCH(Détails[[#Headers],[AVOCAT SPÉCIALISTE DU DROIT DE LA FAILLITE]],Paramètres[#Headers],0))*Détails[[#This Row],[HEURES DE TRAVAIL (ESTIMÉES)]]","v":{"v":0,"d":"0 €"}},{"$f":"INDEX(Paramètres[],MATCH(Détails[[#This Row],[TYPE DE PROJET]],Paramètres[TYPE DE PROJET],0),MATCH(Détails[[#Headers],[PERSONNEL ADMINISTRATIF]],Paramètres[#Headers],0))*INDEX('PARAMÈTRES DU PROJET'!$B$12:$H$12,1,MATCH(Détails[[#Headers],[PERSONNEL ADMINISTRATIF]],Paramètres[#Headers],0))*Détails[[#This Row],[HEURES DE TRAVAIL (ESTIMÉES)]]","v":{"v":20000,"d":"20,000 €"}},{"$f":"INDEX(Paramètres[],MATCH(Détails[[#This Row],[TYPE DE PROJET]],Paramètres[TYPE DE PROJET],0),MATCH(Détails[[#Headers],[PARTENAIRE GÉNÉRAL]],Paramètres[#Headers],0))*INDEX('PARAMÈTRES DU PROJET'!$B$12:$H$12,1,MATCH(Détails[[#Headers],[PARTENAIRE GÉNÉRAL]],Paramètres[#Headers],0))*Détails[[#This Row],[HEURES DE TRAVAIL (RÉELLES)]]","v":{"v":13650,"d":"13,650 €"}},{"$f":"INDEX(Paramètres[],MATCH(Détails[[#This Row],[TYPE DE PROJET]],Paramètres[TYPE DE PROJET],0),MATCH(Détails[[#Headers],[AVOCAT D’AFFAIRES]],Paramètres[#Headers],0))*INDEX('PARAMÈTRES DU PROJET'!$B$12:$H$12,1,MATCH(Détails[[#Headers],[AVOCAT D’AFFAIRES]],Paramètres[#Headers],0))*Détails[[#This Row],[HEURES DE TRAVAIL (RÉELLES)]]","v":{"v":39000,"d":"39,000 €"}},{"$f":"INDEX(Paramètres[],MATCH(Détails[[#This Row],[TYPE DE PROJET]],Paramètres[TYPE DE PROJET],0),MATCH(Détails[[#Headers],[AVOCAT PLAIDANT]],Paramètres[#Headers],0))*INDEX('PARAMÈTRES DU PROJET'!$B$12:$H$12,1,MATCH(Détails[[#Headers],[AVOCAT PLAIDANT]],Paramètres[#Headers],0))*Détails[[#This Row],[HEURES DE TRAVAIL (RÉELLES)]]","v":{"v":0,"d":"0 €"}},{"$f":"INDEX(Paramètres[],MATCH(Détails[[#This Row],[TYPE DE PROJET]],Paramètres[TYPE DE PROJET],0),MATCH(Détails[[#Headers],[AVOCAT SPÉCIALISTE DE LA PROPRIÉTÉ INTELLECTUELLE]],Paramètres[#Headers],0))*INDEX('PARAMÈTRES DU PROJET'!$B$12:$H$12,1,MATCH(Détails[[#Headers],[AVOCAT SPÉCIALISTE DE LA PROPRIÉTÉ INTELLECTUELLE]],Paramètres[#Headers],0))*Détails[[#This Row],[HEURES DE TRAVAIL (RÉELLES)]]","v":{"v":10725,"d":"10,725 €"}},{"$f":"INDEX(Paramètres[],MATCH(Détails[[#This Row],[TYPE DE PROJET]],Paramètres[TYPE DE PROJET],0),MATCH(Détails[[#Headers],[AVOCAT SPÉCIALISTE DU DROIT DE LA FAILLITE]],Paramètres[#Headers],0))*INDEX('PARAMÈTRES DU PROJET'!$B$12:$H$12,1,MATCH(Détails[[#Headers],[AVOCAT SPÉCIALISTE DU DROIT DE LA FAILLITE]],Paramètres[#Headers],0))*Détails[[#This Row],[HEURES DE TRAVAIL (RÉELLES)]]","v":{"v":0,"d":"0 €"}},{"$f":"INDEX(Paramètres[],MATCH(Détails[[#This Row],[TYPE DE PROJET]],Paramètres[TYPE DE PROJET],0),MATCH(Détails[[#Headers],[PERSONNEL ADMINISTRATIF]],Paramètres[#Headers],0))*INDEX('PARAMÈTRES DU PROJET'!$B$12:$H$12,1,MATCH(Détails[[#Headers],[PERSONNEL ADMINISTRATIF]],Paramètres[#Headers],0))*Détails[[#This Row],[HEURES DE TRAVAIL (RÉELLES)]]","v":{"v":19500,"d":"19,500 €"}}]
{"$rows_left_out":5}
{"sheet":"TOTAUX DU PROJET","index":3,"n_rows":11,"n_cols":14,"rows_kept":11,"merged":[[3,2,3,7],[3,8,3,13]]}
[null,{"$f":"'PARAMÈTRES DU PROJET'!B1","v":"Mitchell, Morris, Ward, & Cook"}]
[null,{"$f":"'PARAMÈTRES DU PROJET'!B2","v":"Planification de projet pour les cabinets d’avocats"}]
[null,{"$f":"'PARAMÈTRES DU PROJET'!B3","v":"Mitchell, Morris, Ward, & Cook Confidentiel"}]
[null,null,"ESTIMÉ",{"$nulls":5},"RÉEL"]
[null,"NOM DU PROJET","PARTENAIRE GÉNÉRAL  ","AVOCAT D’AFFAIRES  ","AVOCAT PLAIDANT  ","AVOCAT SPÉCIALISTE DE LA PROPRIÉTÉ INTELLECTUELLE  ","AVOCAT SPÉCIALISTE DU DROIT DE LA FAILLITE  ","PERSONNEL ADMINISTRATIF  ","PARTENAIRE GÉNÉRAL ","AVOCAT D’AFFAIRES ","AVOCAT PLAIDANT ","AVOCAT SPÉCIALISTE DU DROIT DE LA FAILLITE ","AVOCAT SPÉCIALISTE DE LA PROPRIÉTÉ INTELLECTUELLE ","PERSONNEL ADMINISTRATIF "]
[null,"Cobalt",{"v":35000,"d":"35,000.00 €"},{"v":0,"d":"0.00 €"},{"v":75000,"d":"75,000.00 €"},{"v":0,"d":"0.00 €"},{"v":0,"d":"0.00 €"},{"v":18750,"d":"18,750.00 €"},{"v":35000,"d":"35,000.00 €"},{"v":0,"d":"0.00 €"},{"v":75000,"d":"75,000.00 €"},{"v":0,"d":"0.00 €"},{"v":0,"d":"0.00 €"},{"v":18750,"d":"18,750.00 €"}]
{"$rows_left_out":5}