{"text_format":"3","workbook":"xlsx","n_sheets":3,"sheets":["Journal de formation","Liste des cours","Informations personnelles"],"not_rendered":{"defined_names":13},"read":"whole","date_system":"1900"}

{"sheet":"Journal de formation","index":0,"n_rows":23,"n_cols":9,"rows_kept":23}
[]
[]
[null,null,"JOURNAL DE FORMATION"]
{"$rows_empty":8}
[null,null,"DATE DE LA FORMATION","NOM","COURS","INSTRUCTEUR","SUIVI","RÉUSSITE/ÉCHEC","NOTES"]
[null,null,"2012-06-01","Michel Pereira","Introduction pour les employés",{"$f":"IF(tblJournaldeformation[[#This Row],[COURS]]=\"\",\"\",IFERROR(VLOOKUP(tblJournaldeformation[COURS],tblListedescours[],2,0),\"Introuvable\"))","v":"Karim Manar"},"Oui","Réussite","Excellent instructeur."]
[null,null,"2012-06-02","David Junca","Introduction pour les employés",{"$f":"IF(tblJournaldeformation[[#This Row],[COURS]]=\"\",\"\",IFERROR(VLOOKUP(tblJournaldeformation[[#This Row],[COURS]],tblListedescours[],2,0),\"Introuvable\"))","v":"Karim Manar"},"Oui","Échec","A dû partir plus tôt, n’a pas pu terminer."]
[null,null,"2012-06-03","Karl Fonteneau","Introduction pour les employés",{"$f":"IF(tblJournaldeformation[[#This Row],[COURS]]=\"\",\"\",IFERROR(VLOOKUP(tblJournaldeformation[[#This Row],[COURS]],tblListedescours[],2,0),\"Introuvable\"))","v":"Karim Manar"},"Oui","Réussite","Offre finale ce trimestre."]
[null,null,"2012-06-03","David Junca","Introduction pour les employés",{"$f":"IF(tblJournaldeformation[[#This Row],[COURS]]=\"\",\"\",IFERROR(VLOOKUP(tblJournaldeformation[[#This Row],[COURS]],tblListedescours[],2,0),\"Introuvable\"))","v":"Karim Manar"},"Oui","Réussite","Offre finale ce trimestre."]
[null,null,"2012-06-04","David Junca","Opérations des employés",{"$f":"IF(tblJournaldeformation[[#This Row],[COURS]]=\"\",\"\",IFERROR(VLOOKUP(tblJournaldeformation[[#This Row],[COURS]],tblListedescours[],2,0),\"Introuvable\"))","v":"Delphine Ribaute"},"Oui","Réussite","Offre finale pour ce trimestre"]
[null,null,"2012-06-04","Karl Fonteneau","Opérations des employés",{"$f":"IF(tblJournaldeformation[[#This Row],[COURS]]=\"\",\"\",IFERROR(VLOOKUP(tblJournaldeformation[[#This Row],[COURS]],tblListedescours[],2,0),\"Introuvable\"))","v":"Delphine Ribaute"},"Oui","Réussite","Offre finale pour ce trimestre"]
[null,null,"2012-06-04","Karl Fonteneau","Comptabilité intermédiaire",{"$f":"IF(tblJournaldeformation[[#This Row],[COURS]]=\"\",\"\",IFERROR(VLOOKUP(tblJournaldeformation[[#This Row],[COURS]],tblListedescours[],2,0),\"Introuvable\"))","v":"Delphine Ribaute"},"Oui","Réussite","Public restreint uniquement."]
[null,null,"2012-06-04","Michel Pereira","Opérations des employés",{"$f":"IF(tblJournaldeformation[[#This Row],[COURS]]=\"\",\"\",IFERROR(VLOOKUP(tblJournaldeformation[[#This Row],[COURS]],tblListedescours[],2,0),\"Introuvable\"))","v":"Delphine Ribaute"},"Oui","Réussite","Offre finale pour ce trimestre"]
[null,null,"2012-06-05","Michel Pereira","Comptabilité intermédiaire",{"$f":"IF(tblJournaldeformation[[#This Row],[COURS]]=\"\",\"\",IFERROR(VLOOKUP(tblJournaldeformation[[#This Row],[COURS]],tblListedescours[],2,0),\"Introuvable\"))","v":"Delphine Ribaute"},"Non","Prochainement","Pas encore."]
[null,null,"2012-06-05","David Junca","Comptabilité avancée",{"$f":"IF(tblJournaldeformation[[#This Row],[COURS]]=\"\",\"\",IFERROR(VLOOKUP(tblJournaldeformation[[#This Row],[COURS]],tblListedescours[],2,0),\"Introuvable\"))","v":"Karim Manar"},"Non","Prochainement","Pas encore."]
[{"$nulls":5},{"$f":"IF(tblJournaldeformation[[#This Row],[COURS]]=\"\",\"\",IFERROR(VLOOKUP(tblJournaldeformation[[#This Row],[COURS]],tblListedescours[],2,0),\"Introuvable\"))","v":""}]

{"sheet":"Liste des cours","index":1,"n_rows":10,"n_cols":6,"rows_kept":10}
[]
[]
[null,null,"LISTE DES COURS"]
[]
[null,null,"TITRE","INSTRUCTEUR","DESCRIPTION","HEURES"]
[null,null,"Introduction pour les employés","Karim Manar","Cours d’introduction de base pour les nouveaux employés. Définit les objectifs et attentes des services, ainsi que les délais et limites.",2]
[null,null,"Opérations des employés","Delphine Ribaute","Opérations de base des employés couvrant le manuel de l’employé.",1]
[null,null,"Opérations des employés","Karim Manar","Recommandations et procédures comptables de base",1.5]
[null,null,"Comptabilité intermédiaire","Delphine Ribaute","Recommandations et procédures comptables intermédiaires",2]
[null,null,"Comptabilité avancée","Karim Manar","Recommandations et procédures comptables avancées",2]

{"sheet":"Informations personnelles","index":2,"n_rows":9,"n_cols":5,"rows_kept":9}
[]
[]
[null,null,"INFORMATIONS PERSONNELLES"]
[]
[null,null,"NOM","SERVICE","TITRE"]
[null,null,"Michel Pereira","Ventes","Comptable senior"]
[null,null,"David Junca","Comptabilité","Comptable"]
[null,null,"Karl Fonteneau","Comptabilité","Comptable"]
[null,null,"Sabine Royant","Comptabilité","Comptable"]