{"text_format":"3","workbook":"xlsx","n_sheets":2,"sheets":["Feuille de temps employés","Recherche_jour_de_la_semaine"],"not_rendered":{"defined_names":27},"read":"whole","date_system":"1900"}

{"sheet":"Feuille de temps employés","index":0,"n_rows":36,"n_cols":26,"rows_kept":36,"merged":[[0,1,2,4],[0,5,2,9],[0,10,2,14],[0,15,3,23],[0,24,3,24],[3,1,3,3],[3,5,3,9],[3,10,3,14],[4,1,6,3],[4,4,6,6],[5,14,7,14],[5,22,7,22],[5,23,7,23],[5,24,7,24],[21,1,21,6],[22,1,23,3],[22,4,23,6],[23,14,24,14],[23,22,24,22],[23,23,24,23],[23,24,24,24],[32,1,32,6],[32,24,33,24],[32,25,33,25],[33,1,33,6],[34,1,34,6],[35,1,35,3],[35,4,35,5],[35,6,35,7],[35,8,35,14],[35,15,35,16],[35,17,35,23]]}
[null,"FEUILLE DE TEMPS EMPLOYÉS",{"$nulls":3},"Nom de l’employé",{"$nulls":9},"Sélectionnez Oui dans la cellule de droite s’il s’agit d’heures supplémentaires \nUne autorisation est requise"]
[]
[]
[null,"Date de fin de la période de paie",null,null,{"$f":"V7","v":"2025-06-14"},"Numéro de l’employé"]
[null,"HEURES NORMALES :",null,null,"Date :"]
[{"$nulls":14},"Total\nSemaine 1\nHeures normales",{"$nulls":7},"Total\nSemaine 2\nHeures normales","Total\nHeures\nnormales","Paie\nUtiliser uniquement\nle code de paie"]
[{"$nulls":7},"2025-06-01",{"$f":"Jour_Un+1","v":"2025-06-02"},{"$f":"Jour_Un+2","v":"2025-06-03"},{"$f":"Jour_Un+3","v":"2025-06-04"},{"$f":"Jour_Un+4","v":"2025-06-05"},{"$f":"Jour_Un+5","v":"2025-06-06"},{"$f":"Jour_Un+6","v":"2025-06-07"},null,{"$f":"Jour_Un+7","v":"2025-06-08"},{"$f":"Jour_Un+8","v":"2025-06-09"},{"$f":"Jour_Un+9","v":"2025-06-10"},{"$f":"Jour_Un+10","v":"2025-06-11"},{"$f":"Jour_Un+11","v":"2025-06-12"},{"$f":"Jour_Un+12","v":"2025-06-13"},{"$f":"Jour_Un+13","v":"2025-06-14"}]
[null,"Tâche","Emplacement","N° de bon de travail","Description du travail","Titre du poste","Numéro",{"$f":"VLOOKUP(WEEKDAY(Jour_Un),Recherche_jour_de_la_semaine!$B$2:$C$8,2)","v":"Dim"},{"$f":"VLOOKUP(WEEKDAY(I7),Recherche_jour_de_la_semaine!$B$2:$C$8,2)","v":"Lun"},{"$f":"VLOOKUP(WEEKDAY(J7),Recherche_jour_de_la_semaine!$B$2:$C$8,2)","v":"Mar"},{"$f":"VLOOKUP(WEEKDAY(K7),Recherche_jour_de_la_semaine!$B$2:$C$8,2)","v":"Mer"},{"$f":"VLOOKUP(WEEKDAY(L7),Recherche_jour_de_la_semaine!$B$2:$C$8,2)","v":"Jeu"},{"$f":"VLOOKUP(WEEKDAY(M7),Recherche_jour_de_la_semaine!$B$2:$C$8,2)","v":"Ven"},{"$f":"VLOOKUP(WEEKDAY(N7),Recherche_jour_de_la_semaine!$B$2:$C$8,2)","v":"Sam"},null,{"$f":"VLOOKUP(WEEKDAY(P7),Recherche_jour_de_la_semaine!$B$2:$C$8,2)","v":"Dim"},{"$f":"VLOOKUP(WEEKDAY(Q7),Recherche_jour_de_la_semaine!$B$2:$C$8,2)","v":"Lun"},{"$f":"VLOOKUP(WEEKDAY(R7),Recherche_jour_de_la_semaine!$B$2:$C$8,2)","v":"Mar"},{"$f":"VLOOKUP(WEEKDAY(S7),Recherche_jour_de_la_semaine!$B$2:$C$8,2)","v":"Mer"},{"$f":"VLOOKUP(WEEKDAY(T7),Recherche_jour_de_la_semaine!$B$2:$C$8,2)","v":"Jeu"},{"$f":"VLOOKUP(WEEKDAY(U7),Recherche_jour_de_la_semaine!$B$2:$C$8,2)","v":"Ven"},{"$f":"VLOOKUP(WEEKDAY(V7),Recherche_jour_de_la_semaine!$B$2:$C$8,2)","v":"Sam"}]
[{"$nulls":14},{"$f":"SUM(H9:N9)","v":{"v":0,"d":"0.00"}},{"$nulls":7},{"$f":"SUM(P9:V9)","v":{"v":0,"d":"0.00"}},{"$f":"O9+W9","v":{"v":0,"d":"0.00"}}]
[{"$nulls":14},{"v":0,"d":"0.00"},{"$nulls":7},{"v":0,"d":"0.00"},{"v":0,"d":"0.00"}]
[{"$nulls":14},{"v":0,"d":"0.00"},{"$nulls":7},{"v":0,"d":"0.00"},{"v":0,"d":"0.00"}]
[{"$nulls":14},{"v":0,"d":"0.00"},{"$nulls":7},{"v":0,"d":"0.00"},{"v":0,"d":"0.00"}]
[{"$nulls":14},{"v":0,"d":"0.00"},{"$nulls":7},{"v":0,"d":"0.00"},{"v":0,"d":"0.00"}]
[{"$nulls":14},{"v":0,"d":"0.00"},{"$nulls":7},{"v":0,"d":"0.00"},{"v":0,"d":"0.00"}]
[{"$nulls":14},{"v":0,"d":"0.00"},{"$nulls":7},{"v":0,"d":"0.00"},{"v":0,"d":"0.00"}]
[{"$nulls":14},{"$f":"SUM(H16:N16)","v":{"v":0,"d":"0.00"}},{"$nulls":7},{"$f":"SUM(P16:V16)","v":{"v":0,"d":"0.00"}},{"$f":"O16+W16","v":{"v":0,"d":"0.00"}}]
[{"$nulls":14},{"v":0,"d":"0.00"},{"$nulls":7},{"v":0,"d":"0.00"},{"v":0,"d":"0.00"}]
[{"$nulls":14},{"v":0,"d":"0.00"},{"$nulls":7},{"v":0,"d":"0.00"},{"v":0,"d":"0.00"}]
[{"$nulls":14},{"v":0,"d":"0.00"},{"$nulls":7},{"v":0,"d":"0.00"},{"v":0,"d":"0.00"}]
[{"$nulls":14},{"v":0,"d":"0.00"},{"$nulls":7},{"v":0,"d":"0.00"},{"v":0,"d":"0.00"}]
[{"$nulls":14},{"v":0,"d":"0.00"},{"$nulls":7},{"v":0,"d":"0.00"},{"v":0,"d":"0.00"}]
[null,"Nombre total d’heures normales   ",{"$nulls":5},{"$f":"SUM(H9:H21)","v":{"v":0,"d":"0.00"}},{"v":0,"d":"0.00"},{"v":0,"d":"0.00"},{"v":0,"d":"0.00"},{"v":0,"d":"0.00"},{"v":0,"d":"0.00"},{"v":0,"d":"0.00"},{"v":0,"d":"0.00"},{"v":0,"d":"0.00"},{"$f":"SUM(Q9:Q21)","v":{"v":0,"d":"0.00"}},{"v":0,"d":"0.00"},{"v":0,"d":"0.00"},{"v":0,"d":"0.00"},{"v":0,"d":"0.00"},{"v":0,"d":"0.00"},{"$f":"SUM(W9:W21)","v":{"v":0,"d":"0.00"}},{"$f":"SUM(X9:X21)","v":{"v":0,"d":"0.00"}}]
[null,"HEURES SUPPLÉMENTAIRES :",null,null,"Date :"]
[{"$nulls":7},{"$f":"Jour_Un","v":"2025-06-01"},{"$f":"Jour_Un+1","v":"2025-06-02"},{"$f":"Jour_Un+2","v":"2025-06-03"},{"$f":"Jour_Un+3","v":"2025-06-04"},{"$f":"Jour_Un+4","v":"2025-06-05"},{"$f":"Jour_Un+5","v":"2025-06-06"},{"$f":"Jour_Un+6","v":"2025-06-07"},"Heures sup. semaine 1",{"$f":"Jour_Un+7","v":"2025-06-08"},{"$f":"Jour_Un+8","v":"2025-06-09"},{"$f":"Jour_Un+9","v":"2025-06-10"},{"$f":"Jour_Un+10","v":"2025-06-11"},{"$f":"Jour_Un+11","v":"2025-06-12"},{"$f":"Jour_Un+12","v":"2025-06-13"},{"$f":"Jour_Un+13","v":"2025-06-14"},"Heures sup. semaine 2","Total d’heures sup.","Code\nheures sup."]
[null,"Tâche","Emplacement","N° de bon de travail","Description du travail","Titre du poste","Numéro",{"$f":"VLOOKUP(WEEKDAY(Jour_Un),Recherche_jour_de_la_semaine!$B$2:$C$8,2)","v":"Dim"},{"$f":"VLOOKUP(WEEKDAY(I24),Recherche_jour_de_la_semaine!$B$2:$C$8,2)","v":"Lun"},{"$f":"VLOOKUP(WEEKDAY(J24),Recherche_jour_de_la_semaine!$B$2:$C$8,2)","v":"Mar"},{"$f":"VLOOKUP(WEEKDAY(K24),Recherche_jour_de_la_semaine!$B$2:$C$8,2)","v":"Mer"},{"$f":"VLOOKUP(WEEKDAY(L24),Recherche_jour_de_la_semaine!$B$2:$C$8,2)","v":"Jeu"},{"$f":"VLOOKUP(WEEKDAY(M24),Recherche_jour_de_la_semaine!$B$2:$C$8,2)","v":"Ven"},{"$f":"VLOOKUP(WEEKDAY(N24),Recherche_jour_de_la_semaine!$B$2:$C$8,2)","v":"Sam"},null,{"$f":"VLOOKUP(WEEKDAY(P24),Recherche_jour_de_la_semaine!$B$2:$C$8,2)","v":"Dim"},{"$f":"VLOOKUP(WEEKDAY(Q24),Recherche_jour_de_la_semaine!$B$2:$C$8,2)","v":"Lun"},{"$f":"VLOOKUP(WEEKDAY(R24),Recherche_jour_de_la_semaine!$B$2:$C$8,2)","v":"Mar"},{"$f":"VLOOKUP(WEEKDAY(S24),Recherche_jour_de_la_semaine!$B$2:$C$8,2)","v":"Mer"},{"$f":"VLOOKUP(WEEKDAY(T24),Recherche_jour_de_la_semaine!$B$2:$C$8,2)","v":"Jeu"},{"$f":"VLOOKUP(WEEKDAY(U24),Recherche_jour_de_la_semaine!$B$2:$C$8,2)","v":"Ven"},{"$f":"VLOOKUP(WEEKDAY(V24),Recherche_jour_de_la_semaine!$B$2:$C$8,2)","v":"Sam"}]
[{"$nulls":14},{"$f":"SUM(H26:N26)","v":{"v":0,"d":"0.00"}},{"$nulls":7},{"$f":"SUM(P26:V26)","v":{"v":0,"d":"0.00"}},{"$f":"O26+W26","v":{"v":0,"d":"0.00"}}]
[{"$nulls":14},{"v":0,"d":"0.00"},{"$nulls":7},{"v":0,"d":"0.00"},{"v":0,"d":"0.00"}]
[{"$nulls":14},{"v":0,"d":"0.00"},{"$nulls":7},{"v":0,"d":"0.00"},{"v":0,"d":"0.00"}]
[{"$nulls":14},{"v":0,"d":"0.00"},{"$nulls":7},{"v":0,"d":"0.00"},{"v":0,"d":"0.00"}]
[{"$nulls":14},{"v":0,"d":"0.00"},{"$nulls":7},{"v":0,"d":"0.00"},{"v":0,"d":"0.00"}]
[{"$nulls":14},{"v":0,"d":"0.00"},{"$nulls":7},{"v":0,"d":"0.00"},{"v":0,"d":"0.00"}]
[{"$nulls":14},{"v":0,"d":"0.00"},{"$nulls":7},{"v":0,"d":"0.00"},{"v":0,"d":"0.00"}]
[null,"Nombre total d’heures supplémentaires     ",{"$nulls":5},{"$f":"SUM(H26:H32)","v":{"v":0,"d":"0.00"}},{"v":0,"d":"0.00"},{"v":0,"d":"0.00"},{"v":0,"d":"0.00"},{"v":0,"d":"0.00"},{"v":0,"d":"0.00"},{"v":0,"d":"0.00"},{"$f":"SUM(O26:O32)","v":{"v":0,"d":"0.00"}},{"v":0,"d":"0.00"},{"v":0,"d":"0.00"},{"v":0,"d":"0.00"},{"v":0,"d":"0.00"},{"v":0,"d":"0.00"},{"v":0,"d":"0.00"},{"v":0,"d":"0.00"},{"$f":"SUM(P33:V33)","v":{"v":0,"d":"0.00"}},{"$f":"SUM(X26:X32)","v":{"v":0,"d":"0.00"}},"Total\nheures\ntravaillées","Total\nheures\npayées"]
[null,"Heures supplémentaires compensées     ",{"$nulls":12},{"$f":"IF(SUM(H34:N34)<=O33,SUM(H34:N34),O33)","v":{"v":0,"d":"0.00"}},{"$nulls":7},{"$f":"IF(SUM(P34:V34)<=W33,SUM(P34:V34),W33)","v":{"v":0,"d":"0.00"}},{"$f":"IF(SUM(Q34:W34)<=X33,SUM(Q34:W34),X33)","v":{"v":0,"d":"0.00"}}]
[null,"Heures supplémentaires payées     ",{"$nulls":5},{"$f":"IF(H33>=H34,H33-H34,H33)","v":{"v":0,"d":"0.00"}},{"$f":"IF(I33>=I34,I33-I34,I33)","v":{"v":0,"d":"0.00"}},{"v":0,"d":"0.00"},{"v":0,"d":"0.00"},{"v":0,"d":"0.00"},{"v":0,"d":"0.00"},{"v":0,"d":"0.00"},{"v":0,"d":"0.00"},{"v":0,"d":"0.00"},{"v":0,"d":"0.00"},{"v":0,"d":"0.00"},{"v":0,"d":"0.00"},{"v":0,"d":"0.00"},{"v":0,"d":"0.00"},{"v":0,"d":"0.00"},{"$f":"IF(W33>=W34,W33-W34,W33)","v":{"v":0,"d":"0.00"}},{"$f":"IF(X33>=X34,X33-X34,X33)","v":{"v":0,"d":"0.00"}},{"$f":"$X$22+$X$33","v":{"v":0,"d":"0.00"}},{"$f":"X22+X35","v":{"v":0,"d":"0.00"}}]
[null,"Employé ",{"$nulls":4},"Responsable ",{"$nulls":8},"Responsable "]

{"sheet":"Recherche_jour_de_la_semaine","index":1,"n_rows":8,"n_cols":3,"rows_kept":8}
[null,"Nombre entier\njour de la semaine","Abréviation\njour de la semaine"]
[null,1,"Dim"]
[null,2,"Lun"]
[null,3,"Mar"]
[null,4,"Mer"]
[null,5,"Jeu"]
[null,6,"Ven"]
[null,7,"Sam"]