{"text_format":"3","workbook":"xlsx","n_sheets":4,"sheets":["ALOITUS","PROJEKTIPARAMETRIT","PROJEKTIN TIEDOT","PROJEKTIN SUMMAT"],"not_rendered":{"charts":2,"defined_names":3,"pivot_tables":1},"read":"whole","date_system":"1900"}

{"sheet":"ALOITUS","index":0,"n_rows":7,"n_cols":2,"rows_kept":7}
[null,"TIETOJA TÄSTÄ MALLISTA"]
[null,"Tämän Tapahtumasuunnittelu-työkirjan avulla seuraat projektin parametreja, tietoja ja kokonaissummia."]
[null,"Päivitä pylväskaaviot täyttämällä tarvittavat tiedot Projektiparametrit- ja Projektitiedot-laskentataulukoihin. Projektin summat -laskentataulukon Pivot-taulukko päivittyy automaattisesti."]
[null,"Kirjoita yrityksen nimi Parametrit-laskentataulukkoon. Se päivitetään automaattisesti myös muihin laskentataulukoihin."]
[null,"Huomautus:  "]
[null,"TAPAHTUMASUUNNITTELU-työkirjan kunkin laskentataulukon sarakkeessa A annetaan lisäohjeita. Kyseiset tekstit on piilotettu tarkoituksella. Jos haluat poistaa tekstin, valitse sarake A ja valitse sitten POISTA. Jos haluat tuoda tekstin näkyviin, valitse sarake A ja muuta sitten fontin väriä."]
{"$rows_left_out":2}
{"sheet":"PROJEKTIPARAMETRIT","index":1,"n_rows":19,"n_cols":9,"rows_kept":19,"merged":[[23,1,42,3]]}
[null,"Yrityksen nimi"]
[null,"Tapahtumanhallintaprojektin seuranta"]
[null,{"$f":"B1&\" Luottamuksellinen\"","v":"Yrityksen nimi Luottamuksellinen"}]
[null,"Varjostetut solut lasketaan puolestasi. Sinun ei tarvitse kirjoittaa niihin mitään."]
[null,"PROJEKTIN TYYPPI","ASIAKKUUSPÄÄLLIKKÖ","PROJEKTIPÄÄLLIKKÖ","STRATEGIAPÄÄLLIKKÖ","ULKOASUN SUUNNITTELIJA","TAPAHTUMAN HENKILÖSTÖ","JÄRJESTELMÄN-VALVONTA","Summa"]
[null,"Tapahtumastrategian kehitys",{"v":0.2,"d":"20%"},{"v":0.1,"d":"10%"},{"v":0.6,"d":"60%"},{"v":0,"d":"0%"},{"v":0,"d":"0%"},{"v":0.1,"d":"10%"},{"$f":"SUM(Parametrit[[#This Row],[ASIAKKUUSPÄÄLLIKKÖ]:[JÄRJESTELMÄN-VALVONTA]])","v":{"v":1,"d":"100%"}}]
{"$rows_left_out":14}
{"sheet":"PROJEKTIN TIEDOT","index":2,"n_rows":10,"n_cols":23,"rows_kept":10}
[null,{"$f":"PROJEKTIPARAMETRIT!B1","v":"Yrityksen nimi"}]
[null,"Tapahtumanhallintaprojektin seuranta"]
[null,{"$f":"PROJEKTIPARAMETRIT!B3","v":"Yrityksen nimi Luottamuksellinen"}]
["Kirjoita tiedot Projektin tiedot -taulukkoon alkaen oikealla olevasta solusta.\nTIEDOKSI\nJos haluat lisätä rivin oikealla olevaan taulukkoon, valitse taulukon tekstiosassa (ei summat-rivillä) oikean alanurkan solu ja paina SARKAINTA, tai paina VAIHTO+F10 taulukossa, johon haluat lisätä rivin, ja valitse sitten Lisää | Taulukon rivejä yläpuolelle/alapuolelle.\nVarmista, että poistat kaikki käyttämättömät rivit. PROJEKTIN SUMMAT -Pivot-taulukko käyttää taulukon kaikkia soluja, joten tulokset olisivat muuten virheellisiä.","PROJEKTIN NIMI","PROJEKTIN TYYPPI","ARVIOITU ALOITUSAIKA","ARVIOITU PÄÄTTYMISAIKA","TOTEUTUNUT ALOITUSAIKA","TOTEUTUNUT PÄÄTTYMISAIKA","ARVIOITU TYÖMÄÄRÄ","TOTEUTUNUT TYÖMÄÄRÄ","ARVIOITU KESTO","TOTEUTUNUT KESTO","ASIAKKUUSPÄÄLLIKKÖ","PROJEKTIPÄÄLLIKKÖ","STRATEGIAPÄÄLLIKKÖ","ULKOASUN SUUNNITTELIJA","TAPAHTUMAN HENKILÖSTÖ","JÄRJESTELMÄN-VALVONTA","ASIAKKUUSPÄÄLLIKKÖ ","PROJEKTIPÄÄLLIKKÖ ","STRATEGIAPÄÄLLIKKÖ ","ULKOASUN SUUNNITTELIJA ","TAPAHTUMAN HENKILÖSTÖ ","JÄRJESTELMÄNVALVONTA "]
[null,"Projekti 1","Tapahtumastrategian kehitys",{"$f":"DATE(YEAR(TODAY()),6,9)","v":"2022-06-09"},{"$f":" DATE(YEAR(TODAY()),8,7)","v":"2022-08-07"},{"$f":"DATE(YEAR(TODAY()),6,29)","v":"2022-06-29"},{"$f":"DATE(YEAR(TODAY()),9,3)","v":"2022-09-03"},200,220,{"$f":"DAYS360(Projektin_tiedot[[#This Row],[ARVIOITU ALOITUSAIKA]],Projektin_tiedot[[#This Row],[ARVIOITU PÄÄTTYMISAIKA]],FALSE)","v":58},{"$f":"DAYS360(Projektin_tiedot[[#This Row],[TOTEUTUNUT ALOITUSAIKA]],Projektin_tiedot[[#This Row],[TOTEUTUNUT PÄÄTTYMISAIKA]],FALSE)","v":64},{"$f":"INDEX(Parametrit[],MATCH(Projektin_tiedot[[#This Row],[PROJEKTIN TYYPPI]],Parametrit[PROJEKTIN TYYPPI],0),MATCH(Projektin_tiedot[[#Headers],[ASIAKKUUSPÄÄLLIKKÖ]],Parametrit[#Headers],0))*INDEX(PROJEKTIPARAMETRIT!$B$12:$H$12,1,MATCH(Projektin_tiedot[[#Headers],[ASIAKKUUSPÄÄLLIKKÖ]],Parametrit[#Headers],0))*Projektin_tiedot[[#This Row],[ARVIOITU TYÖMÄÄRÄ]]","v":{"v":7200,"d":"7,200 €"}},{"$f":"INDEX(Parametrit[],MATCH(Projektin_tiedot[[#This Row],[PROJEKTIN TYYPPI]],Parametrit[PROJEKTIN TYYPPI],0),MATCH(Projektin_tiedot[[#Headers],[PROJEKTIPÄÄLLIKKÖ]],Parametrit[#Headers],0))*INDEX(PROJEKTIPARAMETRIT!$B$12:$H$12,1,MATCH(Projektin_tiedot[[#Headers],[PROJEKTIPÄÄLLIKKÖ]],Parametrit[#Headers],0))*Projektin_tiedot[[#This Row],[ARVIOITU TYÖMÄÄRÄ]]","v":{"v":2400,"d":"2,400 €"}},{"$f":"INDEX(Parametrit[],MATCH(Projektin_tiedot[[#This Row],[PROJEKTIN TYYPPI]],Parametrit[PROJEKTIN TYYPPI],0),MATCH(Projektin_tiedot[[#Headers],[STRATEGIAPÄÄLLIKKÖ]],Parametrit[#Headers],0))*INDEX(PROJEKTIPARAMETRIT!$B$12:$H$12,1,MATCH(Projektin_tiedot[[#Headers],[STRATEGIAPÄÄLLIKKÖ]],Parametrit[#Headers],0))*Projektin_tiedot[[#This Row],[ARVIOITU TYÖMÄÄRÄ]]","v":{"v":18000,"d":"18,000 €"}},{"$f":"INDEX(Parametrit[],MATCH(Projektin_tiedot[[#This Row],[PROJEKTIN TYYPPI]],Parametrit[PROJEKTIN TYYPPI],0),MATCH(Projektin_tiedot[[#Headers],[ULKOASUN SUUNNITTELIJA]],Parametrit[#Headers],0))*INDEX(PROJEKTIPARAMETRIT!$B$12:$H$12,1,MATCH(Projektin_tiedot[[#Headers],[ULKOASUN SUUNNITTELIJA]],Parametrit[#Headers],0))*Projektin_tiedot[[#This Row],[ARVIOITU TYÖMÄÄRÄ]]","v":{"v":0,"d":"0 €"}},{"$f":"INDEX(Parametrit[],MATCH(Projektin_tiedot[[#This Row],[PROJEKTIN TYYPPI]],Parametrit[PROJEKTIN TYYPPI],0),MATCH(Projektin_tiedot[[#Headers],[TAPAHTUMAN HENKILÖSTÖ]],Parametrit[#Headers],0))*INDEX(PROJEKTIPARAMETRIT!$B$12:$H$12,1,MATCH(Projektin_tiedot[[#Headers],[TAPAHTUMAN HENKILÖSTÖ]],Parametrit[#Headers],0))*Projektin_tiedot[[#This Row],[ARVIOITU TYÖMÄÄRÄ]]","v":{"v":0,"d":"0 €"}},{"$f":"INDEX(Parametrit[],MATCH(Projektin_tiedot[[#This Row],[PROJEKTIN TYYPPI]],Parametrit[PROJEKTIN TYYPPI],0),MATCH(Projektin_tiedot[[#Headers],[JÄRJESTELMÄN-VALVONTA]],Parametrit[#Headers],0))*INDEX(PROJEKTIPARAMETRIT!$B$12:$H$12,1,MATCH(Projektin_tiedot[[#Headers],[JÄRJESTELMÄN-VALVONTA]],Parametrit[#Headers],0))*Projektin_tiedot[[#This Row],[ARVIOITU TYÖMÄÄRÄ]]","v":{"v":1200,"d":"1,200 €"}},{"$f":"INDEX(Parametrit[],MATCH(Projektin_tiedot[[#This Row],[PROJEKTIN TYYPPI]],Parametrit[PROJEKTIN TYYPPI],0),MATCH(Projektin_tiedot[[#Headers],[ASIAKKUUSPÄÄLLIKKÖ]],Parametrit[#Headers],0))*INDEX(PROJEKTIPARAMETRIT!$B$12:$H$12,1,MATCH(Projektin_tiedot[[#Headers],[ASIAKKUUSPÄÄLLIKKÖ]],Parametrit[#Headers],0))*Projektin_tiedot[[#This Row],[TOTEUTUNUT TYÖMÄÄRÄ]]","v":{"v":7920,"d":"7,920 €"}},{"$f":"INDEX(Parametrit[],MATCH(Projektin_tiedot[[#This Row],[PROJEKTIN TYYPPI]],Parametrit[PROJEKTIN TYYPPI],0),MATCH(Projektin_tiedot[[#Headers],[PROJEKTIPÄÄLLIKKÖ]],Parametrit[#Headers],0))*INDEX(PROJEKTIPARAMETRIT!$B$12:$H$12,1,MATCH(Projektin_tiedot[[#Headers],[PROJEKTIPÄÄLLIKKÖ]],Parametrit[#Headers],0))*Projektin_tiedot[[#This Row],[TOTEUTUNUT TYÖMÄÄRÄ]]","v":{"v":2640,"d":"2,640 €"}},{"$f":"INDEX(Parametrit[],MATCH(Projektin_tiedot[[#This Row],[PROJEKTIN TYYPPI]],Parametrit[PROJEKTIN TYYPPI],0),MATCH(Projektin_tiedot[[#Headers],[STRATEGIAPÄÄLLIKKÖ]],Parametrit[#Headers],0))*INDEX(PROJEKTIPARAMETRIT!$B$12:$H$12,1,MATCH(Projektin_tiedot[[#Headers],[STRATEGIAPÄÄLLIKKÖ]],Parametrit[#Headers],0))*Projektin_tiedot[[#This Row],[TOTEUTUNUT TYÖMÄÄRÄ]]","v":{"v":19800,"d":"19,800 €"}},{"$f":"INDEX(Parametrit[],MATCH(Projektin_tiedot[[#This Row],[PROJEKTIN TYYPPI]],Parametrit[PROJEKTIN TYYPPI],0),MATCH(Projektin_tiedot[[#Headers],[ULKOASUN SUUNNITTELIJA]],Parametrit[#Headers],0))*INDEX(PROJEKTIPARAMETRIT!$B$12:$H$12,1,MATCH(Projektin_tiedot[[#Headers],[ULKOASUN SUUNNITTELIJA]],Parametrit[#Headers],0))*Projektin_tiedot[[#This Row],[TOTEUTUNUT TYÖMÄÄRÄ]]","v":{"v":0,"d":"0 €"}},{"$f":"INDEX(Parametrit[],MATCH(Projektin_tiedot[[#This Row],[PROJEKTIN TYYPPI]],Parametrit[PROJEKTIN TYYPPI],0),MATCH(Projektin_tiedot[[#Headers],[TAPAHTUMAN HENKILÖSTÖ]],Parametrit[#Headers],0))*INDEX(PROJEKTIPARAMETRIT!$B$12:$H$12,1,MATCH(Projektin_tiedot[[#Headers],[TAPAHTUMAN HENKILÖSTÖ]],Parametrit[#Headers],0))*Projektin_tiedot[[#This Row],[TOTEUTUNUT TYÖMÄÄRÄ]]","v":{"v":0,"d":"0 €"}},{"$f":"INDEX(Parametrit[],MATCH(Projektin_tiedot[[#This Row],[PROJEKTIN TYYPPI]],Parametrit[PROJEKTIN TYYPPI],0),MATCH(Projektin_tiedot[[#Headers],[JÄRJESTELMÄN-VALVONTA]],Parametrit[#Headers],0))*INDEX(PROJEKTIPARAMETRIT!$B$12:$H$12,1,MATCH(Projektin_tiedot[[#Headers],[JÄRJESTELMÄN-VALVONTA]],Parametrit[#Headers],0))*Projektin_tiedot[[#This Row],[TOTEUTUNUT TYÖMÄÄRÄ]]","v":{"v":1320,"d":"1,320 €"}}]
[null,"Projekti 2","Tapahtuman suunnittelu",{"$f":"DATE(YEAR(TODAY())+1,6,25)","v":"2023-06-25"},{"$f":"DATE(YEAR(TODAY())+1,7,27)","v":"2023-07-27"},{"$f":"DATE(YEAR(TODAY()),7,15)","v":"2022-07-15"},{"$f":"DATE(YEAR(TODAY())+1,8,25)","v":"2023-08-25"},400,390,{"$f":"DAYS360(Projektin_tiedot[[#This Row],[ARVIOITU ALOITUSAIKA]],Projektin_tiedot[[#This Row],[ARVIOITU PÄÄTTYMISAIKA]],FALSE)","v":32},{"$f":"DAYS360(Projektin_tiedot[[#This Row],[TOTEUTUNUT ALOITUSAIKA]],Projektin_tiedot[[#This Row],[TOTEUTUNUT PÄÄTTYMISAIKA]],FALSE)","v":400},{"$f":"INDEX(Parametrit[],MATCH(Projektin_tiedot[[#This Row],[PROJEKTIN TYYPPI]],Parametrit[PROJEKTIN TYYPPI],0),MATCH(Projektin_tiedot[[#Headers],[ASIAKKUUSPÄÄLLIKKÖ]],Parametrit[#Headers],0))*INDEX(PROJEKTIPARAMETRIT!$B$12:$H$12,1,MATCH(Projektin_tiedot[[#Headers],[ASIAKKUUSPÄÄLLIKKÖ]],Parametrit[#Headers],0))*Projektin_tiedot[[#This Row],[ARVIOITU TYÖMÄÄRÄ]]","v":{"v":14400,"d":"14,400 €"}},{"$f":"INDEX(Parametrit[],MATCH(Projektin_tiedot[[#This Row],[PROJEKTIN TYYPPI]],Parametrit[PROJEKTIN TYYPPI],0),MATCH(Projektin_tiedot[[#Headers],[PROJEKTIPÄÄLLIKKÖ]],Parametrit[#Headers],0))*INDEX(PROJEKTIPARAMETRIT!$B$12:$H$12,1,MATCH(Projektin_tiedot[[#Headers],[PROJEKTIPÄÄLLIKKÖ]],Parametrit[#Headers],0))*Projektin_tiedot[[#This Row],[ARVIOITU TYÖMÄÄRÄ]]","v":{"v":24000,"d":"24,000 €"}},{"$f":"INDEX(Parametrit[],MATCH(Projektin_tiedot[[#This Row],[PROJEKTIN TYYPPI]],Parametrit[PROJEKTIN TYYPPI],0),MATCH(Projektin_tiedot[[#Headers],[STRATEGIAPÄÄLLIKKÖ]],Parametrit[#Headers],0))*INDEX(PROJEKTIPARAMETRIT!$B$12:$H$12,1,MATCH(Projektin_tiedot[[#Headers],[STRATEGIAPÄÄLLIKKÖ]],Parametrit[#Headers],0))*Projektin_tiedot[[#This Row],[ARVIOITU TYÖMÄÄRÄ]]","v":{"v":6000,"d":"6,000 €"}},{"$f":"INDEX(Parametrit[],MATCH(Projektin_tiedot[[#This Row],[PROJEKTIN TYYPPI]],Parametrit[PROJEKTIN TYYPPI],0),MATCH(Projektin_tiedot[[#Headers],[ULKOASUN SUUNNITTELIJA]],Parametrit[#Headers],0))*INDEX(PROJEKTIPARAMETRIT!$B$12:$H$12,1,MATCH(Projektin_tiedot[[#Headers],[ULKOASUN SUUNNITTELIJA]],Parametrit[#Headers],0))*Projektin_tiedot[[#This Row],[ARVIOITU TYÖMÄÄRÄ]]","v":{"v":4000,"d":"4,000 €"}},{"$f":"INDEX(Parametrit[],MATCH(Projektin_tiedot[[#This Row],[PROJEKTIN TYYPPI]],Parametrit[PROJEKTIN TYYPPI],0),MATCH(Projektin_tiedot[[#Headers],[TAPAHTUMAN HENKILÖSTÖ]],Parametrit[#Headers],0))*INDEX(PROJEKTIPARAMETRIT!$B$12:$H$12,1,MATCH(Projektin_tiedot[[#Headers],[TAPAHTUMAN HENKILÖSTÖ]],Parametrit[#Headers],0))*Projektin_tiedot[[#This Row],[ARVIOITU TYÖMÄÄRÄ]]","v":{"v":0,"d":"0 €"}},{"$f":"INDEX(Parametrit[],MATCH(Projektin_tiedot[[#This Row],[PROJEKTIN TYYPPI]],Parametrit[PROJEKTIN TYYPPI],0),MATCH(Projektin_tiedot[[#Headers],[JÄRJESTELMÄN-VALVONTA]],Parametrit[#Headers],0))*INDEX(PROJEKTIPARAMETRIT!$B$12:$H$12,1,MATCH(Projektin_tiedot[[#Headers],[JÄRJESTELMÄN-VALVONTA]],Parametrit[#Headers],0))*Projektin_tiedot[[#This Row],[ARVIOITU TYÖMÄÄRÄ]]","v":{"v":2400,"d":"2,400 €"}},{"$f":"INDEX(Parametrit[],MATCH(Projektin_tiedot[[#This Row],[PROJEKTIN TYYPPI]],Parametrit[PROJEKTIN TYYPPI],0),MATCH(Projektin_tiedot[[#Headers],[ASIAKKUUSPÄÄLLIKKÖ]],Parametrit[#Headers],0))*INDEX(PROJEKTIPARAMETRIT!$B$12:$H$12,1,MATCH(Projektin_tiedot[[#Headers],[ASIAKKUUSPÄÄLLIKKÖ]],Parametrit[#Headers],0))*Projektin_tiedot[[#This Row],[TOTEUTUNUT TYÖMÄÄRÄ]]","v":{"v":14040,"d":"14,040 €"}},{"$f":"INDEX(Parametrit[],MATCH(Projektin_tiedot[[#This Row],[PROJEKTIN TYYPPI]],Parametrit[PROJEKTIN TYYPPI],0),MATCH(Projektin_tiedot[[#Headers],[PROJEKTIPÄÄLLIKKÖ]],Parametrit[#Headers],0))*INDEX(PROJEKTIPARAMETRIT!$B$12:$H$12,1,MATCH(Projektin_tiedot[[#Headers],[PROJEKTIPÄÄLLIKKÖ]],Parametrit[#Headers],0))*Projektin_tiedot[[#This Row],[TOTEUTUNUT TYÖMÄÄRÄ]]","v":{"v":23400,"d":"23,400 €"}},{"$f":"INDEX(Parametrit[],MATCH(Projektin_tiedot[[#This Row],[PROJEKTIN TYYPPI]],Parametrit[PROJEKTIN TYYPPI],0),MATCH(Projektin_tiedot[[#Headers],[STRATEGIAPÄÄLLIKKÖ]],Parametrit[#Headers],0))*INDEX(PROJEKTIPARAMETRIT!$B$12:$H$12,1,MATCH(Projektin_tiedot[[#Headers],[STRATEGIAPÄÄLLIKKÖ]],Parametrit[#Headers],0))*Projektin_tiedot[[#This Row],[TOTEUTUNUT TYÖMÄÄRÄ]]","v":{"v":5850,"d":"5,850 €"}},{"$f":"INDEX(Parametrit[],MATCH(Projektin_tiedot[[#This Row],[PROJEKTIN TYYPPI]],Parametrit[PROJEKTIN TYYPPI],0),MATCH(Projektin_tiedot[[#Headers],[ULKOASUN SUUNNITTELIJA]],Parametrit[#Headers],0))*INDEX(PROJEKTIPARAMETRIT!$B$12:$H$12,1,MATCH(Projektin_tiedot[[#Headers],[ULKOASUN SUUNNITTELIJA]],Parametrit[#Headers],0))*Projektin_tiedot[[#This Row],[TOTEUTUNUT TYÖMÄÄRÄ]]","v":{"v":3900,"d":"3,900 €"}},{"$f":"INDEX(Parametrit[],MATCH(Projektin_tiedot[[#This Row],[PROJEKTIN TYYPPI]],Parametrit[PROJEKTIN TYYPPI],0),MATCH(Projektin_tiedot[[#Headers],[TAPAHTUMAN HENKILÖSTÖ]],Parametrit[#Headers],0))*INDEX(PROJEKTIPARAMETRIT!$B$12:$H$12,1,MATCH(Projektin_tiedot[[#Headers],[TAPAHTUMAN HENKILÖSTÖ]],Parametrit[#Headers],0))*Projektin_tiedot[[#This Row],[TOTEUTUNUT TYÖMÄÄRÄ]]","v":{"v":0,"d":"0 €"}},{"$f":"INDEX(Parametrit[],MATCH(Projektin_tiedot[[#This Row],[PROJEKTIN TYYPPI]],Parametrit[PROJEKTIN TYYPPI],0),MATCH(Projektin_tiedot[[#Headers],[JÄRJESTELMÄN-VALVONTA]],Parametrit[#Headers],0))*INDEX(PROJEKTIPARAMETRIT!$B$12:$H$12,1,MATCH(Projektin_tiedot[[#Headers],[JÄRJESTELMÄN-VALVONTA]],Parametrit[#Headers],0))*Projektin_tiedot[[#This Row],[TOTEUTUNUT TYÖMÄÄRÄ]]","v":{"v":2340,"d":"2,340 €"}}]
{"$rows_left_out":5}
{"sheet":"PROJEKTIN SUMMAT","index":3,"n_rows":10,"n_cols":14,"rows_kept":10}
[null,{"$f":"PROJEKTIPARAMETRIT!B1","v":"Yrityksen nimi"}]
[null,"Tapahtumanhallintaprojektin seuranta"]
[null,{"$f":"PROJEKTIPARAMETRIT!B3","v":"Yrityksen nimi Luottamuksellinen"}]
["Oikeanpuoleisesta solusta alkava Pivot-taulukko päivittyy automaattisesti.\nTIEDOKSI\nVoit päivittää oikealla olevan Pivot-taulukon valitsemalla sen (siis minkä tahansa Pivot-taulukon solun) ja valitsemalla sitten PIVOT-TAULUKKOTYÖKALUT | ANALYSOI -valintanauhan välilehdessä Päivitä. Voit vaihtoehtoisesti painaa VAIHTO+F10 missä tahansa Pivot-taulukon solussa ja valita sitten Päivitä.","PROJEKTIN NIMI","ASIAKKUUS-PÄÄLLIKKÖ, ARVIO","PROJEKTI-PÄÄLLIKKÖ, ARVIO","STRATEGIA-PÄÄLLIKKÖ, ARVIO","ULKOASUN SUUNNITTELIJA, ARVIO  ","TAPAHTUMAN HENKILÖSTÖ, ARVIO  ","JÄRJESTELMÄN-VALVONTA, ARVIO","ASIAKAKKUUS-PÄÄLLIKKÖ, TOTEUTUNUT","PROJEKTI-PÄÄLLIKKÖ, TOTEUTUNUT","STRATEGIA-PÄÄLLIKKÖ, TOTEUTUNUT","ULKOASUN SUUNNITTELIJA, TOTEUTUNUT","TAPAHTUMAN HENKILÖSTÖ, TOTEUTUNUT","JÄRJESTELMÄN-VALVONTA, TOTEUTUNUT"]
[null,"Projekti 1",{"v":7200,"d":"7,200.00 €"},{"v":2400,"d":"2,400.00 €"},{"v":1200,"d":"1,200.00 €"},{"v":7920,"d":"7,920.00 €"},{"v":2640,"d":"2,640.00 €"},{"v":19800,"d":"19,800.00 €"},{"v":18000,"d":"18,000.00 €"},{"v":0,"d":"0.00 €"},{"v":0,"d":"0.00 €"},{"v":0,"d":"0.00 €"},{"v":0,"d":"0.00 €"},{"v":1320,"d":"1,320.00 €"}]
[null,"Projekti 2",{"v":14400,"d":"14,400.00 €"},{"v":24000,"d":"24,000.00 €"},{"v":2400,"d":"2,400.00 €"},{"v":14040,"d":"14,040.00 €"},{"v":23400,"d":"23,400.00 €"},{"v":5850,"d":"5,850.00 €"},{"v":6000,"d":"6,000.00 €"},{"v":3900,"d":"3,900.00 €"},{"v":4000,"d":"4,000.00 €"},{"v":0,"d":"0.00 €"},{"v":0,"d":"0.00 €"},{"v":2340,"d":"2,340.00 €"}]
{"$rows_left_out":4}