{"text_format":"3","workbook":"xlsx","n_sheets":3,"sheets":["Koulutusloki","Kurssiluettelo","Henkilöstötiedot"],"not_rendered":{"defined_names":13},"read":"whole","date_system":"1900"}

{"sheet":"Koulutusloki","index":0,"n_rows":23,"n_cols":9,"rows_kept":23}
[]
[]
[null,null,"KOULUTUSLOKI"]
{"$rows_empty":8}
[null,null,"KOULUTUKSEN PÄIVÄMÄÄRÄ","NIMI","KURSSI","OHJAAJA","SUORITETTU","HYVÄKSYTTY/HYLÄTTY","HUOMAUTUKSIA"]
[null,null,"2012-06-01","Kim Abercrombie","Työntekijän perehdyttäminen",{"$f":"IF(tblTrainingLog[[#This Row],[KURSSI]]=\"\",\"\",IFERROR(VLOOKUP(tblTrainingLog[[#This Row],[KURSSI]],tblCourseList[],2,0),\"Not Found\"))","v":"Chris Johnson"},"Kyllä","Hyväksytty","Erinomainen ohjaaja."]
[null,null,"2012-06-02","Michael Lange","Työntekijän perehdyttäminen",{"$f":"IF(tblTrainingLog[[#This Row],[KURSSI]]=\"\",\"\",IFERROR(VLOOKUP(tblTrainingLog[[#This Row],[KURSSI]],tblCourseList[],2,0),\"Not Found\"))","v":"Chris Johnson"},"Kyllä","Hylätty","Täytyi lähteä etuajassa, ei voi suorittaa loppuun."]
[null,null,"2012-06-03","Robin Wakefield","Työntekijän perehdyttäminen",{"$f":"IF(tblTrainingLog[[#This Row],[KURSSI]]=\"\",\"\",IFERROR(VLOOKUP(tblTrainingLog[[#This Row],[KURSSI]],tblCourseList[],2,0),\"Not Found\"))","v":"Chris Johnson"},"Kyllä","Hyväksytty","Tämän neljänneksen viimeinen kurssi."]
[null,null,"2012-06-03","Michael Lange","Työntekijän perehdyttäminen",{"$f":"IF(tblTrainingLog[[#This Row],[KURSSI]]=\"\",\"\",IFERROR(VLOOKUP(tblTrainingLog[[#This Row],[KURSSI]],tblCourseList[],2,0),\"Not Found\"))","v":"Chris Johnson"},"Kyllä","Hyväksytty","Tämän neljänneksen viimeinen kurssi."]
[null,null,"2012-06-04","Michael Lange","Työntekijöiden toimet",{"$f":"IF(tblTrainingLog[[#This Row],[KURSSI]]=\"\",\"\",IFERROR(VLOOKUP(tblTrainingLog[[#This Row],[KURSSI]],tblCourseList[],2,0),\"Not Found\"))","v":"Katie Jordan"},"Kyllä","Hyväksytty","Tämän neljänneksen ensimmäinen kurssi"]
[null,null,"2012-06-04","Robin Wakefield","Työntekijöiden toimet",{"$f":"IF(tblTrainingLog[[#This Row],[KURSSI]]=\"\",\"\",IFERROR(VLOOKUP(tblTrainingLog[[#This Row],[KURSSI]],tblCourseList[],2,0),\"Not Found\"))","v":"Katie Jordan"},"Kyllä","Hyväksytty","Tämän neljänneksen ensimmäinen kurssi"]
[null,null,"2012-06-04","Robin Wakefield","Keskitason kirjanpito",{"$f":"IF(tblTrainingLog[[#This Row],[KURSSI]]=\"\",\"\",IFERROR(VLOOKUP(tblTrainingLog[[#This Row],[KURSSI]],tblCourseList[],2,0),\"Not Found\"))","v":"Katie Jordan"},"Kyllä","Hyväksytty","Vain suljettu kuulijakunta."]
[null,null,"2012-06-04","Kim Abercrombie","Työntekijöiden toimet",{"$f":"IF(tblTrainingLog[[#This Row],[KURSSI]]=\"\",\"\",IFERROR(VLOOKUP(tblTrainingLog[[#This Row],[KURSSI]],tblCourseList[],2,0),\"Not Found\"))","v":"Katie Jordan"},"Kyllä","Hyväksytty","Tämän neljänneksen ensimmäinen kurssi"]
[null,null,"2012-06-05","Kim Abercrombie","Keskitason kirjanpito",{"$f":"IF(tblTrainingLog[[#This Row],[KURSSI]]=\"\",\"\",IFERROR(VLOOKUP(tblTrainingLog[[#This Row],[KURSSI]],tblCourseList[],2,0),\"Not Found\"))","v":"Katie Jordan"},"Ei","Myöhemmin","Ei vielä suoritettu."]
[null,null,"2012-06-05","Michael Lange","Edistynyt kirjanpito",{"$f":"IF(tblTrainingLog[[#This Row],[KURSSI]]=\"\",\"\",IFERROR(VLOOKUP(tblTrainingLog[[#This Row],[KURSSI]],tblCourseList[],2,0),\"Not Found\"))","v":"Chris Johnson"},"Ei","Myöhemmin","Ei vielä suoritettu."]
[{"$nulls":5},{"$f":"IF(tblTrainingLog[[#This Row],[KURSSI]]=\"\",\"\",IFERROR(VLOOKUP(tblTrainingLog[[#This Row],[KURSSI]],tblCourseList[],2,0),\"Not Found\"))","v":""}]

{"sheet":"Kurssiluettelo","index":1,"n_rows":10,"n_cols":6,"rows_kept":10}
[]
[]
[null,null,"KURSSILUETTELO"]
[]
[null,null,"TEHTÄVÄ","OHJAAJA","KUVAUS","TUNNIT"]
[null,null,"Työntekijän perehdyttäminen","Chris Johnson","Uusille työntekijöille suunnattu perehdyttämiskurssi. Siinä määritettään osaston tavoitteet ja odotukset sekä aikataulutus ja rajoitukset.",2]
[null,null,"Työntekijöiden toimet","Katie Jordan","Perehdytysoppaassa käsitellyt työntekijöiden perustoiminnot.",1]
[null,null,"Työntekijöiden toimet","Chris Johnson","Kirjanpidon perusmenetelmät ja ohjeistus",1.5]
[null,null,"Keskitason kirjanpito","Katie Jordan","Keskitason kirjanpidon perusmenetelmät ja ohjeistus.",2]
[null,null,"Edistynyt kirjanpito","Chris Johnson","Edistyneen kirjanpidon perusmenetelmät ja ohjeistus.",2]

{"sheet":"Henkilöstötiedot","index":2,"n_rows":9,"n_cols":5,"rows_kept":9}
[]
[]
[null,null,"HENKILÖSTÖTIEDOT"]
[]
[null,null,"NIMI","OSASTO","TEHTÄVÄ"]
[null,null,"Kim Abercrombie","Myynti","Pääkirjanpitäjä"]
[null,null,"Michael Lange","Kirjanpito","Kirjanpitäjät"]
[null,null,"Robin Wakefield","Kirjanpito","Kirjanpitäjät"]
[null,null,"Katarina Larsson","Kirjanpito","Kirjanpitäjät"]