{"text_format":"3","workbook":"xlsx","n_sheets":3,"sheets":["Tietojen tallentaminen","Myyntiraportti","Myyntiennuste"],"not_rendered":{"charts":5,"defined_names":9,"pivot_tables":1},"read":"whole","date_system":"1900"}

{"sheet":"Tietojen tallentaminen","index":0,"n_rows":24,"n_cols":17,"rows_kept":24}
[{"$nulls":9},{"$f":"365*2","v":730}]
[null,"KUUKAUSITTAIN MYYNTIRAPORTTI"]
[{"$nulls":11},"YHTEENSÄ",null,null,"ENNUSTE"]
[]
[null,"PÄIVÄMÄÄRÄ","YRITYS","SUMMA","SUUNNITELTU","KULUT","TUOTTO","KUUKAUSI","NELJÄNNES","VUOSI","KUUKAUDEN NUMERO (PIILOTA)","KUUKAUSI ","NELJÄNNES ","VUOSITTAIN ","KUUKAUSI  ","NELJÄNNES  ","VUOSI  "]
[null,{"$f":"40657+(365*2)","v":"2013-04-23"},"A. Datum-yritys",{"v":6400,"d":"€6,400.00"},{"v":6200,"d":"€6,200.00"},{"v":4450,"d":"€4,450.00"},{"$f":"tblData[[#This Row],[SUMMA]]-tblData[[#This Row],[KULUT]]","v":{"v":1950,"d":"€1,950.00"}},{"$f":"DATE(YEAR('Tietojen tallentaminen'!$B6),MONTH('Tietojen tallentaminen'!$B6),1)","v":"2013-04-01"},{"$f":"LOOKUP(MONTH('Tietojen tallentaminen'!$H6),{1,1;2,1;3,1;4,2;5,2;6,2;7,3;8,3;9,3;10,4;11,4;12,4})","v":{"v":2,"d":"2. neljännes"}},{"$f":"YEAR('Tietojen tallentaminen'!$B6)","v":2013},{"$f":"MONTH(tblData[[#This Row],[PÄIVÄMÄÄRÄ]])","v":4},{"$f":"SUMIFS(tblData[SUMMA],tblData[PÄIVÄMÄÄRÄ],\">=\"&EOMONTH(tblData[[#This Row],[PÄIVÄMÄÄRÄ]],-1)+1,tblData[PÄIVÄMÄÄRÄ],\"<=\"&EOMONTH(tblData[[#This Row],[PÄIVÄMÄÄRÄ]],0))","v":{"v":14600,"d":"€14,600.00"}},{"$f":"SUMIFS(tblData[SUMMA],tblData[PÄIVÄMÄÄRÄ],\">=\"&DATE(YEAR(tblData[[#This Row],[PÄIVÄMÄÄRÄ]]),1,1),tblData[PÄIVÄMÄÄRÄ],\"<=\"&DATE(YEAR(tblData[[#This Row],[PÄIVÄMÄÄRÄ]]),12,31),tblData[NELJÄNNES],tblData[[#This Row],[NELJÄNNES]])","v":{"v":50800,"d":"€50,800.00"}},{"$f":"SUMIFS(tblData[SUMMA],tblData[PÄIVÄMÄÄRÄ],\">=\"&DATE(YEAR(tblData[[#This Row],[PÄIVÄMÄÄRÄ]]),1,1),tblData[PÄIVÄMÄÄRÄ],\"<=\"&DATE(YEAR(tblData[[#This Row],[PÄIVÄMÄÄRÄ]]),12,31))","v":{"v":143800,"d":"€143,800.00"}},{"$f":"IFERROR(TREND($L$6:INDEX($L:$L,ROW(),1),$K$6:INDEX($K:$K,ROW(),1),IF(MONTH(tblData[[#This Row],[PÄIVÄMÄÄRÄ]])=12,13,MONTH(tblData[[#This Row],[PÄIVÄMÄÄRÄ]])+1)),\"\")","v":{"v":14600,"d":"€14,600.00"}},{"$f":"IFERROR(TREND($M$6:INDEX($M:$M,ROW(),1),$I$6:INDEX($I:$I,ROW(),1),IF(tblData[[#This Row],[NELJÄNNES]]=4,5,tblData[[#This Row],[NELJÄNNES]]+1)),\"\")","v":{"v":50800,"d":"€50,800.00"}},{"$f":"IFERROR(TREND($N$6:INDEX($N:$N,ROW(),1),$J$6:INDEX($J:$J,ROW(),1),tblData[[#This Row],[VUOSI]]+1),\"\")","v":{"v":143800,"d":"€143,800.00"}}]
[null,{"$f":"40659+(365*2)","v":"2013-04-25"},"Contoso Pharmaceuticals",{"v":8200,"d":"€8,200.00"},{"v":8000,"d":"€8,000.00"},{"v":6400,"d":"€6,400.00"},{"$f":"tblData[[#This Row],[SUMMA]]-tblData[[#This Row],[KULUT]]","v":{"v":1800,"d":"€1,800.00"}},{"$f":"DATE(YEAR('Tietojen tallentaminen'!$B7),MONTH('Tietojen tallentaminen'!$B7),1)","v":"2013-04-01"},{"$f":"LOOKUP(MONTH('Tietojen tallentaminen'!$H7),{1,1;2,1;3,1;4,2;5,2;6,2;7,3;8,3;9,3;10,4;11,4;12,4})","v":{"v":2,"d":"2. neljännes"}},{"$f":"YEAR('Tietojen tallentaminen'!$B7)","v":2013},{"$f":"MONTH(tblData[[#This Row],[PÄIVÄMÄÄRÄ]])","v":4},{"$f":"SUMIFS(tblData[SUMMA],tblData[PÄIVÄMÄÄRÄ],\">=\"&EOMONTH(tblData[[#This Row],[PÄIVÄMÄÄRÄ]],-1)+1,tblData[PÄIVÄMÄÄRÄ],\"<=\"&EOMONTH(tblData[[#This Row],[PÄIVÄMÄÄRÄ]],0))","v":{"v":14600,"d":"€14,600.00"}},{"$f":"SUMIFS(tblData[SUMMA],tblData[PÄIVÄMÄÄRÄ],\">=\"&DATE(YEAR(tblData[[#This Row],[PÄIVÄMÄÄRÄ]]),1,1),tblData[PÄIVÄMÄÄRÄ],\"<=\"&DATE(YEAR(tblData[[#This Row],[PÄIVÄMÄÄRÄ]]),12,31),tblData[NELJÄNNES],tblData[[#This Row],[NELJÄNNES]])","v":{"v":50800,"d":"€50,800.00"}},{"$f":"SUMIFS(tblData[SUMMA],tblData[PÄIVÄMÄÄRÄ],\">=\"&DATE(YEAR(tblData[[#This Row],[PÄIVÄMÄÄRÄ]]),1,1),tblData[PÄIVÄMÄÄRÄ],\"<=\"&DATE(YEAR(tblData[[#This Row],[PÄIVÄMÄÄRÄ]]),12,31))","v":{"v":143800,"d":"€143,800.00"}},{"$f":"IFERROR(TREND($L$6:INDEX($L:$L,ROW(),1),$K$6:INDEX($K:$K,ROW(),1),IF(MONTH(tblData[[#This Row],[PÄIVÄMÄÄRÄ]])=12,13,MONTH(tblData[[#This Row],[PÄIVÄMÄÄRÄ]])+1)),\"\")","v":{"v":14600,"d":"€14,600.00"}},{"$f":"IFERROR(TREND($M$6:INDEX($M:$M,ROW(),1),$I$6:INDEX($I:$I,ROW(),1),IF(tblData[[#This Row],[NELJÄNNES]]=4,5,tblData[[#This Row],[NELJÄNNES]]+1)),\"\")","v":{"v":50800,"d":"€50,800.00"}},{"$f":"IFERROR(TREND($N$6:INDEX($N:$N,ROW(),1),$J$6:INDEX($J:$J,ROW(),1),tblData[[#This Row],[VUOSI]]+1),\"\")","v":{"v":143800,"d":"€143,800.00"}}]
[null,{"$f":"40671+(365*2)","v":"2013-05-07"},"Consolidated Messenger",{"v":4400,"d":"€4,400.00"},{"v":4200,"d":"€4,200.00"},{"v":2600,"d":"€2,600.00"},{"$f":"tblData[[#This Row],[SUMMA]]-tblData[[#This Row],[KULUT]]","v":{"v":1800,"d":"€1,800.00"}},{"$f":"DATE(YEAR('Tietojen tallentaminen'!$B8),MONTH('Tietojen tallentaminen'!$B8),1)","v":"2013-05-01"},{"$f":"LOOKUP(MONTH('Tietojen tallentaminen'!$H8),{1,1;2,1;3,1;4,2;5,2;6,2;7,3;8,3;9,3;10,4;11,4;12,4})","v":{"v":2,"d":"2. neljännes"}},{"$f":"YEAR('Tietojen tallentaminen'!$B8)","v":2013},{"$f":"MONTH(tblData[[#This Row],[PÄIVÄMÄÄRÄ]])","v":5},{"$f":"SUMIFS(tblData[SUMMA],tblData[PÄIVÄMÄÄRÄ],\">=\"&EOMONTH(tblData[[#This Row],[PÄIVÄMÄÄRÄ]],-1)+1,tblData[PÄIVÄMÄÄRÄ],\"<=\"&EOMONTH(tblData[[#This Row],[PÄIVÄMÄÄRÄ]],0))","v":{"v":21800,"d":"€21,800.00"}},{"$f":"SUMIFS(tblData[SUMMA],tblData[PÄIVÄMÄÄRÄ],\">=\"&DATE(YEAR(tblData[[#This Row],[PÄIVÄMÄÄRÄ]]),1,1),tblData[PÄIVÄMÄÄRÄ],\"<=\"&DATE(YEAR(tblData[[#This Row],[PÄIVÄMÄÄRÄ]]),12,31),tblData[NELJÄNNES],tblData[[#This Row],[NELJÄNNES]])","v":{"v":50800,"d":"€50,800.00"}},{"$f":"SUMIFS(tblData[SUMMA],tblData[PÄIVÄMÄÄRÄ],\">=\"&DATE(YEAR(tblData[[#This Row],[PÄIVÄMÄÄRÄ]]),1,1),tblData[PÄIVÄMÄÄRÄ],\"<=\"&DATE(YEAR(tblData[[#This Row],[PÄIVÄMÄÄRÄ]]),12,31))","v":{"v":143800,"d":"€143,800.00"}},{"$f":"IFERROR(TREND($L$6:INDEX($L:$L,ROW(),1),$K$6:INDEX($K:$K,ROW(),1),IF(MONTH(tblData[[#This Row],[PÄIVÄMÄÄRÄ]])=12,13,MONTH(tblData[[#This Row],[PÄIVÄMÄÄRÄ]])+1)),\"\")","v":{"v":28999.999999999996,"d":"€29,000.00"}},{"$f":"IFERROR(TREND($M$6:INDEX($M:$M,ROW(),1),$I$6:INDEX($I:$I,ROW(),1),IF(tblData[[#This Row],[NELJÄNNES]]=4,5,tblData[[#This Row],[NELJÄNNES]]+1)),\"\")","v":{"v":50800,"d":"€50,800.00"}},{"$f":"IFERROR(TREND($N$6:INDEX($N:$N,ROW(),1),$J$6:INDEX($J:$J,ROW(),1),tblData[[#This Row],[VUOSI]]+1),\"\")","v":{"v":143800,"d":"€143,800.00"}}]
[null,{"$f":"40678+(365*2)","v":"2013-05-14"},"Proosapojat Oy",{"v":5400,"d":"€5,400.00"},{"v":5500,"d":"€5,500.00"},{"v":4500,"d":"€4,500.00"},{"$f":"tblData[[#This Row],[SUMMA]]-tblData[[#This Row],[KULUT]]","v":{"v":900,"d":"€900.00"}},{"$f":"DATE(YEAR('Tietojen tallentaminen'!$B9),MONTH('Tietojen tallentaminen'!$B9),1)","v":"2013-05-01"},{"$f":"LOOKUP(MONTH('Tietojen tallentaminen'!$H9),{1,1;2,1;3,1;4,2;5,2;6,2;7,3;8,3;9,3;10,4;11,4;12,4})","v":{"v":2,"d":"2. neljännes"}},{"$f":"YEAR('Tietojen tallentaminen'!$B9)","v":2013},{"$f":"MONTH(tblData[[#This Row],[PÄIVÄMÄÄRÄ]])","v":5},{"$f":"SUMIFS(tblData[SUMMA],tblData[PÄIVÄMÄÄRÄ],\">=\"&EOMONTH(tblData[[#This Row],[PÄIVÄMÄÄRÄ]],-1)+1,tblData[PÄIVÄMÄÄRÄ],\"<=\"&EOMONTH(tblData[[#This Row],[PÄIVÄMÄÄRÄ]],0))","v":{"v":21800,"d":"€21,800.00"}},{"$f":"SUMIFS(tblData[SUMMA],tblData[PÄIVÄMÄÄRÄ],\">=\"&DATE(YEAR(tblData[[#This Row],[PÄIVÄMÄÄRÄ]]),1,1),tblData[PÄIVÄMÄÄRÄ],\"<=\"&DATE(YEAR(tblData[[#This Row],[PÄIVÄMÄÄRÄ]]),12,31),tblData[NELJÄNNES],tblData[[#This Row],[NELJÄNNES]])","v":{"v":50800,"d":"€50,800.00"}},{"$f":"SUMIFS(tblData[SUMMA],tblData[PÄIVÄMÄÄRÄ],\">=\"&DATE(YEAR(tblData[[#This Row],[PÄIVÄMÄÄRÄ]]),1,1),tblData[PÄIVÄMÄÄRÄ],\"<=\"&DATE(YEAR(tblData[[#This Row],[PÄIVÄMÄÄRÄ]]),12,31))","v":{"v":143800,"d":"€143,800.00"}},{"$f":"IFERROR(TREND($L$6:INDEX($L:$L,ROW(),1),$K$6:INDEX($K:$K,ROW(),1),IF(MONTH(tblData[[#This Row],[PÄIVÄMÄÄRÄ]])=12,13,MONTH(tblData[[#This Row],[PÄIVÄMÄÄRÄ]])+1)),\"\")","v":{"v":29000,"d":"€29,000.00"}},{"$f":"IFERROR(TREND($M$6:INDEX($M:$M,ROW(),1),$I$6:INDEX($I:$I,ROW(),1),IF(tblData[[#This Row],[NELJÄNNES]]=4,5,tblData[[#This Row],[NELJÄNNES]]+1)),\"\")","v":{"v":50800,"d":"€50,800.00"}},{"$f":"IFERROR(TREND($N$6:INDEX($N:$N,ROW(),1),$J$6:INDEX($J:$J,ROW(),1),tblData[[#This Row],[VUOSI]]+1),\"\")","v":{"v":143800,"d":"€143,800.00"}}]
[null,{"$f":"40678+(365*2)","v":"2013-05-14"},"Taideteollinen korkeakoulu",{"v":5800,"d":"€5,800.00"},{"v":6000,"d":"€6,000.00"},{"v":4500,"d":"€4,500.00"},{"$f":"tblData[[#This Row],[SUMMA]]-tblData[[#This Row],[KULUT]]","v":{"v":1300,"d":"€1,300.00"}},{"$f":"DATE(YEAR('Tietojen tallentaminen'!$B10),MONTH('Tietojen tallentaminen'!$B10),1)","v":"2013-05-01"},{"$f":"LOOKUP(MONTH('Tietojen tallentaminen'!$H10),{1,1;2,1;3,1;4,2;5,2;6,2;7,3;8,3;9,3;10,4;11,4;12,4})","v":{"v":2,"d":"2. neljännes"}},{"$f":"YEAR('Tietojen tallentaminen'!$B10)","v":2013},{"$f":"MONTH(tblData[[#This Row],[PÄIVÄMÄÄRÄ]])","v":5},{"$f":"SUMIFS(tblData[SUMMA],tblData[PÄIVÄMÄÄRÄ],\">=\"&EOMONTH(tblData[[#This Row],[PÄIVÄMÄÄRÄ]],-1)+1,tblData[PÄIVÄMÄÄRÄ],\"<=\"&EOMONTH(tblData[[#This Row],[PÄIVÄMÄÄRÄ]],0))","v":{"v":21800,"d":"€21,800.00"}},{"$f":"SUMIFS(tblData[SUMMA],tblData[PÄIVÄMÄÄRÄ],\">=\"&DATE(YEAR(tblData[[#This Row],[PÄIVÄMÄÄRÄ]]),1,1),tblData[PÄIVÄMÄÄRÄ],\"<=\"&DATE(YEAR(tblData[[#This Row],[PÄIVÄMÄÄRÄ]]),12,31),tblData[NELJÄNNES],tblData[[#This Row],[NELJÄNNES]])","v":{"v":50800,"d":"€50,800.00"}},{"$f":"SUMIFS(tblData[SUMMA],tblData[PÄIVÄMÄÄRÄ],\">=\"&DATE(YEAR(tblData[[#This Row],[PÄIVÄMÄÄRÄ]]),1,1),tblData[PÄIVÄMÄÄRÄ],\"<=\"&DATE(YEAR(tblData[[#This Row],[PÄIVÄMÄÄRÄ]]),12,31))","v":{"v":143800,"d":"€143,800.00"}},{"$f":"IFERROR(TREND($L$6:INDEX($L:$L,ROW(),1),$K$6:INDEX($K:$K,ROW(),1),IF(MONTH(tblData[[#This Row],[PÄIVÄMÄÄRÄ]])=12,13,MONTH(tblData[[#This Row],[PÄIVÄMÄÄRÄ]])+1)),\"\")","v":{"v":29000,"d":"€29,000.00"}},{"$f":"IFERROR(TREND($M$6:INDEX($M:$M,ROW(),1),$I$6:INDEX($I:$I,ROW(),1),IF(tblData[[#This Row],[NELJÄNNES]]=4,5,tblData[[#This Row],[NELJÄNNES]]+1)),\"\")","v":{"v":50800,"d":"€50,800.00"}},{"$f":"IFERROR(TREND($N$6:INDEX($N:$N,ROW(),1),$J$6:INDEX($J:$J,ROW(),1),tblData[[#This Row],[VUOSI]]+1),\"\")","v":{"v":143800,"d":"€143,800.00"}}]
[null,{"$f":"40693+(365*2)","v":"2013-05-29"},"Trey Research",{"v":6200,"d":"€6,200.00"},{"v":6000,"d":"€6,000.00"},{"v":4500,"d":"€4,500.00"},{"$f":"tblData[[#This Row],[SUMMA]]-tblData[[#This Row],[KULUT]]","v":{"v":1700,"d":"€1,700.00"}},{"$f":"DATE(YEAR('Tietojen tallentaminen'!$B11),MONTH('Tietojen tallentaminen'!$B11),1)","v":"2013-05-01"},{"$f":"LOOKUP(MONTH('Tietojen tallentaminen'!$H11),{1,1;2,1;3,1;4,2;5,2;6,2;7,3;8,3;9,3;10,4;11,4;12,4})","v":{"v":2,"d":"2. neljännes"}},{"$f":"YEAR('Tietojen tallentaminen'!$B11)","v":2013},{"$f":"MONTH(tblData[[#This Row],[PÄIVÄMÄÄRÄ]])","v":5},{"$f":"SUMIFS(tblData[SUMMA],tblData[PÄIVÄMÄÄRÄ],\">=\"&EOMONTH(tblData[[#This Row],[PÄIVÄMÄÄRÄ]],-1)+1,tblData[PÄIVÄMÄÄRÄ],\"<=\"&EOMONTH(tblData[[#This Row],[PÄIVÄMÄÄRÄ]],0))","v":{"v":21800,"d":"€21,800.00"}},{"$f":"SUMIFS(tblData[SUMMA],tblData[PÄIVÄMÄÄRÄ],\">=\"&DATE(YEAR(tblData[[#This Row],[PÄIVÄMÄÄRÄ]]),1,1),tblData[PÄIVÄMÄÄRÄ],\"<=\"&DATE(YEAR(tblData[[#This Row],[PÄIVÄMÄÄRÄ]]),12,31),tblData[NELJÄNNES],tblData[[#This Row],[NELJÄNNES]])","v":{"v":50800,"d":"€50,800.00"}},{"$f":"SUMIFS(tblData[SUMMA],tblData[PÄIVÄMÄÄRÄ],\">=\"&DATE(YEAR(tblData[[#This Row],[PÄIVÄMÄÄRÄ]]),1,1),tblData[PÄIVÄMÄÄRÄ],\"<=\"&DATE(YEAR(tblData[[#This Row],[PÄIVÄMÄÄRÄ]]),12,31))","v":{"v":143800,"d":"€143,800.00"}},{"$f":"IFERROR(TREND($L$6:INDEX($L:$L,ROW(),1),$K$6:INDEX($K:$K,ROW(),1),IF(MONTH(tblData[[#This Row],[PÄIVÄMÄÄRÄ]])=12,13,MONTH(tblData[[#This Row],[PÄIVÄMÄÄRÄ]])+1)),\"\")","v":{"v":29000,"d":"€29,000.00"}},{"$f":"IFERROR(TREND($M$6:INDEX($M:$M,ROW(),1),$I$6:INDEX($I:$I,ROW(),1),IF(tblData[[#This Row],[NELJÄNNES]]=4,5,tblData[[#This Row],[NELJÄNNES]]+1)),\"\")","v":{"v":50800,"d":"€50,800.00"}},{"$f":"IFERROR(TREND($N$6:INDEX($N:$N,ROW(),1),$J$6:INDEX($J:$J,ROW(),1),tblData[[#This Row],[VUOSI]]+1),\"\")","v":{"v":143800,"d":"€143,800.00"}}]
[null,{"$f":"40705+(365*2)","v":"2013-06-10"},"A. Datum-yritys",{"v":6900,"d":"€6,900.00"},{"v":7500,"d":"€7,500.00"},{"v":5400,"d":"€5,400.00"},{"$f":"tblData[[#This Row],[SUMMA]]-tblData[[#This Row],[KULUT]]","v":{"v":1500,"d":"€1,500.00"}},{"$f":"DATE(YEAR('Tietojen tallentaminen'!$B12),MONTH('Tietojen tallentaminen'!$B12),1)","v":"2013-06-01"},{"$f":"LOOKUP(MONTH('Tietojen tallentaminen'!$H12),{1,1;2,1;3,1;4,2;5,2;6,2;7,3;8,3;9,3;10,4;11,4;12,4})","v":{"v":2,"d":"2. neljännes"}},{"$f":"YEAR('Tietojen tallentaminen'!$B12)","v":2013},{"$f":"MONTH(tblData[[#This Row],[PÄIVÄMÄÄRÄ]])","v":6},{"$f":"SUMIFS(tblData[SUMMA],tblData[PÄIVÄMÄÄRÄ],\">=\"&EOMONTH(tblData[[#This Row],[PÄIVÄMÄÄRÄ]],-1)+1,tblData[PÄIVÄMÄÄRÄ],\"<=\"&EOMONTH(tblData[[#This Row],[PÄIVÄMÄÄRÄ]],0))","v":{"v":14400,"d":"€14,400.00"}},{"$f":"SUMIFS(tblData[SUMMA],tblData[PÄIVÄMÄÄRÄ],\">=\"&DATE(YEAR(tblData[[#This Row],[PÄIVÄMÄÄRÄ]]),1,1),tblData[PÄIVÄMÄÄRÄ],\"<=\"&DATE(YEAR(tblData[[#This Row],[PÄIVÄMÄÄRÄ]]),12,31),tblData[NELJÄNNES],tblData[[#This Row],[NELJÄNNES]])","v":{"v":50800,"d":"€50,800.00"}},{"$f":"SUMIFS(tblData[SUMMA],tblData[PÄIVÄMÄÄRÄ],\">=\"&DATE(YEAR(tblData[[#This Row],[PÄIVÄMÄÄRÄ]]),1,1),tblData[PÄIVÄMÄÄRÄ],\"<=\"&DATE(YEAR(tblData[[#This Row],[PÄIVÄMÄÄRÄ]]),12,31))","v":{"v":143800,"d":"€143,800.00"}},{"$f":"IFERROR(TREND($L$6:INDEX($L:$L,ROW(),1),$K$6:INDEX($K:$K,ROW(),1),IF(MONTH(tblData[[#This Row],[PÄIVÄMÄÄRÄ]])=12,13,MONTH(tblData[[#This Row],[PÄIVÄMÄÄRÄ]])+1)),\"\")","v":{"v":21600.000000000004,"d":"€21,600.00"}},{"$f":"IFERROR(TREND($M$6:INDEX($M:$M,ROW(),1),$I$6:INDEX($I:$I,ROW(),1),IF(tblData[[#This Row],[NELJÄNNES]]=4,5,tblData[[#This Row],[NELJÄNNES]]+1)),\"\")","v":{"v":50800,"d":"€50,800.00"}},{"$f":"IFERROR(TREND($N$6:INDEX($N:$N,ROW(),1),$J$6:INDEX($J:$J,ROW(),1),tblData[[#This Row],[VUOSI]]+1),\"\")","v":{"v":143800,"d":"€143,800.00"}}]
[null,{"$f":"40716+(365*2)","v":"2013-06-21"},"Contoso Pharmaceuticals",{"v":7500,"d":"€7,500.00"},{"v":7200,"d":"€7,200.00"},{"v":6500,"d":"€6,500.00"},{"$f":"tblData[[#This Row],[SUMMA]]-tblData[[#This Row],[KULUT]]","v":{"v":1000,"d":"€1,000.00"}},{"$f":"DATE(YEAR('Tietojen tallentaminen'!$B13),MONTH('Tietojen tallentaminen'!$B13),1)","v":"2013-06-01"},{"$f":"LOOKUP(MONTH('Tietojen tallentaminen'!$H13),{1,1;2,1;3,1;4,2;5,2;6,2;7,3;8,3;9,3;10,4;11,4;12,4})","v":{"v":2,"d":"2. neljännes"}},{"$f":"YEAR('Tietojen tallentaminen'!$B13)","v":2013},{"$f":"MONTH(tblData[[#This Row],[PÄIVÄMÄÄRÄ]])","v":6},{"$f":"SUMIFS(tblData[SUMMA],tblData[PÄIVÄMÄÄRÄ],\">=\"&EOMONTH(tblData[[#This Row],[PÄIVÄMÄÄRÄ]],-1)+1,tblData[PÄIVÄMÄÄRÄ],\"<=\"&EOMONTH(tblData[[#This Row],[PÄIVÄMÄÄRÄ]],0))","v":{"v":14400,"d":"€14,400.00"}},{"$f":"SUMIFS(tblData[SUMMA],tblData[PÄIVÄMÄÄRÄ],\">=\"&DATE(YEAR(tblData[[#This Row],[PÄIVÄMÄÄRÄ]]),1,1),tblData[PÄIVÄMÄÄRÄ],\"<=\"&DATE(YEAR(tblData[[#This Row],[PÄIVÄMÄÄRÄ]]),12,31),tblData[NELJÄNNES],tblData[[#This Row],[NELJÄNNES]])","v":{"v":50800,"d":"€50,800.00"}},{"$f":"SUMIFS(tblData[SUMMA],tblData[PÄIVÄMÄÄRÄ],\">=\"&DATE(YEAR(tblData[[#This Row],[PÄIVÄMÄÄRÄ]]),1,1),tblData[PÄIVÄMÄÄRÄ],\"<=\"&DATE(YEAR(tblData[[#This Row],[PÄIVÄMÄÄRÄ]]),12,31))","v":{"v":143800,"d":"€143,800.00"}},{"$f":"IFERROR(TREND($L$6:INDEX($L:$L,ROW(),1),$K$6:INDEX($K:$K,ROW(),1),IF(MONTH(tblData[[#This Row],[PÄIVÄMÄÄRÄ]])=12,13,MONTH(tblData[[#This Row],[PÄIVÄMÄÄRÄ]])+1)),\"\")","v":{"v":17950,"d":"€17,950.00"}},{"$f":"IFERROR(TREND($M$6:INDEX($M:$M,ROW(),1),$I$6:INDEX($I:$I,ROW(),1),IF(tblData[[#This Row],[NELJÄNNES]]=4,5,tblData[[#This Row],[NELJÄNNES]]+1)),\"\")","v":{"v":50800,"d":"€50,800.00"}},{"$f":"IFERROR(TREND($N$6:INDEX($N:$N,ROW(),1),$J$6:INDEX($J:$J,ROW(),1),tblData[[#This Row],[VUOSI]]+1),\"\")","v":{"v":143800,"d":"€143,800.00"}}]
[null,{"$f":"40731+(365*2)","v":"2013-07-06"},"Consolidated Messenger",{"v":8700,"d":"€8,700.00"},{"v":8500,"d":"€8,500.00"},{"v":7250,"d":"€7,250.00"},{"$f":"tblData[[#This Row],[SUMMA]]-tblData[[#This Row],[KULUT]]","v":{"v":1450,"d":"€1,450.00"}},{"$f":"DATE(YEAR('Tietojen tallentaminen'!$B14),MONTH('Tietojen tallentaminen'!$B14),1)","v":"2013-07-01"},{"$f":"LOOKUP(MONTH('Tietojen tallentaminen'!$H14),{1,1;2,1;3,1;4,2;5,2;6,2;7,3;8,3;9,3;10,4;11,4;12,4})","v":{"v":3,"d":"3. neljännes"}},{"$f":"YEAR('Tietojen tallentaminen'!$B14)","v":2013},{"$f":"MONTH(tblData[[#This Row],[PÄIVÄMÄÄRÄ]])","v":7},{"$f":"SUMIFS(tblData[SUMMA],tblData[PÄIVÄMÄÄRÄ],\">=\"&EOMONTH(tblData[[#This Row],[PÄIVÄMÄÄRÄ]],-1)+1,tblData[PÄIVÄMÄÄRÄ],\"<=\"&EOMONTH(tblData[[#This Row],[PÄIVÄMÄÄRÄ]],0))","v":{"v":8700,"d":"€8,700.00"}},{"$f":"SUMIFS(tblData[SUMMA],tblData[PÄIVÄMÄÄRÄ],\">=\"&DATE(YEAR(tblData[[#This Row],[PÄIVÄMÄÄRÄ]]),1,1),tblData[PÄIVÄMÄÄRÄ],\"<=\"&DATE(YEAR(tblData[[#This Row],[PÄIVÄMÄÄRÄ]]),12,31),tblData[NELJÄNNES],tblData[[#This Row],[NELJÄNNES]])","v":{"v":49100,"d":"€49,100.00"}},{"$f":"SUMIFS(tblData[SUMMA],tblData[PÄIVÄMÄÄRÄ],\">=\"&DATE(YEAR(tblData[[#This Row],[PÄIVÄMÄÄRÄ]]),1,1),tblData[PÄIVÄMÄÄRÄ],\"<=\"&DATE(YEAR(tblData[[#This Row],[PÄIVÄMÄÄRÄ]]),12,31))","v":{"v":143800,"d":"€143,800.00"}},{"$f":"IFERROR(TREND($L$6:INDEX($L:$L,ROW(),1),$K$6:INDEX($K:$K,ROW(),1),IF(MONTH(tblData[[#This Row],[PÄIVÄMÄÄRÄ]])=12,13,MONTH(tblData[[#This Row],[PÄIVÄMÄÄRÄ]])+1)),\"\")","v":{"v":10776.470588235294,"d":"€10,776.47"}},{"$f":"IFERROR(TREND($M$6:INDEX($M:$M,ROW(),1),$I$6:INDEX($I:$I,ROW(),1),IF(tblData[[#This Row],[NELJÄNNES]]=4,5,tblData[[#This Row],[NELJÄNNES]]+1)),\"\")","v":{"v":47400,"d":"€47,400.00"}},{"$f":"IFERROR(TREND($N$6:INDEX($N:$N,ROW(),1),$J$6:INDEX($J:$J,ROW(),1),tblData[[#This Row],[VUOSI]]+1),\"\")","v":{"v":143800,"d":"€143,800.00"}}]
[null,{"$f":"40761+(365*2)","v":"2013-08-05"},"Proosapojat Oy",{"v":8500,"d":"€8,500.00"},{"v":8300,"d":"€8,300.00"},{"v":7100,"d":"€7,100.00"},{"$f":"tblData[[#This Row],[SUMMA]]-tblData[[#This Row],[KULUT]]","v":{"v":1400,"d":"€1,400.00"}},{"$f":"DATE(YEAR('Tietojen tallentaminen'!$B15),MONTH('Tietojen tallentaminen'!$B15),1)","v":"2013-08-01"},{"$f":"LOOKUP(MONTH('Tietojen tallentaminen'!$H15),{1,1;2,1;3,1;4,2;5,2;6,2;7,3;8,3;9,3;10,4;11,4;12,4})","v":{"v":3,"d":"3. neljännes"}},{"$f":"YEAR('Tietojen tallentaminen'!$B15)","v":2013},{"$f":"MONTH(tblData[[#This Row],[PÄIVÄMÄÄRÄ]])","v":8},{"$f":"SUMIFS(tblData[SUMMA],tblData[PÄIVÄMÄÄRÄ],\">=\"&EOMONTH(tblData[[#This Row],[PÄIVÄMÄÄRÄ]],-1)+1,tblData[PÄIVÄMÄÄRÄ],\"<=\"&EOMONTH(tblData[[#This Row],[PÄIVÄMÄÄRÄ]],0))","v":{"v":16400,"d":"€16,400.00"}},{"$f":"SUMIFS(tblData[SUMMA],tblData[PÄIVÄMÄÄRÄ],\">=\"&DATE(YEAR(tblData[[#This Row],[PÄIVÄMÄÄRÄ]]),1,1),tblData[PÄIVÄMÄÄRÄ],\"<=\"&DATE(YEAR(tblData[[#This Row],[PÄIVÄMÄÄRÄ]]),12,31),tblData[NELJÄNNES],tblData[[#This Row],[NELJÄNNES]])","v":{"v":49100,"d":"€49,100.00"}},{"$f":"SUMIFS(tblData[SUMMA],tblData[PÄIVÄMÄÄRÄ],\">=\"&DATE(YEAR(tblData[[#This Row],[PÄIVÄMÄÄRÄ]]),1,1),tblData[PÄIVÄMÄÄRÄ],\"<=\"&DATE(YEAR(tblData[[#This Row],[PÄIVÄMÄÄRÄ]]),12,31))","v":{"v":143800,"d":"€143,800.00"}},{"$f":"IFERROR(TREND($L$6:INDEX($L:$L,ROW(),1),$K$6:INDEX($K:$K,ROW(),1),IF(MONTH(tblData[[#This Row],[PÄIVÄMÄÄRÄ]])=12,13,MONTH(tblData[[#This Row],[PÄIVÄMÄÄRÄ]])+1)),\"\")","v":{"v":12455.862068965516,"d":"€12,455.86"}},{"$f":"IFERROR(TREND($M$6:INDEX($M:$M,ROW(),1),$I$6:INDEX($I:$I,ROW(),1),IF(tblData[[#This Row],[NELJÄNNES]]=4,5,tblData[[#This Row],[NELJÄNNES]]+1)),\"\")","v":{"v":47400,"d":"€47,400.00"}},{"$f":"IFERROR(TREND($N$6:INDEX($N:$N,ROW(),1),$J$6:INDEX($J:$J,ROW(),1),tblData[[#This Row],[VUOSI]]+1),\"\")","v":{"v":143800,"d":"€143,800.00"}}]
{"$rows_left_out":10}
{"sheet":"Myyntiraportti","index":1,"n_rows":28,"n_cols":6,"rows_kept":28}
[]
[null,"KUUKAUSITTAIN MYYNTIRAPORTTI"]
[]
[]
[null,"VUOSI","NELJÄNNES","KUUKAUSI","YRITYS","Summa  / SUMMA"]
[null,2013,{"v":2,"d":"2. neljännes"},"2013-04-01","Contoso Pharmaceuticals",8200]
[{"$nulls":4},"A. Datum-yritys",6400]
[{"$nulls":3},"2013-05-01","Consolidated Messenger",4400]
[{"$nulls":4},"Trey Research",6200]
[{"$nulls":4},"Proosapojat Oy",5400]
[{"$nulls":4},"Taideteollinen korkeakoulu",5800]
[{"$nulls":3},"2013-06-01","Contoso Pharmaceuticals",7500]
[{"$nulls":4},"A. Datum-yritys",6900]
[null,null,"2. neljännes Summa",null,null,50800]
[null,null,{"v":3,"d":"3. neljännes"},"2013-07-01","Consolidated Messenger",8700]
{"$rows_left_out":14}
{"sheet":"Myyntiennuste","index":2,"n_rows":43,"n_cols":10,"rows_kept":43}
[]
[null,"KUUKAUSITTAIN MYYNTIENNUSTE"]
[null,{"$f":"\"PÄIVÄMÄÄRÄ TÄNÄÄN: \"&UPPER(TEXT(TODAY(),\"p kkk, vvvv\"))","v":"PÄIVÄMÄÄRÄ TÄNÄÄN: P KKK, VVVV"},null,{"$f":"--TRIM(RIGHT(B3,LEN(B3)-FIND(\":\",B3)))","v":{"$error":"#VALUE!"}}]
[]
[null,"NYKYINEN KUUKAUSI","TODELLINEN","SUUNNITELTU","VARIANSSI","%","TOTEUTUNUT VUODEN ALUSTA","SUUNNITELTU VUODEN ALUSTA","VARIANSSI VUODEN ALUSTA","% VUODEN ALUSTA"]
[null,"Määrä",{"$f":"COUNTIF('Tietojen tallentaminen'!$B$6:$B$24,\">=\"&DATE(fYear,MONTH(fDate),1))-COUNTIF('Tietojen tallentaminen'!$B$6:$B$24,\">\"&EOMONTH(fDate,0))","v":0},{"$nulls":3},{"$f":"COUNTIF(tblData[PÄIVÄMÄÄRÄ],\"<=\"&EOMONTH(fDate,0))","v":0}]
[null,"Myynti",{"$f":"SUMIF(tblData[PÄIVÄMÄÄRÄ],\">=\"&DATE(fYear,MONTH(fDate),1),tblData[SUMMA])-SUMIF(tblData[PÄIVÄMÄÄRÄ],\">\"&EOMONTH(fDate,0),tblData[SUMMA])","v":{"v":0,"d":"€0.00"}},{"$f":"SUMIF('Tietojen tallentaminen'!$B$6:$B$24,\">=\"&DATE(fYear,MONTH(fDate),1),'Tietojen tallentaminen'!$E$6:$E$24)-SUMIF('Tietojen tallentaminen'!$B$6:$B$24,\">\"&EOMONTH(fDate,0),'Tietojen tallentaminen'!$E$6:$E$24)","v":{"v":0,"d":"€0.00"}},{"$f":"D7-C7","v":{"v":0,"d":"€0.00"}},{"$f":"IFERROR(D7/C7,\"-\")","v":"-"},{"$f":"SUMIF(tblData[PÄIVÄMÄÄRÄ],\"<=\"&EOMONTH(fDate,0),tblData[SUMMA])","v":{"v":0,"d":"€0.00"}},{"$f":"SUMIF(tblData[PÄIVÄMÄÄRÄ],\"<=\"&EOMONTH(fDate,0),tblData[SUUNNITELTU])","v":{"v":0,"d":"€0.00"}},{"$f":"H7-G7","v":{"v":0,"d":"€0.00"}},{"$f":"IFERROR(H7/G7,\"\")","v":""}]
[null,"Tuotot",{"$f":"(SUMIF(tblData[PÄIVÄMÄÄRÄ],\">=\"&DATE(fYear,MONTH(fDate),1),tblData[SUMMA])-SUMIF(tblData[PÄIVÄMÄÄRÄ],\">\"&EOMONTH(fDate,0),tblData[SUMMA]))-(SUMIF(tblData[PÄIVÄMÄÄRÄ],\">=\"&DATE(fYear,MONTH(fDate),1),tblData[KULUT])-SUMIF(tblData[PÄIVÄMÄÄRÄ],\">\"&EOMONTH(fDate,0),tblData[KULUT]))","v":{"v":0,"d":"€0.00"}},{"$f":"(SUMIF('Tietojen tallentaminen'!$B$6:$B$24,\">=\"&DATE(fYear,MONTH(fDate),1),'Tietojen tallentaminen'!$E$6:$E$24)-SUMIF('Tietojen tallentaminen'!$B$6:$B$24,\">\"&EOMONTH(fDate,0),'Tietojen tallentaminen'!$E$6:$E$24))-(SUMIF('Tietojen tallentaminen'!$B$6:$B$24,\">=\"&DATE(fYear,MONTH(fDate),1),'Tietojen tallentaminen'!$F$6:$F$24)-SUMIF('Tietojen tallentaminen'!$B$6:$B$24,\">\"&EOMONTH(fDate,0),'Tietojen tallentaminen'!$F$6:$F$24))","v":{"v":0,"d":"€0.00"}},{"$f":"D8-C8","v":{"v":0,"d":"€0.00"}},{"$f":"IFERROR(D8/C8,\"-\")","v":"-"},{"$f":"SUMIF('Tietojen tallentaminen'!$B$6:$B$24,\"<=\"&EOMONTH(fDate,0),'Tietojen tallentaminen'!$F$6:$F$24)","v":{"v":0,"d":"€0.00"}},{"$f":"SUMIF(tblData[PÄIVÄMÄÄRÄ],\"<=\"&EOMONTH(fDate,0),tblData[KULUT])","v":{"v":0,"d":"€0.00"}},{"$f":"H8-G8","v":{"v":0,"d":"€0.00"}},{"$f":"IFERROR(H8/G8,\"\")","v":""}]
[null,"Reunus",{"$f":"IFERROR(C8/C7,\"-\")","v":"-"},{"$f":"IFERROR(D8/D7,\"-\")","v":"-"},null,{"$f":"IFERROR(F8/F7,\"-\")","v":"-"},{"$f":"IFERROR(G8/G7,\"\")","v":""},{"$f":"IFERROR(H8/H7,\"\")","v":""},null,{"$f":"IFERROR(J8/J7,\"\")","v":""}]
[null,"Tilausten määrä",{"$f":"COUNTIF(tblData[PÄIVÄMÄÄRÄ],\">=\"&DATE(fYear,MONTH(fDate),1))-COUNTIF(tblData[PÄIVÄMÄÄRÄ],\">\"&EOMONTH(fDate,0))","v":0},{"$nulls":3},{"$f":"COUNTIF(tblData[PÄIVÄMÄÄRÄ],\">\"&EOMONTH(fDate,0))","v":0}]
[null,"Keskimääräinen tilauksen arvo",{"$f":"IFERROR(C7/C10,\"-\")","v":"-"},{"$nulls":3},{"$f":"IFERROR(G7/G10,\"-\")","v":"-"}]
[]
[null,"ENNUSTE",null,"SEURAAVA KUUKAUSI",null,"SEURAAVA NELJÄNNES",null,null,"SEURAAVA VUOSI"]
[null,"Myynti",null,{"$f":"TREND(tblData[[KUUKAUSI ]],tblData[KUUKAUDEN NUMERO (PIILOTA)],IF(MONTH(fDate)=12,13,MONTH(fDate)+1))","v":{"$error":"#VALUE!"}},null,{"$f":"TREND(tblData[[NELJÄNNES ]],tblData[KUUKAUDEN NUMERO (PIILOTA)],IF(MONTH(fDate)=12,13,MONTH(fDate)+1))","v":{"$error":"#VALUE!"}},null,null,{"$f":"TREND(tblData[[VUOSITTAIN ]],tblData[KUUKAUDEN NUMERO (PIILOTA)],IF(MONTH(fDate)=12,13,MONTH(fDate)+1))","v":{"$error":"#VALUE!"}}]
[]
{"$rows_left_out":10}