{"text_format":"3","workbook":"xlsx","n_sheets":9,"sheets":["Yhteenveto","Aine 1","Aine 2","Aine 3","Aine 4","Aine 5","Aine 6","Aine 7","Keskiarvotaulukko"],"not_rendered":{"defined_names":9},"read":"whole","date_system":"1900"}

{"sheet":"Yhteenveto","index":0,"n_rows":12,"n_cols":7,"rows_kept":12,"merged":[[1,1,1,2]]}
[]
[null,"Koulun nimi",null,"  Oma nimi:",null," Lukukausi:"]
[]
[null,"Aineet","Tunteja","Prosentteina","Arvosana","Keskiarvo","Painotettu keskiarvo"]
[null,"Aine 1",{"v":3,"d":"3.0"},{"$f":"'Aine 1'!D$36","v":{"v":0.8661764705882354,"d":"86.62%"}},{"$f":"IF(D5<>\"\",HLOOKUP(D5,Keskiarvotaulukko!$C$5:$O$7,2),\"\")","v":"B"},{"$f":"IF(D5<>\"\",HLOOKUP(D5,Keskiarvotaulukko!$C$5:$O$7,3),\"\")","v":{"v":3,"d":"3.00"}},{"$f":"IF(F5<>\"\",F5*C5/(SUM($C$5:$C$11)), \"\")","v":{"v":0.5625,"d":"0.56"}}]
[null,"Aine 2",{"v":4,"d":"4.0"},{"$f":"'Aine 2'!D$36","v":""},{"$f":"IF(D6<>\"\",HLOOKUP(D6,Keskiarvotaulukko!$C$5:$O$7,2),\"\")","v":""},{"$f":"IF(D6<>\"\",HLOOKUP(D6,Keskiarvotaulukko!$C$5:$O$7,3),\"\")","v":""},""]
[null,"Aine 3",{"v":2,"d":"2.0"},{"$f":"'Aine 3'!D$36","v":""},{"$f":"IF(D7<>\"\",HLOOKUP(D7,Keskiarvotaulukko!$C$5:$O$7,2),\"\")","v":""},{"$f":"IF(D7<>\"\",HLOOKUP(D7,Keskiarvotaulukko!$C$5:$O$7,3),\"\")","v":""},""]
[null,"Aine 4",{"v":4,"d":"4.0"},{"$f":"'Aine 4'!D$36","v":""},{"$f":"IF(D8<>\"\",HLOOKUP(D8,Keskiarvotaulukko!$C$5:$O$7,2),\"\")","v":""},{"$f":"IF(D8<>\"\",HLOOKUP(D8,Keskiarvotaulukko!$C$5:$O$7,3),\"\")","v":""},""]
[null,"Aine 5",{"v":1,"d":"1.0"},{"$f":"'Aine 5'!D$36","v":""},{"$f":"IF(D9<>\"\",HLOOKUP(D9,Keskiarvotaulukko!$C$5:$O$7,2),\"\")","v":""},{"$f":"IF(D9<>\"\",HLOOKUP(D9,Keskiarvotaulukko!$C$5:$O$7,3),\"\")","v":""},""]
[null,"Aine 6",{"v":1,"d":"1.0"},{"$f":"'Aine 6'!D$36","v":""},{"$f":"IF(D10<>\"\",HLOOKUP(D10,Keskiarvotaulukko!$C$5:$O$7,2),\"\")","v":""},{"$f":"IF(D10<>\"\",HLOOKUP(D10,Keskiarvotaulukko!$C$5:$O$7,3),\"\")","v":""},""]
[null,"Aine 7",{"v":1,"d":"1.0"},{"$f":"'Aine 7'!D$36","v":""},{"$f":"IF(D11<>\"\",HLOOKUP(D11,Keskiarvotaulukko!$C$5:$O$7,2),\"\")","v":""},{"$f":"IF(D11<>\"\",HLOOKUP(D11,Keskiarvotaulukko!$C$5:$O$7,3),\"\")","v":""},""]
[null,"Yhteensä",{"$f":"SUM(C5:C11)","v":16},{"$f":"AVERAGE(D5:D11)","v":{"v":0.8661764705882354,"d":"86.62%"}},{"$f":"IF(D12<>\"\",HLOOKUP(D12,Keskiarvotaulukko!$C$5:$O$7,2),\"\")","v":"B"},{"$f":"AVERAGE(F5:F11)","v":{"v":3,"d":"3.00"}},{"$f":"SUM(G5:G11)","v":{"v":0.5625,"d":"0.56"}}]

{"sheet":"Aine 1","index":1,"n_rows":38,"n_cols":8,"rows_kept":38,"merged":[[1,1,1,2]]}
[]
[null,{"$f":"Yhteenveto!B5","v":"Aine 1"}]
[null,"Opettaja:",null,null,"Prosenttiosuus täysistä pisteistä",null,null,{"$f":"IF(SUM($C$35:$H$35) <> 0,SUM($C$34:$H$34)/SUM($C$35:$H$35),\"\")","v":{"v":0.8661764705882354,"d":"86.62%"}}]
[null,"Sähköposti:",null,null,"Arvosana",null,null,{"$f":"SUM($C$34:$H$34)","v":{"v":0.1732352941176471,"d":"17.32%"}}]
[]
[null,"Tehtävät, projektit ja kokeet","Kotitehtävät","Esseet","Kuulustelut","Projektit","1. koe","2. koe"]
[null,"Painotus",{"v":0.1,"d":"10.0%"},{"v":0.1,"d":"10.0%"},{"v":0.15,"d":"15.0%"},{"v":0.15,"d":"15.0%"},{"v":0.2,"d":"20.0%"},{"v":0.3,"d":"30.0%"}]
[null,"1. kotitehtävä",{"v":0.882352941176471,"d":"0.88"}]
[null,"2. maailmansotaa käsittelevä essee",null,0.85]
{"$rows_empty":24}
[null,"Pistemäärä yhteensä",{"$f":"IF(COUNT(C8:C33) <> 0,AVERAGE(C8:C33) *C7, \"\")","v":{"v":0.0882352941176471,"d":"0.0882"}},{"v":0.085,"d":"0.0850"},"","","",""]
[null,"Paras mahdollinen pistemäärä",{"$f":"IF(COUNT(C8:C33)<>0,C7,\"\")","v":0.1},0.1,"","","",""]
[null,"Prosenttiosuus täysistä pisteistä",null,{"$f":"IF(SUM($C$35:$H$35) <> 0,SUM($C$34:$H$34)/SUM($C$35:$H$35),\"\")","v":{"v":0.8661764705882354,"d":"86.62%"}}]
[null,"Tulosten kirjoittaminen:","Kirjoita pistemäärä, jonka sait parhaasta mahdollisesta pistemäärästä (esimerkiksi 15/17)."]
[null,null,"Kirjoita tuloksesi prosentteina (esimerkiksi 85 %)."]

{"sheet":"Aine 2","index":2,"n_rows":38,"n_cols":8,"rows_kept":38,"merged":[[1,1,1,2]]}
[]
[null,{"$f":"Yhteenveto!B6","v":"Aine 2"}]
[null,"Opettaja:",null,null,"Prosenttiosuus täysistä pisteistä",null,null,{"$f":"IF(SUM($C$35:$H$35) <> 0,SUM($C$34:$H$34)/SUM($C$35:$H$35),\"\")","v":""}]
[null,"Sähköposti:",null,null,"Arvosana",null,null,{"$f":"SUM($C$34:$H$34)","v":{"v":0,"d":"0.00%"}}]
[]
[null,"Tehtävät, projektit ja kokeet","Kotitehtävät","Esseet","Kuulustelut","Projektit","1. koe","2. koe"]
[null,"Painotus",{"v":0.1,"d":"10.0%"},{"v":0.1,"d":"10.0%"},{"v":0.15,"d":"15.0%"},{"v":0.15,"d":"15.0%"},{"v":0.2,"d":"20.0%"},{"v":0.3,"d":"30.0%"}]
{"$rows_empty":26}
[null,"Pistemäärä yhteensä",{"$f":"IF(COUNT(C8:C33) <> 0,AVERAGE(C8:C33) *C7, \"\")","v":""},"","","","",""]
[null,"Paras mahdollinen pistemäärä",{"$f":"IF(COUNT(C8:C33)<>0,C7,\"\")","v":""},"","","","",""]
[null,"Prosenttiosuus täysistä pisteistä",null,{"$f":"IF(SUM($C$35:$H$35) <> 0,SUM($C$34:$H$34)/SUM($C$35:$H$35),\"\")","v":""}]
[null,"Tulosten kirjoittaminen:","Kirjoita pistemäärä, jonka sait parhaasta mahdollisesta pistemäärästä (esimerkiksi 15/17)."]
[null,null,"Kirjoita tuloksesi prosentteina (esimerkiksi 85 %)."]

{"sheet":"Aine 3","index":3,"n_rows":38,"n_cols":8,"rows_kept":38,"merged":[[1,1,1,2]]}
[]
[null,{"$f":"Yhteenveto!B7","v":"Aine 3"}]
[null,"Opettaja:",null,null,"Prosenttiosuus täysistä pisteistä",null,null,{"$f":"IF(SUM($C$35:$H$35) <> 0,SUM($C$34:$H$34)/SUM($C$35:$H$35),\"\")","v":""}]
[null,"Sähköposti:",null,null,"Arvosana",null,null,{"$f":"SUM($C$34:$H$34)","v":{"v":0,"d":"0.00%"}}]
[]
[null,"Tehtävät, projektit ja kokeet","Kotitehtävät","Esseet","Kuulustelut","Projektit","1. koe","2. koe"]
[null,"Painotus",{"v":0.1,"d":"10.0%"},{"v":0.1,"d":"10.0%"},{"v":0.15,"d":"15.0%"},{"v":0.15,"d":"15.0%"},{"v":0.2,"d":"20.0%"},{"v":0.3,"d":"30.0%"}]
{"$rows_empty":26}
[null,"Pistemäärä yhteensä",{"$f":"IF(COUNT(C8:C33) <> 0,AVERAGE(C8:C33) *C7, \"\")","v":""},"","","","",""]
[null,"Paras mahdollinen pistemäärä",{"$f":"IF(COUNT(C8:C33)<>0,C7,\"\")","v":""},"","","","",""]
[null,"Prosenttiosuus täysistä pisteistä",null,{"$f":"IF(SUM($C$35:$H$35) <> 0,SUM($C$34:$H$34)/SUM($C$35:$H$35),\"\")","v":""}]
[null,"Tulosten kirjoittaminen:","Kirjoita pistemäärä, jonka sait parhaasta mahdollisesta pistemäärästä (esimerkiksi 15/17)."]
[null,null,"Kirjoita tuloksesi prosentteina (esimerkiksi 85 %)."]

{"sheet":"Aine 4","index":4,"n_rows":38,"n_cols":8,"rows_kept":38,"merged":[[1,1,1,2]]}
[]
[null,{"$f":"Yhteenveto!B8","v":"Aine 4"}]
[null,"Opettaja:",null,null,"Prosenttiosuus täysistä pisteistä"]
[null,"Sähköposti:",null,null,"Arvosana",null,null,{"$f":"SUM($C$34:$H$34)","v":{"v":0,"d":"0.00%"}}]
[]
[null,"Tehtävät, projektit ja kokeet","Kotitehtävät","Esseet","Kuulustelut","Projektit","1. koe","2. koe"]
[null,"Painotus",{"v":0.1,"d":"10.0%"},{"v":0.1,"d":"10.0%"},{"v":0.15,"d":"15.0%"},{"v":0.15,"d":"15.0%"},{"v":0.2,"d":"20.0%"},{"v":0.3,"d":"30.0%"}]
{"$rows_empty":26}
[null,"Pistemäärä yhteensä",{"$f":"IF(COUNT(C8:C33) <> 0,AVERAGE(C8:C33) *C7, \"\")","v":""},"","","","",""]
[null,"Paras mahdollinen pistemäärä",{"$f":"IF(COUNT(C8:C33)<>0,C7,\"\")","v":""},"","","","",""]
[null,"Prosenttiosuus täysistä pisteistä",null,{"$f":"IF(SUM($C$35:$H$35) <> 0,SUM($C$34:$H$34)/SUM($C$35:$H$35),\"\")","v":""}]
[null,"Tulosten kirjoittaminen:","Kirjoita pistemäärä, jonka sait parhaasta mahdollisesta pistemäärästä (esimerkiksi 15/17)."]
[null,null,"Kirjoita tuloksesi prosentteina (esimerkiksi 85 %)."]

{"sheet":"Aine 5","index":5,"n_rows":38,"n_cols":8,"rows_kept":38,"merged":[[1,1,1,2]]}
[]
[null,{"$f":"Yhteenveto!B9","v":"Aine 5"}]
[null,"Opettaja:",null,null,"Prosenttiosuus täysistä pisteistä",null,null,{"$f":"IF(SUM($C$35:$H$35) <> 0,SUM($C$34:$H$34)/SUM($C$35:$H$35),\"\")","v":""}]
[null,"Sähköposti:",null,null,"Arvosana",null,null,{"$f":"SUM($C$34:$H$34)","v":{"v":0,"d":"0.00%"}}]
[]
[null,"Tehtävät, projektit ja kokeet","Kotitehtävät","Esseet","Kuulustelut","Projektit","1. koe","2. koe"]
[null,"Painotus",{"v":0.1,"d":"10.0%"},{"v":0.1,"d":"10.0%"},{"v":0.15,"d":"15.0%"},{"v":0.15,"d":"15.0%"},{"v":0.2,"d":"20.0%"},{"v":0.3,"d":"30.0%"}]
{"$rows_empty":26}
[null,"Pistemäärä yhteensä",{"$f":"IF(COUNT(C8:C33) <> 0,AVERAGE(C8:C33) *C7, \"\")","v":""},"","","","",""]
[null,"Paras mahdollinen pistemäärä",{"$f":"IF(COUNT(C8:C33)<>0,C7,\"\")","v":""},"","","","",""]
[null,"Prosenttiosuus täysistä pisteistä",null,{"$f":"IF(SUM($C$35:$H$35) <> 0,SUM($C$34:$H$34)/SUM($C$35:$H$35),\"\")","v":""}]
[null,"Tulosten kirjoittaminen:","Kirjoita pistemäärä, jonka sait parhaasta mahdollisesta pistemäärästä (esimerkiksi 15/17)."]
[null,null,"Kirjoita tuloksesi prosentteina (esimerkiksi 85 %)."]

{"sheet":"Aine 6","index":6,"n_rows":38,"n_cols":8,"rows_kept":38,"merged":[[1,1,1,2]]}
[]
[null,{"$f":"Yhteenveto!B10","v":"Aine 6"}]
[null,"Opettaja:",null,null,"Prosenttiosuus täysistä pisteistä",null,null,{"$f":"IF(SUM($C$35:$H$35) <> 0,SUM($C$34:$H$34)/SUM($C$35:$H$35),\"\")","v":""}]
[null,"Sähköposti:",null,null,"Arvosana",null,null,{"$f":"SUM($C$34:$H$34)","v":{"v":0,"d":"0.00%"}}]
[]
[null,"Tehtävät, projektit ja kokeet","Kotitehtävät","Esseet","Kuulustelut","Projektit","1. koe","2. koe"]
[null,"Painotus",{"v":0.1,"d":"10.0%"},{"v":0.1,"d":"10.0%"},{"v":0.15,"d":"15.0%"},{"v":0.15,"d":"15.0%"},{"v":0.2,"d":"20.0%"},{"v":0.3,"d":"30.0%"}]
{"$rows_empty":26}
[null,"Pistemäärä yhteensä",{"$f":"IF(COUNT(C8:C33) <> 0,AVERAGE(C8:C33) *C7, \"\")","v":""},"","","","",""]
[null,"Paras mahdollinen pistemäärä",{"$f":"IF(COUNT(C8:C33)<>0,C7,\"\")","v":""},"","","","",""]
[null,"Prosenttiosuus täysistä pisteistä",null,{"$f":"IF(SUM($C$35:$H$35) <> 0,SUM($C$34:$H$34)/SUM($C$35:$H$35),\"\")","v":""},{"$f":"IF(SUM($C$35:$H$35) <> 0,SUM($C$34:$H$34)/SUM($C$35:$H$35),\"\")","v":""}]
[null,"Tulosten kirjoittaminen:","Kirjoita pistemäärä, jonka sait parhaasta mahdollisesta pistemäärästä (esimerkiksi 15/17)."]
[null,null,"Kirjoita tuloksesi prosentteina (esimerkiksi 85 %)."]

{"sheet":"Aine 7","index":7,"n_rows":38,"n_cols":8,"rows_kept":38,"merged":[[1,1,1,2]]}
[]
[null,{"$f":"Yhteenveto!B11","v":"Aine 7"}]
[null,"Opettaja:",null,null,"Prosenttiosuus täysistä pisteistä",null,null,{"$f":"IF(SUM($C$35:$H$35) <> 0,SUM($C$34:$H$34)/SUM($C$35:$H$35),\"\")","v":""}]
[null,"Sähköposti:",null,null,"Arvosana",null,null,{"$f":"SUM($C$34:$H$34)","v":{"v":0,"d":"0.00%"}}]
[]
[null,"Tehtävät, projektit ja kokeet","Kotitehtävät","Esseet","Kuulustelut","Projektit","1. koe","2. koe"]
[null,"Painotus",{"v":0.1,"d":"10.0%"},{"v":0.1,"d":"10.0%"},{"v":0.15,"d":"15.0%"},{"v":0.15,"d":"15.0%"},{"v":0.2,"d":"20.0%"},{"v":0.3,"d":"30.0%"}]
{"$rows_empty":26}
[null,"Pistemäärä yhteensä",{"$f":"IF(COUNT(C8:C33) <> 0,AVERAGE(C8:C33) *C7, \"\")","v":""},"","","","",""]
[null,"Paras mahdollinen pistemäärä",{"$f":"IF(COUNT(C8:C33)<>0,C7,\"\")","v":""},"","","","",""]
[null,"Prosenttiosuus täysistä pisteistä",null,{"$f":"IF(SUM($C$35:$H$35) <> 0,SUM($C$34:$H$34)/SUM($C$35:$H$35),\"\")","v":""}]
[null,"Tulosten kirjoittaminen:","Kirjoita pistemäärä, jonka sait parhaasta mahdollisesta pistemäärästä (esimerkiksi 15/17)."]
[null,null,"Kirjoita tuloksesi prosentteina (esimerkiksi 85 %)."]

{"sheet":"Keskiarvotaulukko","index":8,"n_rows":7,"n_cols":15,"rows_kept":7}
[]
[]
[]
[null,"Arvosana- ja keskiarvotaulukko"]
[null,"Keskiarvo",{"v":0,"d":"0%"},{"v":0.6,"d":"60%"},{"v":0.63,"d":"63%"},{"v":0.67,"d":"67%"},{"v":0.7,"d":"70%"},{"v":0.73,"d":"73%"},{"v":0.77,"d":"77%"},{"v":0.8,"d":"80%"},{"v":0.83,"d":"83%"},{"v":0.87,"d":"87%"},{"v":0.9,"d":"90%"},{"v":0.93,"d":"93%"},{"v":0.97,"d":"97%"}]
[null,"Arvosana","F","D-","D","D+","C-","C","C+","B-","B","B+","A-","A","A+"]
[null,"Keskiarvo",{"v":0,"d":"0.00"},0.67,{"v":1,"d":"1.00"},1.33,1.67,{"v":2,"d":"2.00"},2.33,2.67,{"v":3,"d":"3.00"},3.33,3.67,{"v":4,"d":"4.00"},{"v":4,"d":"4.00"}]