{"text_format":"3","workbook":"xlsx","n_sheets":3,"sheets":["Koolituse logi","Kursuse loend","Töötajate teave"],"not_rendered":{"defined_names":13},"read":"whole","date_system":"1900"}

{"sheet":"Koolituse logi","index":0,"n_rows":23,"n_cols":9,"rows_kept":23}
[]
[]
[null,null,"KOOLITUSE LOGI"]
{"$rows_empty":8}
[null,null,"KOOLITUSE KUUPÄEV","NIMI","KURSUS","JUHENDAJA","LÄBITUD","LÄBINUD/LÄBIKUKKUNUD","MÄRKMED"]
[null,null,"2012-06-01","Anneli Salumets","Sissejuhatav koolitus",{"$f":"IF(tblKoolituseLogi[[#This Row],[KURSUS]]=\"\",\"\",IFERROR(VLOOKUP(tblKoolituseLogi[[#This Row],[KURSUS]],tblKursuseLoend[],2,0),\"Ei leitud\"))","v":"Ott Paas"},"Jah","Läbinud","Suurepärane juhendaja."]
[null,null,"2012-06-02","Peeter Kuusik","Sissejuhatav koolitus",{"$f":"IF(tblKoolituseLogi[[#This Row],[KURSUS]]=\"\",\"\",IFERROR(VLOOKUP(tblKoolituseLogi[[#This Row],[KURSUS]],tblKursuseLoend[],2,0),\"Ei leitud\"))","v":"Ott Paas"},"Jah","Läbi kukkunud","Tuli varakult lahkuda, ei saanud lõpetada."]
[null,null,"2012-06-03","Arved Loik","Sissejuhatav koolitus",{"$f":"IF(tblKoolituseLogi[[#This Row],[KURSUS]]=\"\",\"\",IFERROR(VLOOKUP(tblKoolituseLogi[[#This Row],[KURSUS]],tblKursuseLoend[],2,0),\"Ei leitud\"))","v":"Ott Paas"},"Jah","Läbinud","Viimane pakkumine selles kvartalis."]
[null,null,"2012-06-03","Peeter Kuusik","Sissejuhatav koolitus",{"$f":"IF(tblKoolituseLogi[[#This Row],[KURSUS]]=\"\",\"\",IFERROR(VLOOKUP(tblKoolituseLogi[[#This Row],[KURSUS]],tblKursuseLoend[],2,0),\"Ei leitud\"))","v":"Ott Paas"},"Jah","Läbinud","Viimane pakkumine selles kvartalis."]
[null,null,"2012-06-04","Peeter Kuusik","Töötaja tegevus",{"$f":"IF(tblKoolituseLogi[[#This Row],[KURSUS]]=\"\",\"\",IFERROR(VLOOKUP(tblKoolituseLogi[[#This Row],[KURSUS]],tblKursuseLoend[],2,0),\"Ei leitud\"))","v":"Aigi Luik"},"Jah","Läbinud","Algne pakkumine selles kvartalis"]
[null,null,"2012-06-04","Arved Loik","Töötaja tegevus",{"$f":"IF(tblKoolituseLogi[[#This Row],[KURSUS]]=\"\",\"\",IFERROR(VLOOKUP(tblKoolituseLogi[[#This Row],[KURSUS]],tblKursuseLoend[],2,0),\"Ei leitud\"))","v":"Aigi Luik"},"Jah","Läbinud","Algne pakkumine selles kvartalis"]
[null,null,"2012-06-04","Arved Loik","Raamatupidamine kesktasemele",{"$f":"IF(tblKoolituseLogi[[#This Row],[KURSUS]]=\"\",\"\",IFERROR(VLOOKUP(tblKoolituseLogi[[#This Row],[KURSUS]],tblKursuseLoend[],2,0),\"Ei leitud\"))","v":"Aigi Luik"},"Jah","Läbinud","Ainult kindlatele osalejatele."]
[null,null,"2012-06-04","Anneli Salumets","Töötaja tegevus",{"$f":"IF(tblKoolituseLogi[[#This Row],[KURSUS]]=\"\",\"\",IFERROR(VLOOKUP(tblKoolituseLogi[[#This Row],[KURSUS]],tblKursuseLoend[],2,0),\"Ei leitud\"))","v":"Aigi Luik"},"Jah","Läbinud","Algne pakkumine selles kvartalis"]
[null,null,"2012-06-05","Anneli Salumets","Raamatupidamine kesktasemele",{"$f":"IF(tblKoolituseLogi[[#This Row],[KURSUS]]=\"\",\"\",IFERROR(VLOOKUP(tblKoolituseLogi[[#This Row],[KURSUS]],tblKursuseLoend[],2,0),\"Ei leitud\"))","v":"Aigi Luik"},"Ei","Edaspidi","Pole veel läbinud."]
[null,null,"2012-06-05","Peeter Kuusik","Raamatupidamine edasijõudnutele",{"$f":"IF(tblKoolituseLogi[[#This Row],[KURSUS]]=\"\",\"\",IFERROR(VLOOKUP(tblKoolituseLogi[[#This Row],[KURSUS]],tblKursuseLoend[],2,0),\"Ei leitud\"))","v":"Ott Paas"},"Ei","Edaspidi","Pole veel läbinud."]
[{"$nulls":5},{"$f":"IF(tblKoolituseLogi[[#This Row],[KURSUS]]=\"\",\"\",IFERROR(VLOOKUP(tblKoolituseLogi[[#This Row],[KURSUS]],tblKursuseLoend[],2,0),\"Ei leitud\"))","v":""}]

{"sheet":"Kursuse loend","index":1,"n_rows":10,"n_cols":6,"rows_kept":10}
[]
[]
[null,null,"KURSUSE LOEND"]
[]
[null,null,"PEALKIRI","JUHENDAJA","KIRJELDUS","TUNNID"]
[null,null,"Sissejuhatav koolitus","Ott Paas","Sissejuhatav kursus uutele töötajatele.  Määratleb osakonna eesmärgid ja ootused ning ajaraamistiku ja -piirid.",2]
[null,null,"Töötaja tegevus","Aigi Luik","Töötaja tegevus vastavalt töötaja käsiraamatule.",1]
[null,null,"Töötaja tegevus","Ott Paas","Raamatupidamise põhitoimingud ja juhised",1.5]
[null,null,"Raamatupidamine kesktasemele","Aigi Luik","Raamatupidamistoimingud ja juhised kesktasemele",2]
[null,null,"Raamatupidamine edasijõudnutele","Ott Paas","Raamatupidamistoimingud ja juhised edasijõudnutele",2]

{"sheet":"Töötajate teave","index":2,"n_rows":9,"n_cols":5,"rows_kept":9}
[]
[]
[null,null,"TÖÖTAJATE TEAVE"]
[]
[null,null,"NIMI","OSAKOND","PEALKIRI"]
[null,null,"Anneli Salumets","Müük","Pearaamatupidaja"]
[null,null,"Peeter Kuusik","Raamatupidamine","Raamatupidaja"]
[null,null,"Arved Loik","Raamatupidamine","Raamatupidaja"]
[null,null,"Mari Kuusk","Raamatupidamine","Raamatupidaja"]