{"text_format":"3","workbook":"xlsx","n_sheets":9,"sheets":["Kokkuvõte","1. aine","2. aine","3. aine","4. aine","5. aine","6. aine","7. aine","KH tabel"],"not_rendered":{"defined_names":9},"read":"whole","date_system":"1900"}

{"sheet":"Kokkuvõte","index":0,"n_rows":12,"n_cols":7,"rows_kept":12,"merged":[[1,1,1,2]]}
[]
[null,"Kooli nimi",null,"  Teie nimi:",null," Semester/aasta:"]
[]
[null,"Ained","Koolitunnid","Praegune protsent","Hindetähis","KH","Kaalutud KH"]
[null,"1. aine",{"v":3,"d":"3.0"},{"$f":"'1. aine'!D$36","v":{"v":0.8661764705882354,"d":"86.62%"}},{"$f":"IF(D5<>\"\",HLOOKUP(D5,'KH tabel'!$C$5:$O$7,2),\"\")","v":"B"},{"$f":"IF(D5<>\"\",HLOOKUP(D5,'KH tabel'!$C$5:$O$7,3),\"\")","v":{"v":3,"d":"3.00"}},{"$f":"IF(F5<>\"\",F5*C5/(SUM($C$5:$C$11)), \"\")","v":{"v":0.5625,"d":"0.56"}}]
[null,"2. aine",{"v":4,"d":"4.0"},{"$f":"'2. aine'!D$36","v":""},{"$f":"IF(D6<>\"\",HLOOKUP(D6,'KH tabel'!$C$5:$O$7,2),\"\")","v":""},{"$f":"IF(D6<>\"\",HLOOKUP(D6,'KH tabel'!$C$5:$O$7,3),\"\")","v":""},""]
[null,"3. aine",{"v":2,"d":"2.0"},{"$f":"'3. aine'!D$36","v":""},{"$f":"IF(D7<>\"\",HLOOKUP(D7,'KH tabel'!$C$5:$O$7,2),\"\")","v":""},{"$f":"IF(D7<>\"\",HLOOKUP(D7,'KH tabel'!$C$5:$O$7,3),\"\")","v":""},""]
[null,"4. aine",{"v":4,"d":"4.0"},{"$f":"'4. aine'!D$36","v":""},{"$f":"IF(D8<>\"\",HLOOKUP(D8,'KH tabel'!$C$5:$O$7,2),\"\")","v":""},{"$f":"IF(D8<>\"\",HLOOKUP(D8,'KH tabel'!$C$5:$O$7,3),\"\")","v":""},""]
[null,"5. aine",{"v":1,"d":"1.0"},{"$f":"'5. aine'!D$36","v":""},{"$f":"IF(D9<>\"\",HLOOKUP(D9,'KH tabel'!$C$5:$O$7,2),\"\")","v":""},{"$f":"IF(D9<>\"\",HLOOKUP(D9,'KH tabel'!$C$5:$O$7,3),\"\")","v":""},""]
[null,"6. aine",{"v":1,"d":"1.0"},{"$f":"'6. aine'!D$36","v":""},{"$f":"IF(D10<>\"\",HLOOKUP(D10,'KH tabel'!$C$5:$O$7,2),\"\")","v":""},{"$f":"IF(D10<>\"\",HLOOKUP(D10,'KH tabel'!$C$5:$O$7,3),\"\")","v":""},""]
[null,"7. aine",{"v":1,"d":"1.0"},{"$f":"'7. aine'!D$36","v":""},{"$f":"IF(D11<>\"\",HLOOKUP(D11,'KH tabel'!$C$5:$O$7,2),\"\")","v":""},{"$f":"IF(D11<>\"\",HLOOKUP(D11,'KH tabel'!$C$5:$O$7,3),\"\")","v":""},""]
[null,"Kokku",{"$f":"SUM(C5:C11)","v":16},{"$f":"AVERAGE(D5:D11)","v":{"v":0.8661764705882354,"d":"86.62%"}},{"$f":"IF(D12<>\"\",HLOOKUP(D12,'KH tabel'!$C$5:$O$7,2),\"\")","v":"B"},{"$f":"AVERAGE(F5:F11)","v":{"v":3,"d":"3.00"}},{"$f":"SUM(G5:G11)","v":{"v":0.5625,"d":"0.56"}}]

{"sheet":"1. aine","index":1,"n_rows":38,"n_cols":8,"rows_kept":38,"merged":[[1,1,1,2]]}
[]
[null,{"$f":"Kokkuvõte!B5","v":"1. aine"}]
[null,"Õpetaja:",null,null,"Protsent võimalikust punktide arvust",null,null,{"$f":"IF(SUM($C$35:$H$35) <> 0,SUM($C$34:$H$34)/SUM($C$35:$H$35),\"\")","v":{"v":0.8661764705882354,"d":"86.62%"}}]
[null,"E-post:",null,null,"Praegune hinne",null,null,{"$f":"SUM($C$34:$H$34)","v":{"v":0.1732352941176471,"d":"17.32%"}}]
[]
[null,"Ülesanded","Kodutööd","Esseed","Viktoriinid","Projektid","Poolaastahinne","Lõpueksam"]
[null,"Osakaal",{"v":0.1,"d":"10.0%"},{"v":0.1,"d":"10.0%"},{"v":0.15,"d":"15.0%"},{"v":0.15,"d":"15.0%"},{"v":0.2,"d":"20.0%"},{"v":0.3,"d":"30.0%"}]
[null,"Esimene kodutöö",{"v":0.882352941176471,"d":"0.88"}]
[null,"Referaat: II maailmasõda",null,0.85]
{"$rows_empty":24}
[null,"Punkte kokku",{"$f":"IF(COUNT(C8:C33) <> 0,AVERAGE(C8:C33) *C7, \"\")","v":{"v":0.0882352941176471,"d":"0.0882"}},{"v":0.085,"d":"0.0850"},"","","",""]
[null,"Võimalik punktide arv kokku",{"$f":"IF(COUNT(C8:C33)<>0,C7,\"\")","v":0.1},0.1,"","","",""]
[null,"Protsent võimalikust punktide arvust",null,{"$f":"IF(SUM($C$35:$H$35) <> 0,SUM($C$34:$H$34)/SUM($C$35:$H$35),\"\")","v":{"v":0.8661764705882354,"d":"86.62%"}}]
[null,"Hinnete sisestamiseks:","Sisestage saadud punktid, mis ületavad võimaliku punktide arvu (nt 15/17)."]
[null,null,"Sisestage saadud protsent (nt 85%)."]

{"sheet":"2. aine","index":2,"n_rows":38,"n_cols":8,"rows_kept":38,"merged":[[1,1,1,2]]}
[]
[null,{"$f":"Kokkuvõte!B6","v":"2. aine"}]
[null,"Õpetaja:",null,null,"Protsent võimalikust punktide arvust",null,null,{"$f":"IF(SUM($C$35:$H$35) <> 0,SUM($C$34:$H$34)/SUM($C$35:$H$35),\"\")","v":""}]
[null,"E-post:",null,null,"Praegune hinne",null,null,{"$f":"SUM($C$34:$H$34)","v":{"v":0,"d":"0.00%"}}]
[]
[null,"Ülesanded","Kodutööd","Esseed","Viktoriinid","Projektid","Poolaastahinne","Lõpueksam"]
[null,"Osakaal",{"v":0.1,"d":"10.0%"},{"v":0.1,"d":"10.0%"},{"v":0.15,"d":"15.0%"},{"v":0.15,"d":"15.0%"},{"v":0.2,"d":"20.0%"},{"v":0.3,"d":"30.0%"}]
{"$rows_empty":26}
[null,"Punkte kokku",{"$f":"IF(COUNT(C8:C33) <> 0,AVERAGE(C8:C33) *C7, \"\")","v":""},"","","","",""]
[null,"Võimalik punktide arv kokku",{"$f":"IF(COUNT(C8:C33)<>0,C7,\"\")","v":""},"","","","",""]
[null,"Protsent võimalikust punktide arvust",null,{"$f":"IF(SUM($C$35:$H$35) <> 0,SUM($C$34:$H$34)/SUM($C$35:$H$35),\"\")","v":""}]
[null,"Hinnete sisestamiseks:","Sisestage saadud punktid, mis ületavad võimaliku punktide arvu (nt 15/17)."]
[null,null,"Sisestage saadud protsent (nt 85%)."]

{"sheet":"3. aine","index":3,"n_rows":38,"n_cols":8,"rows_kept":38,"merged":[[1,1,1,2]]}
[]
[null,{"$f":"Kokkuvõte!B7","v":"3. aine"}]
[null,"Õpetaja:",null,null,"Protsent võimalikust punktide arvust",null,null,{"$f":"IF(SUM($C$35:$H$35) <> 0,SUM($C$34:$H$34)/SUM($C$35:$H$35),\"\")","v":""}]
[null,"E-post:",null,null,"Praegune hinne",null,null,{"$f":"SUM($C$34:$H$34)","v":{"v":0,"d":"0.00%"}}]
[]
[null,"Ülesanded","Kodutööd","Esseed","Viktoriinid","Projektid","Poolaastahinne","Lõpueksam"]
[null,"Osakaal",{"v":0.1,"d":"10.0%"},{"v":0.1,"d":"10.0%"},{"v":0.15,"d":"15.0%"},{"v":0.15,"d":"15.0%"},{"v":0.2,"d":"20.0%"},{"v":0.3,"d":"30.0%"}]
{"$rows_empty":26}
[null,"Punkte kokku",{"$f":"IF(COUNT(C8:C33) <> 0,AVERAGE(C8:C33) *C7, \"\")","v":""},"","","","",""]
[null,"Võimalik punktide arv kokku",{"$f":"IF(COUNT(C8:C33)<>0,C7,\"\")","v":""},"","","","",""]
[null,"Protsent võimalikust punktide arvust",null,{"$f":"IF(SUM($C$35:$H$35) <> 0,SUM($C$34:$H$34)/SUM($C$35:$H$35),\"\")","v":""}]
[null,"Hinnete sisestamiseks:","Sisestage saadud punktid, mis ületavad võimaliku punktide arvu (nt 15/17)."]
[null,null,"Sisestage saadud protsent (nt 85%)."]

{"sheet":"4. aine","index":4,"n_rows":38,"n_cols":8,"rows_kept":38,"merged":[[1,1,1,2]]}
[]
[null,{"$f":"Kokkuvõte!B8","v":"4. aine"}]
[null,"Õpetaja:",null,null,"Protsent võimalikust punktide arvust"]
[null,"E-post:",null,null,"Praegune hinne",null,null,{"$f":"SUM($C$34:$H$34)","v":{"v":0,"d":"0.00%"}}]
[]
[null,"Ülesanded","Kodutööd","Esseed","Viktoriinid","Projektid","Poolaastahinne","Lõpueksam"]
[null,"Osakaal",{"v":0.1,"d":"10.0%"},{"v":0.1,"d":"10.0%"},{"v":0.15,"d":"15.0%"},{"v":0.15,"d":"15.0%"},{"v":0.2,"d":"20.0%"},{"v":0.3,"d":"30.0%"}]
{"$rows_empty":26}
[null,"Punkte kokku",{"$f":"IF(COUNT(C8:C33) <> 0,AVERAGE(C8:C33) *C7, \"\")","v":""},"","","","",""]
[null,"Võimalik punktide arv kokku",{"$f":"IF(COUNT(C8:C33)<>0,C7,\"\")","v":""},"","","","",""]
[null,"Protsent võimalikust punktide arvust",null,{"$f":"IF(SUM($C$35:$H$35) <> 0,SUM($C$34:$H$34)/SUM($C$35:$H$35),\"\")","v":""}]
[null,"Hinnete sisestamiseks:","Sisestage saadud punktid, mis ületavad võimaliku punktide arvu (nt 15/17)."]
[null,null,"Sisestage saadud protsent (nt 85%)."]

{"sheet":"5. aine","index":5,"n_rows":38,"n_cols":8,"rows_kept":38,"merged":[[1,1,1,2]]}
[]
[null,{"$f":"Kokkuvõte!B9","v":"5. aine"}]
[null,"Õpetaja:",null,null,"Protsent võimalikust punktide arvust",null,null,{"$f":"IF(SUM($C$35:$H$35) <> 0,SUM($C$34:$H$34)/SUM($C$35:$H$35),\"\")","v":""}]
[null,"E-post:",null,null,"Praegune hinne",null,null,{"$f":"SUM($C$34:$H$34)","v":{"v":0,"d":"0.00%"}}]
[]
[null,"Ülesanded","Kodutööd","Esseed","Viktoriinid","Projektid","Poolaastahinne","Lõpueksam"]
[null,"Osakaal",{"v":0.1,"d":"10.0%"},{"v":0.1,"d":"10.0%"},{"v":0.15,"d":"15.0%"},{"v":0.15,"d":"15.0%"},{"v":0.2,"d":"20.0%"},{"v":0.3,"d":"30.0%"}]
{"$rows_empty":26}
[null,"Punkte kokku",{"$f":"IF(COUNT(C8:C33) <> 0,AVERAGE(C8:C33) *C7, \"\")","v":""},"","","","",""]
[null,"Võimalik punktide arv kokku",{"$f":"IF(COUNT(C8:C33)<>0,C7,\"\")","v":""},"","","","",""]
[null,"Protsent võimalikust punktide arvust",null,{"$f":"IF(SUM($C$35:$H$35) <> 0,SUM($C$34:$H$34)/SUM($C$35:$H$35),\"\")","v":""}]
[null,"Hinnete sisestamiseks:","Sisestage saadud punktid, mis ületavad võimaliku punktide arvu (nt 15/17)."]
[null,null,"Sisestage saadud protsent (nt 85%)."]

{"sheet":"6. aine","index":6,"n_rows":38,"n_cols":8,"rows_kept":38,"merged":[[1,1,1,2]]}
[]
[null,{"$f":"Kokkuvõte!B10","v":"6. aine"}]
[null,"Õpetaja:",null,null,"Protsent võimalikust punktide arvust",null,null,{"$f":"IF(SUM($C$35:$H$35) <> 0,SUM($C$34:$H$34)/SUM($C$35:$H$35),\"\")","v":""}]
[null,"E-post:",null,null,"Praegune hinne",null,null,{"$f":"SUM($C$34:$H$34)","v":{"v":0,"d":"0.00%"}}]
[]
[null,"Ülesanded","Kodutööd","Esseed","Viktoriinid","Projektid","Poolaastahinne","Lõpueksam"]
[null,"Osakaal",{"v":0.1,"d":"10.0%"},{"v":0.1,"d":"10.0%"},{"v":0.15,"d":"15.0%"},{"v":0.15,"d":"15.0%"},{"v":0.2,"d":"20.0%"},{"v":0.3,"d":"30.0%"}]
{"$rows_empty":26}
[null,"Punkte kokku",{"$f":"IF(COUNT(C8:C33) <> 0,AVERAGE(C8:C33) *C7, \"\")","v":""},"","","","",""]
[null,"Võimalik punktide arv kokku",{"$f":"IF(COUNT(C8:C33)<>0,C7,\"\")","v":""},"","","","",""]
[null,"Protsent võimalikust punktide arvust",null,{"$f":"IF(SUM($C$35:$H$35) <> 0,SUM($C$34:$H$34)/SUM($C$35:$H$35),\"\")","v":""},{"$f":"IF(SUM($C$35:$H$35) <> 0,SUM($C$34:$H$34)/SUM($C$35:$H$35),\"\")","v":""}]
[null,"Hinnete sisestamiseks:","Sisestage saadud punktid, mis ületavad võimaliku punktide arvu (nt 15/17)."]
[null,null,"Sisestage saadud protsent (nt 85%)."]

{"sheet":"7. aine","index":7,"n_rows":38,"n_cols":8,"rows_kept":38,"merged":[[1,1,1,2]]}
[]
[null,{"$f":"Kokkuvõte!B11","v":"7. aine"}]
[null,"Õpetaja:",null,null,"Protsent võimalikust punktide arvust",null,null,{"$f":"IF(SUM($C$35:$H$35) <> 0,SUM($C$34:$H$34)/SUM($C$35:$H$35),\"\")","v":""}]
[null,"E-post:",null,null,"Praegune hinne",null,null,{"$f":"SUM($C$34:$H$34)","v":{"v":0,"d":"0.00%"}}]
[]
[null,"Ülesanded","Kodutööd","Esseed","Viktoriinid","Projektid","Poolaastahinne","Lõpueksam"]
[null,"Osakaal",{"v":0.1,"d":"10.0%"},{"v":0.1,"d":"10.0%"},{"v":0.15,"d":"15.0%"},{"v":0.15,"d":"15.0%"},{"v":0.2,"d":"20.0%"},{"v":0.3,"d":"30.0%"}]
{"$rows_empty":26}
[null,"Punkte kokku",{"$f":"IF(COUNT(C8:C33) <> 0,AVERAGE(C8:C33) *C7, \"\")","v":""},"","","","",""]
[null,"Võimalik punktide arv kokku",{"$f":"IF(COUNT(C8:C33)<>0,C7,\"\")","v":""},"","","","",""]
[null,"Protsent võimalikust punktide arvust",null,{"$f":"IF(SUM($C$35:$H$35) <> 0,SUM($C$34:$H$34)/SUM($C$35:$H$35),\"\")","v":""}]
[null,"Hinnete sisestamiseks:","Sisestage saadud punktid, mis ületavad võimaliku punktide arvu (nt 15/17)."]
[null,null,"Sisestage saadud protsent (nt 85%)."]

{"sheet":"KH tabel","index":8,"n_rows":7,"n_cols":15,"rows_kept":7}
[]
[]
[]
[null,"Hinnete & KH tabel"]
[null,"Keskmine",{"v":0,"d":"0%"},{"v":0.6,"d":"60%"},{"v":0.63,"d":"63%"},{"v":0.67,"d":"67%"},{"v":0.7,"d":"70%"},{"v":0.73,"d":"73%"},{"v":0.77,"d":"77%"},{"v":0.8,"d":"80%"},{"v":0.83,"d":"83%"},{"v":0.87,"d":"87%"},{"v":0.9,"d":"90%"},{"v":0.93,"d":"93%"},{"v":0.97,"d":"97%"}]
[null,"Hindetähis","F","D-","D","D+","C-","C","C+","B-","B","B+","A-","A","A+"]
[null,"KH",{"v":0,"d":"0.00"},0.67,{"v":1,"d":"1.00"},1.33,1.67,{"v":2,"d":"2.00"},2.33,2.67,{"v":3,"d":"3.00"},3.33,3.67,{"v":4,"d":"4.00"},{"v":4,"d":"4.00"}]