{"text_format":"3","workbook":"xlsx","n_sheets":3,"sheets":["Aastaplaanur","Kohtumised","arvutused"],"not_rendered":{"defined_names":17},"read":"whole","date_system":"1900"}

{"sheet":"Aastaplaanur","index":0,"n_rows":42,"n_cols":17,"rows_kept":42}
[null,{"$f":"Algusaasta&\" - \"&Algusaasta+1","v":"2022 - 2023"},{"$nulls":3},"KOOLIAASTA KALENDER"]
[]
[null,null,{"$f":"YEAR(TODAY())","v":2022}," Algusaasta",{"$nulls":12},"PÄEVA ÜLEVAADE"]
[]
[null,null,{"$f":"Kuude_päise_väärtused","v":"2022-09-01"},"2022-10-01","2022-11-01","2022-12-01","2023-01-01","2023-02-01","2023-03-01","2023-04-01","2023-05-01","2023-06-01","2023-07-01","2023-08-01",null,null,{"$f":"TODAY()","v":"2022-08-10"}]
[null,{"$f":"arvutused!B7:B43","v":"E"},{"$f":"Kohtumised","v":0},0,0,0,0,0,0,0,0,0,0,0,null,{"$f":"IFERROR(VLOOKUP(1,Tänased_kohtumised_sorditud[],2,FALSE),\"\")","v":"10:00:00"},{"$f":"IFERROR(VLOOKUP(1,Tänased_kohtumised_sorditud[],3,FALSE),\"\")","v":"Hambaarst"}]
[null,"T",0,0,0,0,0,0,0,0,0,0,0,0,null,{"$f":"IFERROR(VLOOKUP(2,Tänased_kohtumised_sorditud[],2,FALSE),\"\")","v":"21:00:00"},{"$f":"IFERROR(VLOOKUP(2,Tänased_kohtumised_sorditud[],3,FALSE),\"\")","v":"Anu sünnipäevapidu"}]
[null,"K",0,0,0,0,0,0,0,0,0,0,0,0,null,{"$f":"IFERROR(VLOOKUP(3,Tänased_kohtumised_sorditud[],2,FALSE),\"\")","v":""},{"$f":"IFERROR(VLOOKUP(3,Tänased_kohtumised_sorditud[],3,FALSE),\"\")","v":""}]
[null,"N",0,0,0,0,0,0,0,0,0,0,0,0,null,{"$f":"IFERROR(VLOOKUP(4,Tänased_kohtumised_sorditud[],2,FALSE),\"\")","v":""},{"$f":"IFERROR(VLOOKUP(4,Tänased_kohtumised_sorditud[],3,FALSE),\"\")","v":""}]
[null,"R",0,0,0,0,0,0,0,0,0,0,0,0,null,{"$f":"IFERROR(VLOOKUP(5,Tänased_kohtumised_sorditud[],2,FALSE),\"\")","v":""},{"$f":"IFERROR(VLOOKUP(5,Tänased_kohtumised_sorditud[],3,FALSE),\"\")","v":""}]
[null,"L",0,0,0,0,0,0,0,0,0,0,0,0,null,{"$f":"IFERROR(VLOOKUP(6,Tänased_kohtumised_sorditud[],2,FALSE),\"\")","v":""},{"$f":"IFERROR(VLOOKUP(6,Tänased_kohtumised_sorditud[],3,FALSE),\"\")","v":""}]
[null,"P",0,0,0,0,0,0,0,0,0,0,0,0,null,{"$f":"IFERROR(VLOOKUP(7,Tänased_kohtumised_sorditud[],2,FALSE),\"\")","v":""},{"$f":"IFERROR(VLOOKUP(7,Tänased_kohtumised_sorditud[],3,FALSE),\"\")","v":""}]
[null,"E",0,0,0,0,0,0,0,0,0,0,0,0,null,{"$f":"IFERROR(VLOOKUP(8,Tänased_kohtumised_sorditud[],2,FALSE),\"\")","v":""},{"$f":"IFERROR(VLOOKUP(8,Tänased_kohtumised_sorditud[],3,FALSE),\"\")","v":""}]
[null,"T",0,0,0,0,0,0,0,0,0,0,0,0,null,{"$f":"IFERROR(VLOOKUP(9,Tänased_kohtumised_sorditud[],2,FALSE),\"\")","v":""},{"$f":"IFERROR(VLOOKUP(9,Tänased_kohtumised_sorditud[],3,FALSE),\"\")","v":""}]
[null,"K",0,0,0,0,0,0,0,0,0,0,0,0,null,{"$f":"IFERROR(VLOOKUP(10,Tänased_kohtumised_sorditud[],2,FALSE),\"\")","v":""},{"$f":"IFERROR(VLOOKUP(10,Tänased_kohtumised_sorditud[],3,FALSE),\"\")","v":""}]
[null,"N",0,0,0,0,0,0,0,0,0,0,0,0,null,{"$f":"IFERROR(VLOOKUP(11,Tänased_kohtumised_sorditud[],2,FALSE),\"\")","v":""},{"$f":"IFERROR(VLOOKUP(11,Tänased_kohtumised_sorditud[],3,FALSE),\"\")","v":""}]
[null,"R",0,0,0,0,0,0,0,0,0,0,0,0,null,{"$f":"IFERROR(VLOOKUP(12,Tänased_kohtumised_sorditud[],2,FALSE),\"\")","v":""},{"$f":"IFERROR(VLOOKUP(12,Tänased_kohtumised_sorditud[],3,FALSE),\"\")","v":""}]
[null,"L",0,0,0,0,0,0,0,0,0,0,0,0,null,{"$f":"IFERROR(VLOOKUP(13,Tänased_kohtumised_sorditud[],2,FALSE),\"\")","v":""},{"$f":"IFERROR(VLOOKUP(13,Tänased_kohtumised_sorditud[],3,FALSE),\"\")","v":""}]
[null,"P",0,0,0,0,0,0,0,0,0,0,0,0,null,{"$f":"IFERROR(VLOOKUP(14,Tänased_kohtumised_sorditud[],2,FALSE),\"\")","v":""},{"$f":"IFERROR(VLOOKUP(14,Tänased_kohtumised_sorditud[],3,FALSE),\"\")","v":""}]
[null,"E",0,0,0,0,0,0,0,0,0,0,0,0,null,{"$f":"IFERROR(VLOOKUP(15,Tänased_kohtumised_sorditud[],2,FALSE),\"\")","v":""},{"$f":"IFERROR(VLOOKUP(15,Tänased_kohtumised_sorditud[],3,FALSE),\"\")","v":""}]
[null,"T",0,0,0,0,0,0,0,0,0,0,0,0,null,{"$f":"IFERROR(VLOOKUP(16,Tänased_kohtumised_sorditud[],2,FALSE),\"\")","v":""},{"$f":"IFERROR(VLOOKUP(16,Tänased_kohtumised_sorditud[],3,FALSE),\"\")","v":""}]
[null,"K",0,0,0,0,0,0,0,0,0,0,0,0,null,{"$f":"IFERROR(VLOOKUP(17,Tänased_kohtumised_sorditud[],2,FALSE),\"\")","v":""},{"$f":"IFERROR(VLOOKUP(17,Tänased_kohtumised_sorditud[],3,FALSE),\"\")","v":""}]
[null,"N",0,0,0,0,0,0,0,0,0,0,0,0,null,{"$f":"IFERROR(VLOOKUP(18,Tänased_kohtumised_sorditud[],2,FALSE),\"\")","v":""},{"$f":"IFERROR(VLOOKUP(18,Tänased_kohtumised_sorditud[],3,FALSE),\"\")","v":""}]
[null,"R",0,0,0,0,0,0,0,0,0,0,0,0,null,{"$f":"IFERROR(VLOOKUP(19,Tänased_kohtumised_sorditud[],2,FALSE),\"\")","v":""},{"$f":"IFERROR(VLOOKUP(19,Tänased_kohtumised_sorditud[],3,FALSE),\"\")","v":""}]
[null,"L",0,0,0,0,0,0,0,0,0,0,0,0,null,{"$f":"IFERROR(VLOOKUP(20,Tänased_kohtumised_sorditud[],2,FALSE),\"\")","v":""},{"$f":"IFERROR(VLOOKUP(20,Tänased_kohtumised_sorditud[],3,FALSE),\"\")","v":""}]
[null,"P",0,0,0,0,0,0,0,0,0,0,0,0]
[null,"E",0,0,0,0,0,0,0,0,0,0,0,0]
[null,"T",0,0,0,0,0,0,0,0,0,0,0,0]
[null,"K",0,0,0,0,0,0,0,0,0,0,0,0]
[null,"N",0,0,0,0,0,0,0,0,0,0,0,0]
[null,"R",0,0,0,0,0,0,0,0,0,0,0,0]
[null,"L",0,0,0,0,0,0,0,0,0,0,0,0]
[null,"P",0,0,0,0,0,0,0,0,0,0,0,0]
[null,"E",0,0,0,0,0,0,0,0,0,0,0,0]
[null,"T",0,0,0,0,0,0,0,0,0,0,0,0]
[null,"K",0,0,0,0,0,0,0,0,0,0,0,0]
[null,"N",0,0,0,0,0,0,0,0,0,0,0,0]
[null,"R",0,0,0,0,0,0,0,0,0,0,0,0]
[null,"L",0,0,0,0,0,0,0,0,0,0,0,0]
[null,"P",0,0,0,0,0,0,0,0,0,0,0,0]
[null,"E",0,0,0,0,0,0,0,0,0,0,0,0]
[null,"T",0,0,0,0,0,0,0,0,0,0,0,0]

{"sheet":"Kohtumised","index":1,"n_rows":16,"n_cols":4,"rows_kept":16}
[null,"KOHTUMISED"]
[]
[null,"KOHTUMISED"]
[null,"KUUPÄEVA","KELLAAEG","KIRJELDUS"]
[null,{"$f":"TODAY()","v":"2022-08-10"},"10:00:00","Hambaarst"]
[null,{"$f":"TODAY()","v":"2022-08-10"},"21:00:00","Anu sünnipäevapidu"]
[null,{"$f":"TODAY()+1","v":"2022-08-11"},"16:00:00","Õpperühm"]
[null,{"$f":"TODAY()+2","v":"2022-08-12"},"21:00:00","Flaierite jagamine noortekeskuses"]
[null,{"$f":"TODAY()+3","v":"2022-08-13"},"10:00:00","Õpperühm"]
[null,{"$f":"TODAY()+4","v":"2022-08-14"},"13:00:00","Eksam"]
[null,{"$f":"TODAY()+5","v":"2022-08-15"},"15:00:00","Eksam"]
[null,{"$f":"TODAY()+7","v":"2022-08-17"},"18:00:00","Tudengipidu"]
[null,{"$f":"TODAY()+8","v":"2022-08-18"},"10:30:00","Kohtumine Oliveriga spordiklubis"]
[null,{"$f":"TODAY()+9","v":"2022-08-19"},"10:00:00","Eksam"]
[null,{"$f":"TODAY()+10","v":"2022-08-20"},"19:00:00","Õpperühm"]
[null,{"$f":"TODAY()+11","v":"2022-08-21"},"21:00:00","Karjääriõhtu"]

{"sheet":"arvutused","index":2,"n_rows":43,"n_cols":25,"rows_kept":43,"hidden":true}
[{"$nulls":15},"Kuupäev"]
[null,null,"Peidetud arvutused",{"$nulls":12},{"$f":"TODAY()","v":"2022-08-10"},null,null,"Päevaste ülesannete automaatse sortimise reiting; samad üksused on samal päeval"]
[{"$nulls":18},"toimib kuni 20 kohtumise jaoks ühel päeval"]
[null,null,"*** See leht peaks jääma peidetuks ***",{"$nulls":14},"Vahefiniš","REITING","Kellaaeg","Kohtumine",null,"Sorditud reiting","Kellaaeg","Kohtumine"]
[{"$nulls":17},{"$f":"IFERROR(RANK(S5,arvutused!$S$5:$S$24,1)+SUMPRODUCT(--(S5=arvutused!$S$5:$S$24),--(U5>arvutused!$U$5:$U$24)),\"\")","v":1},{"$f":"IFERROR(RANK($T5,arvutused!$T$5:$T$24,1),\"\")","v":1},{"$f":"IFERROR(INDEX(Kohtumise_üksikasjad[],SMALL(IF(Kohtumise_üksikasjad[KUUPÄEVA]=Tänane_kuupäev,ROW(Kohtumise_üksikasjad[KUUPÄEVA])-4),ROW(A1)),2),\"\")","v":"10:00:00"},{"$f":"IFERROR(INDEX(Kohtumise_üksikasjad[],SMALL(IF(Kohtumise_üksikasjad[KUUPÄEVA]=Tänane_kuupäev,ROW(Kohtumise_üksikasjad[KUUPÄEVA])-4),ROW(A1)),3),\"\")","v":"Hambaarst"},null,1,{"$f":"IFERROR(VLOOKUP(W5,Sordi_tabel[],3,FALSE),\"\")","v":"10:00:00"},{"$f":"IFERROR(VLOOKUP(W5,Sordi_tabel[],4,FALSE),\"\")","v":"Hambaarst"}]
[null,null,{"$f":"Kuude_päise_väärtused","v":"2022-09-01"},"2022-10-01","2022-11-01","2022-12-01","2023-01-01","2023-02-01","2023-03-01","2023-04-01","2023-05-01","2023-06-01","2023-07-01","2023-08-01",{"$nulls":3},{"$f":"IFERROR(RANK(S6,arvutused!$S$5:$S$24,1)+SUMPRODUCT(--(S6=arvutused!$S$5:$S$24),--(U6>arvutused!$U$5:$U$24)),\"\")","v":2},{"$f":"IFERROR(RANK($T6,arvutused!$T$5:$T$24,1),\"\")","v":2},{"$f":"IFERROR(INDEX(Kohtumise_üksikasjad[],SMALL(IF(Kohtumise_üksikasjad[KUUPÄEVA]=Tänane_kuupäev,ROW(Kohtumise_üksikasjad[KUUPÄEVA])-4),ROW(A2)),2),\"\")","v":"21:00:00"},{"$f":"IFERROR(INDEX(Kohtumise_üksikasjad[],SMALL(IF(Kohtumise_üksikasjad[KUUPÄEVA]=Tänane_kuupäev,ROW(Kohtumise_üksikasjad[KUUPÄEVA])-4),ROW(A2)),3),\"\")","v":"Anu sünnipäevapidu"},null,2,{"$f":"IFERROR(VLOOKUP(W6,Sordi_tabel[],3,FALSE),\"\")","v":"21:00:00"},{"$f":"IFERROR(VLOOKUP(W6,Sordi_tabel[],4,FALSE),\"\")","v":"Anu sünnipäevapidu"}]
[null,"E",{"$f":"IF(MONTH(C6:N6-WEEKDAY(C6:N6,2)+ROW(1:50))=MONTH(C6:N6),C6:N6-WEEKDAY(C6:N6,2)+ROW(1:50),\"\")","v":""},"","","","","","","","2023-05-01","","","",{"$nulls":3},{"$f":"IFERROR(RANK(S7,arvutused!$S$5:$S$24,1)+SUMPRODUCT(--(S7=arvutused!$S$5:$S$24),--(U7>arvutused!$U$5:$U$24)),\"\")","v":""},{"$f":"IFERROR(RANK($T7,arvutused!$T$5:$T$24,1),\"\")","v":""},{"$f":"IFERROR(INDEX(Kohtumise_üksikasjad[],SMALL(IF(Kohtumise_üksikasjad[KUUPÄEVA]=Tänane_kuupäev,ROW(Kohtumise_üksikasjad[KUUPÄEVA])-4),ROW(A3)),2),\"\")","v":""},{"$f":"IFERROR(INDEX(Kohtumise_üksikasjad[],SMALL(IF(Kohtumise_üksikasjad[KUUPÄEVA]=Tänane_kuupäev,ROW(Kohtumise_üksikasjad[KUUPÄEVA])-4),ROW(A3)),3),\"\")","v":""},null,3,{"$f":"IFERROR(VLOOKUP(W7,Sordi_tabel[],3,FALSE),\"\")","v":""},{"$f":"IFERROR(VLOOKUP(W7,Sordi_tabel[],4,FALSE),\"\")","v":""}]
[null,"T","","","2022-11-01","","","","","","2023-05-02","","","2023-08-01",{"$nulls":3},{"$f":"IFERROR(RANK(S8,arvutused!$S$5:$S$24,1)+SUMPRODUCT(--(S8=arvutused!$S$5:$S$24),--(U8>arvutused!$U$5:$U$24)),\"\")","v":""},{"$f":"IFERROR(RANK($T8,arvutused!$T$5:$T$24,1),\"\")","v":""},{"$f":"IFERROR(INDEX(Kohtumise_üksikasjad[],SMALL(IF(Kohtumise_üksikasjad[KUUPÄEVA]=Tänane_kuupäev,ROW(Kohtumise_üksikasjad[KUUPÄEVA])-4),ROW(A4)),2),\"\")","v":""},{"$f":"IFERROR(INDEX(Kohtumise_üksikasjad[],SMALL(IF(Kohtumise_üksikasjad[KUUPÄEVA]=Tänane_kuupäev,ROW(Kohtumise_üksikasjad[KUUPÄEVA])-4),ROW(A4)),3),\"\")","v":""},null,4,{"$f":"IFERROR(VLOOKUP(W8,Sordi_tabel[],3,FALSE),\"\")","v":""},{"$f":"IFERROR(VLOOKUP(W8,Sordi_tabel[],4,FALSE),\"\")","v":""}]
[null,"K","","","2022-11-02","","","2023-02-01","2023-03-01","","2023-05-03","","","2023-08-02",{"$nulls":3},{"$f":"IFERROR(RANK(S9,arvutused!$S$5:$S$24,1)+SUMPRODUCT(--(S9=arvutused!$S$5:$S$24),--(U9>arvutused!$U$5:$U$24)),\"\")","v":""},{"$f":"IFERROR(RANK($T9,arvutused!$T$5:$T$24,1),\"\")","v":""},{"$f":"IFERROR(INDEX(Kohtumise_üksikasjad[],SMALL(IF(Kohtumise_üksikasjad[KUUPÄEVA]=Tänane_kuupäev,ROW(Kohtumise_üksikasjad[KUUPÄEVA])-4),ROW(A5)),2),\"\")","v":""},{"$f":"IFERROR(INDEX(Kohtumise_üksikasjad[],SMALL(IF(Kohtumise_üksikasjad[KUUPÄEVA]=Tänane_kuupäev,ROW(Kohtumise_üksikasjad[KUUPÄEVA])-4),ROW(A5)),3),\"\")","v":""},null,5,{"$f":"IFERROR(VLOOKUP(W9,Sordi_tabel[],3,FALSE),\"\")","v":""},{"$f":"IFERROR(VLOOKUP(W9,Sordi_tabel[],4,FALSE),\"\")","v":""}]
[null,"N","2022-09-01","","2022-11-03","2022-12-01","","2023-02-02","2023-03-02","","2023-05-04","2023-06-01","","2023-08-03",{"$nulls":3},{"$f":"IFERROR(RANK(S10,arvutused!$S$5:$S$24,1)+SUMPRODUCT(--(S10=arvutused!$S$5:$S$24),--(U10>arvutused!$U$5:$U$24)),\"\")","v":""},{"$f":"IFERROR(RANK($T10,arvutused!$T$5:$T$24,1),\"\")","v":""},{"$f":"IFERROR(INDEX(Kohtumise_üksikasjad[],SMALL(IF(Kohtumise_üksikasjad[KUUPÄEVA]=Tänane_kuupäev,ROW(Kohtumise_üksikasjad[KUUPÄEVA])-4),ROW(A6)),2),\"\")","v":""},{"$f":"IFERROR(INDEX(Kohtumise_üksikasjad[],SMALL(IF(Kohtumise_üksikasjad[KUUPÄEVA]=Tänane_kuupäev,ROW(Kohtumise_üksikasjad[KUUPÄEVA])-4),ROW(A6)),3),\"\")","v":""},null,6,{"$f":"IFERROR(VLOOKUP(W10,Sordi_tabel[],3,FALSE),\"\")","v":""},{"$f":"IFERROR(VLOOKUP(W10,Sordi_tabel[],4,FALSE),\"\")","v":""}]
[null,"R","2022-09-02","","2022-11-04","2022-12-02","","2023-02-03","2023-03-03","","2023-05-05","2023-06-02","","2023-08-04",{"$nulls":3},{"$f":"IFERROR(RANK(S11,arvutused!$S$5:$S$24,1)+SUMPRODUCT(--(S11=arvutused!$S$5:$S$24),--(U11>arvutused!$U$5:$U$24)),\"\")","v":""},{"$f":"IFERROR(RANK($T11,arvutused!$T$5:$T$24,1),\"\")","v":""},{"$f":"IFERROR(INDEX(Kohtumise_üksikasjad[],SMALL(IF(Kohtumise_üksikasjad[KUUPÄEVA]=Tänane_kuupäev,ROW(Kohtumise_üksikasjad[KUUPÄEVA])-4),ROW(A7)),2),\"\")","v":""},{"$f":"IFERROR(INDEX(Kohtumise_üksikasjad[],SMALL(IF(Kohtumise_üksikasjad[KUUPÄEVA]=Tänane_kuupäev,ROW(Kohtumise_üksikasjad[KUUPÄEVA])-4),ROW(A7)),3),\"\")","v":""},null,7,{"$f":"IFERROR(VLOOKUP(W11,Sordi_tabel[],3,FALSE),\"\")","v":""},{"$f":"IFERROR(VLOOKUP(W11,Sordi_tabel[],4,FALSE),\"\")","v":""}]
[null,"L","2022-09-03","2022-10-01","2022-11-05","2022-12-03","","2023-02-04","2023-03-04","2023-04-01","2023-05-06","2023-06-03","2023-07-01","2023-08-05",{"$nulls":3},{"$f":"IFERROR(RANK(S12,arvutused!$S$5:$S$24,1)+SUMPRODUCT(--(S12=arvutused!$S$5:$S$24),--(U12>arvutused!$U$5:$U$24)),\"\")","v":""},{"$f":"IFERROR(RANK($T12,arvutused!$T$5:$T$24,1),\"\")","v":""},{"$f":"IFERROR(INDEX(Kohtumise_üksikasjad[],SMALL(IF(Kohtumise_üksikasjad[KUUPÄEVA]=Tänane_kuupäev,ROW(Kohtumise_üksikasjad[KUUPÄEVA])-4),ROW(A8)),2),\"\")","v":""},{"$f":"IFERROR(INDEX(Kohtumise_üksikasjad[],SMALL(IF(Kohtumise_üksikasjad[KUUPÄEVA]=Tänane_kuupäev,ROW(Kohtumise_üksikasjad[KUUPÄEVA])-4),ROW(A8)),3),\"\")","v":""},null,8,{"$f":"IFERROR(VLOOKUP(W12,Sordi_tabel[],3,FALSE),\"\")","v":""},{"$f":"IFERROR(VLOOKUP(W12,Sordi_tabel[],4,FALSE),\"\")","v":""}]
[null,"P","2022-09-04","2022-10-02","2022-11-06","2022-12-04","2023-01-01","2023-02-05","2023-03-05","2023-04-02","2023-05-07","2023-06-04","2023-07-02","2023-08-06",{"$nulls":3},{"$f":"IFERROR(RANK(S13,arvutused!$S$5:$S$24,1)+SUMPRODUCT(--(S13=arvutused!$S$5:$S$24),--(U13>arvutused!$U$5:$U$24)),\"\")","v":""},{"$f":"IFERROR(RANK($T13,arvutused!$T$5:$T$24,1),\"\")","v":""},{"$f":"IFERROR(INDEX(Kohtumise_üksikasjad[],SMALL(IF(Kohtumise_üksikasjad[KUUPÄEVA]=Tänane_kuupäev,ROW(Kohtumise_üksikasjad[KUUPÄEVA])-4),ROW(A9)),2),\"\")","v":""},{"$f":"IFERROR(INDEX(Kohtumise_üksikasjad[],SMALL(IF(Kohtumise_üksikasjad[KUUPÄEVA]=Tänane_kuupäev,ROW(Kohtumise_üksikasjad[KUUPÄEVA])-4),ROW(A9)),3),\"\")","v":""},null,9,{"$f":"IFERROR(VLOOKUP(W13,Sordi_tabel[],3,FALSE),\"\")","v":""},{"$f":"IFERROR(VLOOKUP(W13,Sordi_tabel[],4,FALSE),\"\")","v":""}]
[null,"E","2022-09-05","2022-10-03","2022-11-07","2022-12-05","2023-01-02","2023-02-06","2023-03-06","2023-04-03","2023-05-08","2023-06-05","2023-07-03","2023-08-07",{"$nulls":3},{"$f":"IFERROR(RANK(S14,arvutused!$S$5:$S$24,1)+SUMPRODUCT(--(S14=arvutused!$S$5:$S$24),--(U14>arvutused!$U$5:$U$24)),\"\")","v":""},{"$f":"IFERROR(RANK($T14,arvutused!$T$5:$T$24,1),\"\")","v":""},{"$f":"IFERROR(INDEX(Kohtumise_üksikasjad[],SMALL(IF(Kohtumise_üksikasjad[KUUPÄEVA]=Tänane_kuupäev,ROW(Kohtumise_üksikasjad[KUUPÄEVA])-4),ROW(A10)),2),\"\")","v":""},{"$f":"IFERROR(INDEX(Kohtumise_üksikasjad[],SMALL(IF(Kohtumise_üksikasjad[KUUPÄEVA]=Tänane_kuupäev,ROW(Kohtumise_üksikasjad[KUUPÄEVA])-4),ROW(A10)),3),\"\")","v":""},null,10,{"$f":"IFERROR(VLOOKUP(W14,Sordi_tabel[],3,FALSE),\"\")","v":""},{"$f":"IFERROR(VLOOKUP(W14,Sordi_tabel[],4,FALSE),\"\")","v":""}]
[null,"T","2022-09-06","2022-10-04","2022-11-08","2022-12-06","2023-01-03","2023-02-07","2023-03-07","2023-04-04","2023-05-09","2023-06-06","2023-07-04","2023-08-08",{"$nulls":3},{"$f":"IFERROR(RANK(S15,arvutused!$S$5:$S$24,1)+SUMPRODUCT(--(S15=arvutused!$S$5:$S$24),--(U15>arvutused!$U$5:$U$24)),\"\")","v":""},{"$f":"IFERROR(RANK($T15,arvutused!$T$5:$T$24,1),\"\")","v":""},{"$f":"IFERROR(INDEX(Kohtumise_üksikasjad[],SMALL(IF(Kohtumise_üksikasjad[KUUPÄEVA]=Tänane_kuupäev,ROW(Kohtumise_üksikasjad[KUUPÄEVA])-4),ROW(A11)),2),\"\")","v":""},{"$f":"IFERROR(INDEX(Kohtumise_üksikasjad[],SMALL(IF(Kohtumise_üksikasjad[KUUPÄEVA]=Tänane_kuupäev,ROW(Kohtumise_üksikasjad[KUUPÄEVA])-4),ROW(A11)),3),\"\")","v":""},null,11,{"$f":"IFERROR(VLOOKUP(W15,Sordi_tabel[],3,FALSE),\"\")","v":""},{"$f":"IFERROR(VLOOKUP(W15,Sordi_tabel[],4,FALSE),\"\")","v":""}]
[null,"K","2022-09-07","2022-10-05","2022-11-09","2022-12-07","2023-01-04","2023-02-08","2023-03-08","2023-04-05","2023-05-10","2023-06-07","2023-07-05","2023-08-09",{"$nulls":3},{"$f":"IFERROR(RANK(S16,arvutused!$S$5:$S$24,1)+SUMPRODUCT(--(S16=arvutused!$S$5:$S$24),--(U16>arvutused!$U$5:$U$24)),\"\")","v":""},{"$f":"IFERROR(RANK($T16,arvutused!$T$5:$T$24,1),\"\")","v":""},{"$f":"IFERROR(INDEX(Kohtumise_üksikasjad[],SMALL(IF(Kohtumise_üksikasjad[KUUPÄEVA]=Tänane_kuupäev,ROW(Kohtumise_üksikasjad[KUUPÄEVA])-4),ROW(A12)),2),\"\")","v":""},{"$f":"IFERROR(INDEX(Kohtumise_üksikasjad[],SMALL(IF(Kohtumise_üksikasjad[KUUPÄEVA]=Tänane_kuupäev,ROW(Kohtumise_üksikasjad[KUUPÄEVA])-4),ROW(A12)),3),\"\")","v":""},null,12,{"$f":"IFERROR(VLOOKUP(W16,Sordi_tabel[],3,FALSE),\"\")","v":""},{"$f":"IFERROR(VLOOKUP(W16,Sordi_tabel[],4,FALSE),\"\")","v":""}]
[null,"N","2022-09-08","2022-10-06","2022-11-10","2022-12-08","2023-01-05","2023-02-09","2023-03-09","2023-04-06","2023-05-11","2023-06-08","2023-07-06","2023-08-10",{"$nulls":3},{"$f":"IFERROR(RANK(S17,arvutused!$S$5:$S$24,1)+SUMPRODUCT(--(S17=arvutused!$S$5:$S$24),--(U17>arvutused!$U$5:$U$24)),\"\")","v":""},{"$f":"IFERROR(RANK($T17,arvutused!$T$5:$T$24,1),\"\")","v":""},{"$f":"IFERROR(INDEX(Kohtumise_üksikasjad[],SMALL(IF(Kohtumise_üksikasjad[KUUPÄEVA]=Tänane_kuupäev,ROW(Kohtumise_üksikasjad[KUUPÄEVA])-4),ROW(A13)),2),\"\")","v":""},{"$f":"IFERROR(INDEX(Kohtumise_üksikasjad[],SMALL(IF(Kohtumise_üksikasjad[KUUPÄEVA]=Tänane_kuupäev,ROW(Kohtumise_üksikasjad[KUUPÄEVA])-4),ROW(A13)),3),\"\")","v":""},null,13,{"$f":"IFERROR(VLOOKUP(W17,Sordi_tabel[],3,FALSE),\"\")","v":""},{"$f":"IFERROR(VLOOKUP(W17,Sordi_tabel[],4,FALSE),\"\")","v":""}]
[null,"R","2022-09-09","2022-10-07","2022-11-11","2022-12-09","2023-01-06","2023-02-10","2023-03-10","2023-04-07","2023-05-12","2023-06-09","2023-07-07","2023-08-11",{"$nulls":3},{"$f":"IFERROR(RANK(S18,arvutused!$S$5:$S$24,1)+SUMPRODUCT(--(S18=arvutused!$S$5:$S$24),--(U18>arvutused!$U$5:$U$24)),\"\")","v":""},{"$f":"IFERROR(RANK($T18,arvutused!$T$5:$T$24,1),\"\")","v":""},{"$f":"IFERROR(INDEX(Kohtumise_üksikasjad[],SMALL(IF(Kohtumise_üksikasjad[KUUPÄEVA]=Tänane_kuupäev,ROW(Kohtumise_üksikasjad[KUUPÄEVA])-4),ROW(A14)),2),\"\")","v":""},{"$f":"IFERROR(INDEX(Kohtumise_üksikasjad[],SMALL(IF(Kohtumise_üksikasjad[KUUPÄEVA]=Tänane_kuupäev,ROW(Kohtumise_üksikasjad[KUUPÄEVA])-4),ROW(A14)),3),\"\")","v":""},null,14,{"$f":"IFERROR(VLOOKUP(W18,Sordi_tabel[],3,FALSE),\"\")","v":""},{"$f":"IFERROR(VLOOKUP(W18,Sordi_tabel[],4,FALSE),\"\")","v":""}]
[null,"L","2022-09-10","2022-10-08","2022-11-12","2022-12-10","2023-01-07","2023-02-11","2023-03-11","2023-04-08","2023-05-13","2023-06-10","2023-07-08","2023-08-12",{"$nulls":3},{"$f":"IFERROR(RANK(S19,arvutused!$S$5:$S$24,1)+SUMPRODUCT(--(S19=arvutused!$S$5:$S$24),--(U19>arvutused!$U$5:$U$24)),\"\")","v":""},{"$f":"IFERROR(RANK($T19,arvutused!$T$5:$T$24,1),\"\")","v":""},{"$f":"IFERROR(INDEX(Kohtumise_üksikasjad[],SMALL(IF(Kohtumise_üksikasjad[KUUPÄEVA]=Tänane_kuupäev,ROW(Kohtumise_üksikasjad[KUUPÄEVA])-4),ROW(A15)),2),\"\")","v":""},{"$f":"IFERROR(INDEX(Kohtumise_üksikasjad[],SMALL(IF(Kohtumise_üksikasjad[KUUPÄEVA]=Tänane_kuupäev,ROW(Kohtumise_üksikasjad[KUUPÄEVA])-4),ROW(A15)),3),\"\")","v":""},null,15,{"$f":"IFERROR(VLOOKUP(W19,Sordi_tabel[],3,FALSE),\"\")","v":""},{"$f":"IFERROR(VLOOKUP(W19,Sordi_tabel[],4,FALSE),\"\")","v":""}]
[null,"P","2022-09-11","2022-10-09","2022-11-13","2022-12-11","2023-01-08","2023-02-12","2023-03-12","2023-04-09","2023-05-14","2023-06-11","2023-07-09","2023-08-13",{"$nulls":3},{"$f":"IFERROR(RANK(S20,arvutused!$S$5:$S$24,1)+SUMPRODUCT(--(S20=arvutused!$S$5:$S$24),--(U20>arvutused!$U$5:$U$24)),\"\")","v":""},{"$f":"IFERROR(RANK($T20,arvutused!$T$5:$T$24,1),\"\")","v":""},{"$f":"IFERROR(INDEX(Kohtumise_üksikasjad[],SMALL(IF(Kohtumise_üksikasjad[KUUPÄEVA]=Tänane_kuupäev,ROW(Kohtumise_üksikasjad[KUUPÄEVA])-4),ROW(A16)),2),\"\")","v":""},{"$f":"IFERROR(INDEX(Kohtumise_üksikasjad[],SMALL(IF(Kohtumise_üksikasjad[KUUPÄEVA]=Tänane_kuupäev,ROW(Kohtumise_üksikasjad[KUUPÄEVA])-4),ROW(A16)),3),\"\")","v":""},null,16,{"$f":"IFERROR(VLOOKUP(W20,Sordi_tabel[],3,FALSE),\"\")","v":""},{"$f":"IFERROR(VLOOKUP(W20,Sordi_tabel[],4,FALSE),\"\")","v":""}]
[null,"E","2022-09-12","2022-10-10","2022-11-14","2022-12-12","2023-01-09","2023-02-13","2023-03-13","2023-04-10","2023-05-15","2023-06-12","2023-07-10","2023-08-14",{"$nulls":3},{"$f":"IFERROR(RANK(S21,arvutused!$S$5:$S$24,1)+SUMPRODUCT(--(S21=arvutused!$S$5:$S$24),--(U21>arvutused!$U$5:$U$24)),\"\")","v":""},{"$f":"IFERROR(RANK($T21,arvutused!$T$5:$T$24,1),\"\")","v":""},{"$f":"IFERROR(INDEX(Kohtumise_üksikasjad[],SMALL(IF(Kohtumise_üksikasjad[KUUPÄEVA]=Tänane_kuupäev,ROW(Kohtumise_üksikasjad[KUUPÄEVA])-4),ROW(A17)),2),\"\")","v":""},{"$f":"IFERROR(INDEX(Kohtumise_üksikasjad[],SMALL(IF(Kohtumise_üksikasjad[KUUPÄEVA]=Tänane_kuupäev,ROW(Kohtumise_üksikasjad[KUUPÄEVA])-4),ROW(A17)),3),\"\")","v":""},null,17,{"$f":"IFERROR(VLOOKUP(W21,Sordi_tabel[],3,FALSE),\"\")","v":""},{"$f":"IFERROR(VLOOKUP(W21,Sordi_tabel[],4,FALSE),\"\")","v":""}]
[null,"T","2022-09-13","2022-10-11","2022-11-15","2022-12-13","2023-01-10","2023-02-14","2023-03-14","2023-04-11","2023-05-16","2023-06-13","2023-07-11","2023-08-15",{"$nulls":3},{"$f":"IFERROR(RANK(S22,arvutused!$S$5:$S$24,1)+SUMPRODUCT(--(S22=arvutused!$S$5:$S$24),--(U22>arvutused!$U$5:$U$24)),\"\")","v":""},{"$f":"IFERROR(RANK($T22,arvutused!$T$5:$T$24,1),\"\")","v":""},{"$f":"IFERROR(INDEX(Kohtumise_üksikasjad[],SMALL(IF(Kohtumise_üksikasjad[KUUPÄEVA]=Tänane_kuupäev,ROW(Kohtumise_üksikasjad[KUUPÄEVA])-4),ROW(A18)),2),\"\")","v":""},{"$f":"IFERROR(INDEX(Kohtumise_üksikasjad[],SMALL(IF(Kohtumise_üksikasjad[KUUPÄEVA]=Tänane_kuupäev,ROW(Kohtumise_üksikasjad[KUUPÄEVA])-4),ROW(A18)),3),\"\")","v":""},null,18,{"$f":"IFERROR(VLOOKUP(W22,Sordi_tabel[],3,FALSE),\"\")","v":""},{"$f":"IFERROR(VLOOKUP(W22,Sordi_tabel[],4,FALSE),\"\")","v":""}]
[null,"K","2022-09-14","2022-10-12","2022-11-16","2022-12-14","2023-01-11","2023-02-15","2023-03-15","2023-04-12","2023-05-17","2023-06-14","2023-07-12","2023-08-16",{"$nulls":3},{"$f":"IFERROR(RANK(S23,arvutused!$S$5:$S$24,1)+SUMPRODUCT(--(S23=arvutused!$S$5:$S$24),--(U23>arvutused!$U$5:$U$24)),\"\")","v":""},{"$f":"IFERROR(RANK($T23,arvutused!$T$5:$T$24,1),\"\")","v":""},{"$f":"IFERROR(INDEX(Kohtumise_üksikasjad[],SMALL(IF(Kohtumise_üksikasjad[KUUPÄEVA]=Tänane_kuupäev,ROW(Kohtumise_üksikasjad[KUUPÄEVA])-4),ROW(A19)),2),\"\")","v":""},{"$f":"IFERROR(INDEX(Kohtumise_üksikasjad[],SMALL(IF(Kohtumise_üksikasjad[KUUPÄEVA]=Tänane_kuupäev,ROW(Kohtumise_üksikasjad[KUUPÄEVA])-4),ROW(A19)),3),\"\")","v":""},null,19,{"$f":"IFERROR(VLOOKUP(W23,Sordi_tabel[],3,FALSE),\"\")","v":""},{"$f":"IFERROR(VLOOKUP(W23,Sordi_tabel[],4,FALSE),\"\")","v":""}]
[null,"N","2022-09-15","2022-10-13","2022-11-17","2022-12-15","2023-01-12","2023-02-16","2023-03-16","2023-04-13","2023-05-18","2023-06-15","2023-07-13","2023-08-17",{"$nulls":3},{"$f":"IFERROR(RANK(S24,arvutused!$S$5:$S$24,1)+SUMPRODUCT(--(S24=arvutused!$S$5:$S$24),--(U24>arvutused!$U$5:$U$24)),\"\")","v":""},{"$f":"IFERROR(RANK($T24,arvutused!$T$5:$T$24,1),\"\")","v":""},{"$f":"IFERROR(INDEX(Kohtumise_üksikasjad[],SMALL(IF(Kohtumise_üksikasjad[KUUPÄEVA]=Tänane_kuupäev,ROW(Kohtumise_üksikasjad[KUUPÄEVA])-4),ROW(A20)),2),\"\")","v":""},{"$f":"IFERROR(INDEX(Kohtumise_üksikasjad[],SMALL(IF(Kohtumise_üksikasjad[KUUPÄEVA]=Tänane_kuupäev,ROW(Kohtumise_üksikasjad[KUUPÄEVA])-4),ROW(A20)),3),\"\")","v":""},null,20,{"$f":"IFERROR(VLOOKUP(W24,Sordi_tabel[],3,FALSE),\"\")","v":""},{"$f":"IFERROR(VLOOKUP(W24,Sordi_tabel[],4,FALSE),\"\")","v":""}]
[null,"R","2022-09-16","2022-10-14","2022-11-18","2022-12-16","2023-01-13","2023-02-17","2023-03-17","2023-04-14","2023-05-19","2023-06-16","2023-07-14","2023-08-18"]
[null,"L","2022-09-17","2022-10-15","2022-11-19","2022-12-17","2023-01-14","2023-02-18","2023-03-18","2023-04-15","2023-05-20","2023-06-17","2023-07-15","2023-08-19"]
[null,"P","2022-09-18","2022-10-16","2022-11-20","2022-12-18","2023-01-15","2023-02-19","2023-03-19","2023-04-16","2023-05-21","2023-06-18","2023-07-16","2023-08-20"]
[null,"E","2022-09-19","2022-10-17","2022-11-21","2022-12-19","2023-01-16","2023-02-20","2023-03-20","2023-04-17","2023-05-22","2023-06-19","2023-07-17","2023-08-21"]
[null,"T","2022-09-20","2022-10-18","2022-11-22","2022-12-20","2023-01-17","2023-02-21","2023-03-21","2023-04-18","2023-05-23","2023-06-20","2023-07-18","2023-08-22"]
[null,"K","2022-09-21","2022-10-19","2022-11-23","2022-12-21","2023-01-18","2023-02-22","2023-03-22","2023-04-19","2023-05-24","2023-06-21","2023-07-19","2023-08-23"]
[null,"N","2022-09-22","2022-10-20","2022-11-24","2022-12-22","2023-01-19","2023-02-23","2023-03-23","2023-04-20","2023-05-25","2023-06-22","2023-07-20","2023-08-24"]
[null,"R","2022-09-23","2022-10-21","2022-11-25","2022-12-23","2023-01-20","2023-02-24","2023-03-24","2023-04-21","2023-05-26","2023-06-23","2023-07-21","2023-08-25"]
[null,"L","2022-09-24","2022-10-22","2022-11-26","2022-12-24","2023-01-21","2023-02-25","2023-03-25","2023-04-22","2023-05-27","2023-06-24","2023-07-22","2023-08-26"]
[null,"P","2022-09-25","2022-10-23","2022-11-27","2022-12-25","2023-01-22","2023-02-26","2023-03-26","2023-04-23","2023-05-28","2023-06-25","2023-07-23","2023-08-27"]
[null,"E","2022-09-26","2022-10-24","2022-11-28","2022-12-26","2023-01-23","2023-02-27","2023-03-27","2023-04-24","2023-05-29","2023-06-26","2023-07-24","2023-08-28"]
[null,"T","2022-09-27","2022-10-25","2022-11-29","2022-12-27","2023-01-24","2023-02-28","2023-03-28","2023-04-25","2023-05-30","2023-06-27","2023-07-25","2023-08-29"]
[null,"K","2022-09-28","2022-10-26","2022-11-30","2022-12-28","2023-01-25","","2023-03-29","2023-04-26","2023-05-31","2023-06-28","2023-07-26","2023-08-30"]
[null,"N","2022-09-29","2022-10-27","","2022-12-29","2023-01-26","","2023-03-30","2023-04-27","","2023-06-29","2023-07-27","2023-08-31"]
[null,"R","2022-09-30","2022-10-28","","2022-12-30","2023-01-27","","2023-03-31","2023-04-28","","2023-06-30","2023-07-28",""]
[null,"L","","2022-10-29","","2022-12-31","2023-01-28","","","2023-04-29","","","2023-07-29",""]
[null,"P","","2022-10-30","","","2023-01-29","","","2023-04-30","","","2023-07-30",""]
[null,"E","","2022-10-31","","","2023-01-30","","","","","","2023-07-31",""]
[null,"T","","","","","2023-01-31","","","","","","",""]