{"text_format":"3","workbook":"xlsx","n_sheets":5,"sheets":["Acerca de","Hitos","Tareas","Diagrama de Gantt","Datos de gráf. dinám. (ocultos)"],"not_rendered":{"charts":1,"defined_names":4},"read":"whole","date_system":"1900"}

{"sheet":"Acerca de","index":0,"n_rows":11,"n_cols":1,"rows_kept":11}
["Acerca de este libro"]
["Introduzca la información sobre los hitos y las tareas en las hojas de cálculo Hitos y Tareas.  Para representar hitos en la escala de tiempo, escriba 0 en la columna Número y, después, actualice la posición de la etiqueta para que esté “debajo” y evitar que se muestren etiquetas superpuestas.\n\nLa columna de posición en la tabla Hito representa los hitos en el gráfico de tareas, ya sea en la misma fila o en filas apiladas. Para representarlos en la misma fila, escriba el mismo número en esta columna para cada hito. Para representarlos en filas distintas, escriba números distintos. Los gráficos de datos de ejemplo representan todos los hitos en la posición de fila 2.\n"]
["Instrucciones para lectores de pantalla"]
["\nHay 5 hojas de cálculo en este libro:\nAcerca de\nHitos\nTareas\nDiagrama de Gantt\nDatos de gráf. dinám. (ocultos)\n\nLas instrucciones de las hojas de cálculo se encuentran en la columna A de cada hoja, a partir de la celda A1. Están escritas con texto oculto. Cada paso le guiará a través de la información de esa fila. Los pasos posteriores continúan en la celda A2, A3, y así sucesivamente, a menos que se indique de forma explícita. Por ejemplo, el texto de una instrucción podría ser “Vaya a la celda A6” para continuar con el siguiente paso. \n\nEl texto oculto no se imprimirá.\nPara quitar las instrucciones de cualquier hoja de cálculo, es suficiente con eliminar la columna A.\n"]
["Datos de gráf. dinám. (ocultos)"]
["\nNo elimine ni modifique el contenido en la hoja de cálculo oculta. Al hacerlo, podría poner en peligro la integridad del diagrama de Gantt.\n\nLos datos en esta tabla pueden aparecer en blanco y puede que las fechas parezcan incorrectas; pero no rellene, edite, elimine ni, en caso alguno, modifique estos datos, ya que podrían sobrescribirse las fórmulas y producirse errores en la representación del gráfico.\n\nLa tabla “Hito dinámico” permite representar 15 hitos. Para representar más de 15, solo tiene que expandir la tabla para acomodar el número. Recuerde que solo tiene que agregar datos de los hitos actuales en la hoja de cálculo Datos del gráfico.\n"]
["Sugerencias"]
["\nDe forma predeterminada, los hitos se representan en la fila 1 del diagrama de Gantt con la columna de posición en la hoja de cálculo Datos del gráfico, a partir de la celda C5. Para representar hitos en filas distintas, solo tiene que cambiar el número. \n"]
["La configuración predeterminada es resaltar la fecha del día actual en el diagrama de Gantt. Para dejar de resaltar la fecha actual, solo tiene que seleccionar “No” en la hoja de cálculo Datos de gráfico de la celda D2.\n"]
["La escala de tiempo de fechas del diagrama de Gantt se representa con una separación de 5 fechas entre ellas. Para cambiar esto, seleccione la escala de tiempo en la hoja de cálculo Diagrama de Gantt y, después, haga clic en Formato de ejes. Por ejemplo, cambie la unidad mayor de 5 a 1 o 10. \n"]
["Esta es la última instrucción de esta hoja de cálculo."]

{"sheet":"Hitos","index":1,"n_rows":26,"n_cols":5,"rows_kept":26}
["Cree un diagrama de Gantt de seguimiento de fechas en esta hoja de cálculo.\nEl título de esta hoja de cálculo se encuentra en la celda B1. \nPara obtener información sobre cómo usar esta hoja de cálculo, incluidas las instrucciones para lectores de pantalla, consulte la hoja de cálculo Información.\nDesplácese hacia abajo por la columna A para obtener más instrucciones.","Diagrama de Gantt de seguimiento de fechas"]
["Seleccione la opción “Sí” en la celda D2 para resaltar la fecha actual en la hoja de cálculo Diagrama de Gantt. \nSeleccione la opción “No” en la celda D2 si no quiere resaltar la fecha actual en la hoja de cálculo Diagrama de Gantt.\nEn la celda D2, seleccione ALT+Flecha abajo para ver las opciones.","¿Quiere realizar un seguimiento de la fecha actual?",null,"Sí"]
["El encabezado de hitos de la tabla Hito se encuentra en la celda B3.\nEl encabezado de las tareas de la tabla Tareas se encuentra en la celda G3.","Hitos"]
["La información sobre las columnas en la tabla Hito se encuentra en esta fila desde las celdas B4 a E4.\nLa información sobre las columnas en la tabla Tareas se encuentra en esta fila desde las celdas G4 a J4.","Esta columna se ordenará de forma secuencial.","La columna de posición, los hitos de gráficos en el gráfico de tareas.","Escriba la fecha del hito en esta columna.","Escriba una descripción del hito en esta columna. Estas descripciones aparecerán en el gráfico."]
["Los encabezados de la tabla Hito se encuentran en las celdas B5 a E5. Los encabezados de la tabla Tareas se encuentran en las celdas G5 a J5.\nLos datos de ejemplo de los hitos se encuentran en las celdas B6 a E11. \nLos datos de ejemplo de tareas se encuentran en las celdas G6 a J17.\nLa siguiente instrucción se encuentra en la celda A21.","N.º","Posición","Fecha","Hito"]
[null,1,1,{"$f":"Fecha_de_inicio+10","v":"2024-04-19"},"Hito 1"]
[null,2,1,{"$f":"TODAY()+25","v":"2024-05-05"},"Hito 2"]
[null,3,1,{"$f":"TODAY()+35","v":"2024-05-15"},"Hito 3"]
[null,4,1,{"$f":"TODAY()+45","v":"2024-05-25"},"Hito 4"]
[null,5,1,{"$f":"TODAY()+60","v":"2024-06-09"},"Hito 5"]
[null,6,1,{"$f":"TODAY()+70","v":"2024-06-19"},"Hito 6"]
{"$rows_empty":9}
["Para agregar más hitos, inserte una fila nueva encima de esta.\nTenga en cuenta que el número predeterminado de hitos que se representará en el gráfico es 15. Para agregar nuevos hitos, es necesario realizar un cambio en la hoja de cálculo oculta. Para obtener más información, vea la celda A9 de la hoja de cálculo Información.\nLa siguiente instrucción se encuentra en la celda A26.","Para agregar más hitos, inserte una fila nueva encima de esta."]
[]
[]
[]
[]
["Hay una nota en la celda G26.\nEsta es la última instrucción de esta hoja de cálculo."]

{"sheet":"Tareas","index":2,"n_rows":26,"n_cols":6,"rows_kept":26}
["Cree un diagrama de Gantt de seguimiento de fechas en esta hoja de cálculo.\nEl título de esta hoja de cálculo se encuentra en la celda B1. \nPara obtener información sobre cómo usar esta hoja de cálculo, incluidas las instrucciones para lectores de pantalla, consulte la hoja de cálculo Información.\nDesplácese hacia abajo por la columna A para obtener más instrucciones.","Diagrama de Gantt de seguimiento de fechas"]
[]
["El encabezado de hitos de la tabla Hito se encuentra en la celda B3.\nEl encabezado de las tareas de la tabla Tareas se encuentra en la celda G3.","Tareas"]
[null,"Esta columna se ordenará de forma secuencial.","Escriba la fecha de inicio de cada tarea debajo. Para obtener los mejores resultados, ordene esta columna en orden ascendente.","Escriba la fecha de finalización de cada tarea o actividad debajo, en esta columna.","Escriba las tareas o actividades en esta columna.","La columna calculada automáticamente se usa para representar la duración de cada tarea. No la elimine ni modifique."]
[null,"N.º","Fecha de inicio","Fecha de finalización","Tarea","Duración en días"]
[null,1,{"$f":"TODAY()-1","v":"2024-04-09"},{"$f":"Tareas[[#This Row],[Fecha de inicio]]+1","v":"2024-04-10"},"Actividad 1",{"$f":"IFERROR(IF(LEN(Tareas[[#This Row],[Fecha de inicio]])=0,\"\",(INT(Tareas[[#This Row],[Fecha de finalización]])-INT(Tareas[[#This Row],[Fecha de inicio]]))-(INT(Tareas[[#This Row],[Fecha de inicio]])-INT(Tareas[[#This Row],[Fecha de inicio]]))+1),\"\")","v":2}]
[null,2,{"$f":"TODAY()","v":"2024-04-10"},{"$f":"Tareas[[#This Row],[Fecha de inicio]]+1","v":"2024-04-11"},"Actividad 2",{"$f":"IFERROR(IF(LEN(Tareas[[#This Row],[Fecha de inicio]])=0,\"\",(INT(Tareas[[#This Row],[Fecha de finalización]])-INT(Tareas[[#This Row],[Fecha de inicio]]))-(INT(Tareas[[#This Row],[Fecha de inicio]])-INT(Tareas[[#This Row],[Fecha de inicio]]))+1),\"\")","v":2}]
[null,3,{"$f":"TODAY()","v":"2024-04-10"},{"$f":"Tareas[[#This Row],[Fecha de inicio]]+5","v":"2024-04-15"},"Actividad 3",{"$f":"IFERROR(IF(LEN(Tareas[[#This Row],[Fecha de inicio]])=0,\"\",(INT(Tareas[[#This Row],[Fecha de finalización]])-INT(Tareas[[#This Row],[Fecha de inicio]]))-(INT(Tareas[[#This Row],[Fecha de inicio]])-INT(Tareas[[#This Row],[Fecha de inicio]]))+1),\"\")","v":6}]
[null,4,{"$f":"TODAY()+1","v":"2024-04-11"},{"$f":"Tareas[[#This Row],[Fecha de inicio]]+7","v":"2024-04-18"},"Actividad 4",{"$f":"IFERROR(IF(LEN(Tareas[[#This Row],[Fecha de inicio]])=0,\"\",(INT(Tareas[[#This Row],[Fecha de finalización]])-INT(Tareas[[#This Row],[Fecha de inicio]]))-(INT(Tareas[[#This Row],[Fecha de inicio]])-INT(Tareas[[#This Row],[Fecha de inicio]]))+1),\"\")","v":8}]
[null,5,{"$f":"TODAY()+8","v":"2024-04-18"},{"$f":"Tareas[[#This Row],[Fecha de inicio]]+10","v":"2024-04-28"},"Actividad 5",{"$f":"IFERROR(IF(LEN(Tareas[[#This Row],[Fecha de inicio]])=0,\"\",(INT(Tareas[[#This Row],[Fecha de finalización]])-INT(Tareas[[#This Row],[Fecha de inicio]]))-(INT(Tareas[[#This Row],[Fecha de inicio]])-INT(Tareas[[#This Row],[Fecha de inicio]]))+1),\"\")","v":11}]
[null,6,{"$f":"TODAY()+12","v":"2024-04-22"},{"$f":"Tareas[[#This Row],[Fecha de inicio]]+30","v":"2024-05-22"},"Actividad 6",{"$f":"IFERROR(IF(LEN(Tareas[[#This Row],[Fecha de inicio]])=0,\"\",(INT(Tareas[[#This Row],[Fecha de finalización]])-INT(Tareas[[#This Row],[Fecha de inicio]]))-(INT(Tareas[[#This Row],[Fecha de inicio]])-INT(Tareas[[#This Row],[Fecha de inicio]]))+1),\"\")","v":31}]
[null,7,{"$f":"TODAY()+15","v":"2024-04-25"},{"$f":"Tareas[[#This Row],[Fecha de inicio]]+15","v":"2024-05-10"},"Actividad 7",{"$f":"IFERROR(IF(LEN(Tareas[[#This Row],[Fecha de inicio]])=0,\"\",(INT(Tareas[[#This Row],[Fecha de finalización]])-INT(Tareas[[#This Row],[Fecha de inicio]]))-(INT(Tareas[[#This Row],[Fecha de inicio]])-INT(Tareas[[#This Row],[Fecha de inicio]]))+1),\"\")","v":16}]
[null,8,{"$f":"TODAY()+25","v":"2024-05-05"},{"$f":"Tareas[[#This Row],[Fecha de inicio]]+5","v":"2024-05-10"},"Actividad 8",{"$f":"IFERROR(IF(LEN(Tareas[[#This Row],[Fecha de inicio]])=0,\"\",(INT(Tareas[[#This Row],[Fecha de finalización]])-INT(Tareas[[#This Row],[Fecha de inicio]]))-(INT(Tareas[[#This Row],[Fecha de inicio]])-INT(Tareas[[#This Row],[Fecha de inicio]]))+1),\"\")","v":6}]
[null,9,{"$f":"TODAY()+34","v":"2024-05-14"},{"$f":"Tareas[[#This Row],[Fecha de inicio]]+2","v":"2024-05-16"},"Actividad 9",{"$f":"IFERROR(IF(LEN(Tareas[[#This Row],[Fecha de inicio]])=0,\"\",(INT(Tareas[[#This Row],[Fecha de finalización]])-INT(Tareas[[#This Row],[Fecha de inicio]]))-(INT(Tareas[[#This Row],[Fecha de inicio]])-INT(Tareas[[#This Row],[Fecha de inicio]]))+1),\"\")","v":3}]
[null,10,{"$f":"TODAY()+40","v":"2024-05-20"},{"$f":"Tareas[[#This Row],[Fecha de inicio]]+30","v":"2024-06-19"},"Actividad 10",{"$f":"IFERROR(IF(LEN(Tareas[[#This Row],[Fecha de inicio]])=0,\"\",(INT(Tareas[[#This Row],[Fecha de finalización]])-INT(Tareas[[#This Row],[Fecha de inicio]]))-(INT(Tareas[[#This Row],[Fecha de inicio]])-INT(Tareas[[#This Row],[Fecha de inicio]]))+1),\"\")","v":31}]
[null,11,{"$f":"TODAY()+42","v":"2024-05-22"},{"$f":"Tareas[[#This Row],[Fecha de inicio]]+23","v":"2024-06-14"},"Actividad 11",{"$f":"IFERROR(IF(LEN(Tareas[[#This Row],[Fecha de inicio]])=0,\"\",(INT(Tareas[[#This Row],[Fecha de finalización]])-INT(Tareas[[#This Row],[Fecha de inicio]]))-(INT(Tareas[[#This Row],[Fecha de inicio]])-INT(Tareas[[#This Row],[Fecha de inicio]]))+1),\"\")","v":24}]
[null,12,{"$f":"TODAY()+50","v":"2024-05-30"},{"$f":"Tareas[[#This Row],[Fecha de inicio]]+5","v":"2024-06-04"},"Actividad 12",{"$f":"IFERROR(IF(LEN(Tareas[[#This Row],[Fecha de inicio]])=0,\"\",(INT(Tareas[[#This Row],[Fecha de finalización]])-INT(Tareas[[#This Row],[Fecha de inicio]]))-(INT(Tareas[[#This Row],[Fecha de inicio]])-INT(Tareas[[#This Row],[Fecha de inicio]]))+1),\"\")","v":6}]
[{"$nulls":5},{"$f":"IFERROR(IF(LEN(Tareas[[#This Row],[Fecha de inicio]])=0,\"\",(INT(Tareas[[#This Row],[Fecha de finalización]])-INT(Tareas[[#This Row],[Fecha de inicio]]))-(INT(Tareas[[#This Row],[Fecha de inicio]])-INT(Tareas[[#This Row],[Fecha de inicio]]))+1),\"\")","v":""}]
[{"$nulls":5},{"$f":"IFERROR(IF(LEN(Tareas[[#This Row],[Fecha de inicio]])=0,\"\",(INT(Tareas[[#This Row],[Fecha de finalización]])-INT(Tareas[[#This Row],[Fecha de inicio]]))-(INT(Tareas[[#This Row],[Fecha de inicio]])-INT(Tareas[[#This Row],[Fecha de inicio]]))+1),\"\")","v":""}]
[{"$nulls":5},{"$f":"IFERROR(IF(LEN(Tareas[[#This Row],[Fecha de inicio]])=0,\"\",(INT(Tareas[[#This Row],[Fecha de finalización]])-INT(Tareas[[#This Row],[Fecha de inicio]]))-(INT(Tareas[[#This Row],[Fecha de inicio]])-INT(Tareas[[#This Row],[Fecha de inicio]]))+1),\"\")","v":""}]
{"$rows_left_out":7}
{"sheet":"Diagrama de Gantt","index":3,"n_rows":1,"n_cols":1,"rows_kept":1}
["El diagrama de Gantt donde se muestran los datos del día actual, los hitos y las tareas en un intervalo de fechas se encuentra en esta hoja de cálculo. \nEn la fila 1, desde las celdas B1 a R1, se muestra una barra de desplazamiento e incrementa el intervalo de fechas para mostrar hitos futuros.\nEl gráfico se muestra en las celdas B2 a R3.\nEsta es la última instrucción de esta hoja de cálculo."]

{"sheet":"Datos de gráf. dinám. (ocultos)","index":4,"n_rows":32,"n_cols":10,"rows_kept":32,"hidden":true}
["El título de esta hoja de cálculo se encuentra en la celda B1.","Datos de gráfico dinámicos, NO edite ni elimine esta hoja de cálculo."]
["El título de la tabla se encuentra las celdas B2 y C2.",{"$f":"IF(TODAY()>=MIN(DatosDeTareasDinámicas[Fecha de inicio]),\"Hoy\",\"\")","v":"Hoy"},"resaltar"]
["El encabezado de tabla se encuentra en las celdas B3 y C3. Estas coordenadas crean el elemento resaltado del día actual en el gráfico.\nLa primera columna indica el día, la segunda se usa para dibujar la línea que resalta el día actual.\nLa fecha de la primera columna puede cambiar para que el intervalo de fechas del gráfico pueda leerse correctamente a medida que avancen las fechas, pero una coordenada Y de 0 indica que no se dibujará ninguna línea.\nNo modifique ni elimine este contenido, ya que podrían producirse errores en el gráfico. Para dejar de resaltar la fecha actual, solo tiene que seleccionar “No” en la hoja de cálculo Datos de gráfico de la celda D2.\nLa siguiente instrucción se encuentra en la celda A7.","coordenada X para resaltar el día actual","coordenada Y"]
[null,{"$f":"IFERROR(IF(TODAY()<MIN(DatosDeTareasDinámicas[Fecha de inicio]),MIN($B$11,MIN(DatosDeTareasDinámicas[Fecha de inicio])),TODAY()),TODAY())","v":"2024-04-10"},{"$f":"IFERROR(IF(Seguimiento_hoy=\"Sí\",IF(TODAY()<MIN(DatosDeTareasDinámicas[Fecha de inicio]),0,9),0),0)","v":9}]
[null,{"$f":"IFERROR(IF(TODAY()<MIN(DatosDeTareasDinámicas[Fecha de inicio]),MIN($B$11,MIN(DatosDeTareasDinámicas[Fecha de inicio])),TODAY()),TODAY())","v":"2024-04-10"},{"$f":"IFERROR(IF(Seguimiento_hoy=\"Sí\",IF(TODAY()<MIN(DatosDeTareasDinámicas[Fecha de inicio]),0,9),0),0)","v":9}]
[]
["El encabezado de tabla se encuentra en la celda B7.\nEl incremento de desplazamiento en la celda B8 representa los datos del gráfico y se muestra de forma visual en el diagrama de Gantt de forma individual. \nAl desplazarse con la barra de desplazamiento de la parte superior del diagrama, en la fila 1 de la hoja de cálculo Diagrama de Gantt, se incrementará este número.\nEl diagrama funciona mejor con incrementos individuales.\nLa siguiente instrucción se encuentra en la celda A10.","incremento de desplazamiento"]
[null,0]
[]
["El encabezado de tabla se encuentra en las celdas B10 y D10.\nEl intervalo del gráfico ayuda a seleccionar el intervalo de tareas e hitos adecuado. No modifique estos campos.\nEl número de vencimiento mantiene legible el gráfico al vencer las tareas y mostrar solo las que se encuentran dentro del intervalo.  No modifique este número.\nLa siguiente instrucción se encuentra en la celda A14.\n\n","Intervalo del gráfico",null,"vencimiento"]
[null,{"$f":"IFERROR(IF(IncrementoDeDesplazamiento[incremento de desplazamiento]=0,Fecha_de_inicio,IF(Fecha_de_inicio+IncrementoDeDesplazamiento[incremento de desplazamiento]*15<Fecha_de_finalización,Fecha_de_inicio+IncrementoDeDesplazamiento[incremento de desplazamiento]*15,Fecha_de_finalización-1)),\"\")","v":"2024-04-09"},null,45]
[null,{"$f":"IFERROR(IF($B$11+15<Fecha_de_finalización,$B$11+15,Fecha_de_finalización),\"\")","v":"2024-04-24"}]
[]
["El encabezado de tabla de los datos de hito dinámicos se encuentra en las celdas B14 a E14. Hay una nota en la celda F14.\nEsta tabla creará el diagrama de Gantt en la hoja de cálculo Diagrama de Gantt y representará 7 hitos a la vez.\nLos datos de este gráfico se generan automáticamente basándose en el contenido de la tabla anterior. \nNo edite ni elimine esta tabla o sus contenidos.\nLa siguiente instrucción se encuentra en la celda A17.","Tareas","Fecha de inicio","Duración de la tarea en días","posición","<-- Esta tabla crea el diagrama de Gantt, donde se representan 7 hitos a la vez."]
[null,{"$f":"IFERROR(IF(LEN(OFFSET(Tareas!$C6,IncrementoDeDesplazamiento[incremento de desplazamiento],0,1,1))=0,\"\",IF(OR(OFFSET(Tareas!$D6,IncrementoDeDesplazamiento[incremento de desplazamiento],0,1,1)<=$B$12,OFFSET(Tareas!$C6,IncrementoDeDesplazamiento[incremento de desplazamiento],0,1,1)>=($B$11-$D$11)),INDEX(Tareas[],OFFSET(Tareas!$B6,IncrementoDeDesplazamiento[incremento de desplazamiento],0,1,1),4),\"\")),\"\")","v":"Actividad 1"},{"$f":"IFERROR(IF(LEN(DatosDeTareasDinámicas[[#This Row],[Tareas]])=0,$B$11,INDEX(Tareas[],OFFSET(Tareas!$B6,IncrementoDeDesplazamiento[incremento de desplazamiento],0,1,1),2)),\"\")","v":"2024-04-09"},{"$f":"IFERROR(IF(LEN(DatosDeTareasDinámicas[[#This Row],[Tareas]])=0,0,IF(AND(Tareas!$C6<=$B$12,Tareas!$D6>=$B$12),ABS(OFFSET(Tareas!$C6,IncrementoDeDesplazamiento[incremento de desplazamiento],0,1,1)-$B$12)+1,OFFSET(Tareas!$F6,IncrementoDeDesplazamiento[incremento de desplazamiento],0,1,1))),\"\")","v":2},{"$f":"IFERROR(IF(LEN(DatosDeTareasDinámicas[[#This Row],[Tareas]])=0,\"\",8),\"\")","v":8}]
[null,{"$f":"IFERROR(IF(LEN(OFFSET(Tareas!$C7,IncrementoDeDesplazamiento[incremento de desplazamiento],0,1,1))=0,\"\",IF(OR(OFFSET(Tareas!$D7,IncrementoDeDesplazamiento[incremento de desplazamiento],0,1,1)<=$B$12,OFFSET(Tareas!$C7,IncrementoDeDesplazamiento[incremento de desplazamiento],0,1,1)>=($B$11-$D$11)),INDEX(Tareas[],OFFSET(Tareas!$B7,IncrementoDeDesplazamiento[incremento de desplazamiento],0,1,1),4),\"\")),\"\")","v":"Actividad 2"},{"$f":"IFERROR(IF(LEN(DatosDeTareasDinámicas[[#This Row],[Tareas]])=0,$B$11,INDEX(Tareas[],OFFSET(Tareas!$B7,IncrementoDeDesplazamiento[incremento de desplazamiento],0,1,1),2)),\"\")","v":"2024-04-10"},{"$f":"IFERROR(IF(LEN(DatosDeTareasDinámicas[[#This Row],[Tareas]])=0,0,IF(AND(Tareas!$C7<=$B$12,Tareas!$D7>=$B$12),ABS(OFFSET(Tareas!$C7,IncrementoDeDesplazamiento[incremento de desplazamiento],0,1,1)-$B$12)+1,OFFSET(Tareas!$F7,IncrementoDeDesplazamiento[incremento de desplazamiento],0,1,1))),\"\")","v":2},{"$f":"IFERROR(IF(LEN(DatosDeTareasDinámicas[[#This Row],[Tareas]])=0,\"\",7),\"\")","v":7},null,"Gráfico de hitos"]
["Las celdas G15 a I15 contienen los encabezados de la tabla de los datos de hito dinámicos. \nLos datos en esta tabla pueden aparecer en blanco y puede que las fechas parezcan incorrectas; pero no rellene, edite, elimine ni, en caso alguno, modifique estos datos, ya que podrían sobrescribirse las fórmulas y producirse errores en la representación del gráfico.\nLa tabla permite representar 15 hitos. Para representar más de 15, solo tiene que expandir la tabla para acomodar el número. Recuerde que solo tiene que agregar los hitos de la hoja de cálculo Datos del gráfico. No agregue contenidos en esta tabla.\nHay una nota en la celda J15.\nLa siguiente instrucción se encuentra en la celda A32.",{"$f":"IFERROR(IF(LEN(OFFSET(Tareas!$C8,IncrementoDeDesplazamiento[incremento de desplazamiento],0,1,1))=0,\"\",IF(OR(OFFSET(Tareas!$D8,IncrementoDeDesplazamiento[incremento de desplazamiento],0,1,1)<=$B$12,OFFSET(Tareas!$C8,IncrementoDeDesplazamiento[incremento de desplazamiento],0,1,1)>=($B$11-$D$11)),INDEX(Tareas[],OFFSET(Tareas!$B8,IncrementoDeDesplazamiento[incremento de desplazamiento],0,1,1),4),\"\")),\"\")","v":"Actividad 3"},{"$f":"IFERROR(IF(LEN(DatosDeTareasDinámicas[[#This Row],[Tareas]])=0,$B$11,INDEX(Tareas[],OFFSET(Tareas!$B8,IncrementoDeDesplazamiento[incremento de desplazamiento],0,1,1),2)),\"\")","v":"2024-04-10"},{"$f":"IFERROR(IF(LEN(DatosDeTareasDinámicas[[#This Row],[Tareas]])=0,0,IF(AND(Tareas!$C8<=$B$12,Tareas!$D8>=$B$12),ABS(OFFSET(Tareas!$C8,IncrementoDeDesplazamiento[incremento de desplazamiento],0,1,1)-$B$12)+1,OFFSET(Tareas!$F8,IncrementoDeDesplazamiento[incremento de desplazamiento],0,1,1))),\"\")","v":6},{"$f":"IFERROR(IF(LEN(DatosDeTareasDinámicas[[#This Row],[Tareas]])=0,\"\",6),\"\")","v":6},null,"Hitos","Fecha","LÍNEA BASE","<-- Esta tabla crea los marcadores de hitos en el diagrama de Gantt, donde se representan solo los hitos con espacio suficiente en el intervalo de fechas que se muestra; hasta 15 hitos."]
[null,{"$f":"IFERROR(IF(LEN(OFFSET(Tareas!$C9,IncrementoDeDesplazamiento[incremento de desplazamiento],0,1,1))=0,\"\",IF(OR(OFFSET(Tareas!$D9,IncrementoDeDesplazamiento[incremento de desplazamiento],0,1,1)<=$B$12,OFFSET(Tareas!$C9,IncrementoDeDesplazamiento[incremento de desplazamiento],0,1,1)>=($B$11-$D$11)),INDEX(Tareas[],OFFSET(Tareas!$B9,IncrementoDeDesplazamiento[incremento de desplazamiento],0,1,1),4),\"\")),\"\")","v":"Actividad 4"},{"$f":"IFERROR(IF(LEN(DatosDeTareasDinámicas[[#This Row],[Tareas]])=0,$B$11,INDEX(Tareas[],OFFSET(Tareas!$B9,IncrementoDeDesplazamiento[incremento de desplazamiento],0,1,1),2)),\"\")","v":"2024-04-11"},{"$f":"IFERROR(IF(LEN(DatosDeTareasDinámicas[[#This Row],[Tareas]])=0,0,IF(AND(Tareas!$C9<=$B$12,Tareas!$D9>=$B$12),ABS(OFFSET(Tareas!$C9,IncrementoDeDesplazamiento[incremento de desplazamiento],0,1,1)-$B$12)+1,OFFSET(Tareas!$F9,IncrementoDeDesplazamiento[incremento de desplazamiento],0,1,1))),\"\")","v":8},{"$f":"IFERROR(IF(LEN(DatosDeTareasDinámicas[[#This Row],[Tareas]])=0,\"\",5),\"\")","v":5},null,{"$f":"IFERROR(IF(LEN(Hitos!D6)=0,\"\",IF(AND(Hitos!D6<=$B$12,Hitos!D6>=$B$11-$D$11),Hitos!E6,\"\")),\"\")","v":"Hito 1"},{"$f":"IFERROR(IF(LEN(DatosDeHitoDinámicos[[#This Row],[Hitos]])=0,$B$12,Hitos!$D6),2)","v":"2024-04-19"},{"$f":"IFERROR(IF(LEN(DatosDeHitoDinámicos[[#This Row],[Hitos]])=0,\"\",Hitos!$C6),\"\")","v":1}]
[null,{"$f":"IFERROR(IF(LEN(OFFSET(Tareas!$C10,IncrementoDeDesplazamiento[incremento de desplazamiento],0,1,1))=0,\"\",IF(OR(OFFSET(Tareas!$D10,IncrementoDeDesplazamiento[incremento de desplazamiento],0,1,1)<=$B$12,OFFSET(Tareas!$C10,IncrementoDeDesplazamiento[incremento de desplazamiento],0,1,1)>=($B$11-$D$11)),INDEX(Tareas[],OFFSET(Tareas!$B10,IncrementoDeDesplazamiento[incremento de desplazamiento],0,1,1),4),\"\")),\"\")","v":"Actividad 5"},{"$f":"IFERROR(IF(LEN(DatosDeTareasDinámicas[[#This Row],[Tareas]])=0,$B$11,INDEX(Tareas[],OFFSET(Tareas!$B10,IncrementoDeDesplazamiento[incremento de desplazamiento],0,1,1),2)),\"\")","v":"2024-04-18"},{"$f":"IFERROR(IF(LEN(DatosDeTareasDinámicas[[#This Row],[Tareas]])=0,0,IF(AND(Tareas!$C10<=$B$12,Tareas!$D10>=$B$12),ABS(OFFSET(Tareas!$C10,IncrementoDeDesplazamiento[incremento de desplazamiento],0,1,1)-$B$12)+1,OFFSET(Tareas!$F10,IncrementoDeDesplazamiento[incremento de desplazamiento],0,1,1))),\"\")","v":7},{"$f":"IFERROR(IF(LEN(DatosDeTareasDinámicas[[#This Row],[Tareas]])=0,\"\",4),\"\")","v":4},null,{"$f":"IFERROR(IF(LEN(Hitos!D7)=0,\"\",IF(AND(Hitos!D7<=$B$12,Hitos!D7>=$B$11-$D$11),Hitos!E7,\"\")),\"\")","v":""},{"$f":"IFERROR(IF(LEN(DatosDeHitoDinámicos[[#This Row],[Hitos]])=0,$B$12,Hitos!$D7),2)","v":"2024-04-24"},{"$f":"IFERROR(IF(LEN(DatosDeHitoDinámicos[[#This Row],[Hitos]])=0,\"\",Hitos!$C7),\"\")","v":""}]
[null,{"$f":"IFERROR(IF(LEN(OFFSET(Tareas!$C11,IncrementoDeDesplazamiento[incremento de desplazamiento],0,1,1))=0,\"\",IF(OR(OFFSET(Tareas!$D11,IncrementoDeDesplazamiento[incremento de desplazamiento],0,1,1)<=$B$12,OFFSET(Tareas!$C11,IncrementoDeDesplazamiento[incremento de desplazamiento],0,1,1)>=($B$11-$D$11)),INDEX(Tareas[],OFFSET(Tareas!$B11,IncrementoDeDesplazamiento[incremento de desplazamiento],0,1,1),4),\"\")),\"\")","v":"Actividad 6"},{"$f":"IFERROR(IF(LEN(DatosDeTareasDinámicas[[#This Row],[Tareas]])=0,$B$11,INDEX(Tareas[],OFFSET(Tareas!$B11,IncrementoDeDesplazamiento[incremento de desplazamiento],0,1,1),2)),\"\")","v":"2024-04-22"},{"$f":"IFERROR(IF(LEN(DatosDeTareasDinámicas[[#This Row],[Tareas]])=0,0,IF(AND(Tareas!$C11<=$B$12,Tareas!$D11>=$B$12),ABS(OFFSET(Tareas!$C11,IncrementoDeDesplazamiento[incremento de desplazamiento],0,1,1)-$B$12)+1,OFFSET(Tareas!$F11,IncrementoDeDesplazamiento[incremento de desplazamiento],0,1,1))),\"\")","v":3},{"$f":"IFERROR(IF(LEN(DatosDeTareasDinámicas[[#This Row],[Tareas]])=0,\"\",3),\"\")","v":3},null,{"$f":"IFERROR(IF(LEN(Hitos!D8)=0,\"\",IF(AND(Hitos!D8<=$B$12,Hitos!D8>=$B$11-$D$11),Hitos!E8,\"\")),\"\")","v":""},{"$f":"IFERROR(IF(LEN(DatosDeHitoDinámicos[[#This Row],[Hitos]])=0,$B$12,Hitos!$D8),2)","v":"2024-04-24"},{"$f":"IFERROR(IF(LEN(DatosDeHitoDinámicos[[#This Row],[Hitos]])=0,\"\",Hitos!$C8),\"\")","v":""}]
{"$rows_left_out":12}