{"text_format":"3","workbook":"xlsx","n_sheets":4,"sheets":["Inicio","PARÁMETROS DEL PROYECTO","DETALLES DEL PROYECTO","TOTALES DEL PROYECTO"],"not_rendered":{"charts":2,"defined_names":3,"pivot_tables":1},"read":"whole","date_system":"1900"}

{"sheet":"Inicio","index":0,"n_rows":8,"n_cols":2,"rows_kept":8}
[null,"INFORMACIÓN SOBRE ESTA PLANTILLA"]
[]
[null,"Use este libro para realizar un seguimiento de los parámetros, detalles y totales del proyecto durante la Plan de proyecto para bufetes de abogados."]
[null,"Rellene el nombre de la empresa en la hoja de cálculo Parámetros del proyecto y se actualizará automáticamente en otras hojas de cálculo."]
[null,"Escriba la información en la hoja de cálculo Parámetros del proyecto para actualizar los gráficos de columnas y la hoja de cálculo Detalles del proyecto. La tabla dinámica en la hoja de cálculo Totales del proyecto se actualiza automáticamente."]
[null,"Nota:  "]
{"$rows_left_out":3}
{"sheet":"PARÁMETROS DEL PROYECTO","index":1,"n_rows":19,"n_cols":9,"rows_kept":19}
["Cree los Parámetros del proyecto en esta hoja de cálculo. Escriba el nombre de la empresa en la celda de la derecha. En las celdas de esta columna encontrará instrucciones útiles.","Nombre de la empresa"]
["El título de esta hoja de cálculo se encuentra en la celda de la derecha.","Plan de proyecto para bufetes de abogados"]
["El mensaje de confidencialidad está en la celda a la derecha.",{"$f":"B1&\" confidencial\"","v":"Nombre de la empresa confidencial"}]
["Hay una sugerencia en la celda de la derecha.","Las celdas sombreadas se calculan automáticamente. No es necesario que escriba nada en ellas."]
["Escriba la información en la tabla Parámetros que comienza en la celda de la derecha. La instrucción siguiente se encuentra en la celda A12.","TIPO DE PROYECTO","PARTNER GENERAL","ABOGADO DE EMPRESA","FISCAL DE DEFENSA","ABOGADO DE PROPIEDAD INTELECTUAL","ABOGADO QUIEBRA","PERSONAL DE ADMINISTRACIÓN","TOTAL"]
[null,"Incorporación de la empresa",{"v":0.1,"d":"10%"},{"v":0.4,"d":"40%"},{"v":0,"d":"0%"},{"v":0,"d":"0%"},{"v":0,"d":"0%"},{"v":0.5,"d":"50%"},{"$f":"SUM(Parámetros[[#This Row],[PARTNER GENERAL]:[PERSONAL DE ADMINISTRACIÓN]])","v":{"v":1,"d":"100%"}}]
{"$rows_left_out":14}
{"sheet":"DETALLES DEL PROYECTO","index":2,"n_rows":10,"n_cols":25,"rows_kept":10,"merged":[[1,24,8,28]]}
["Cree los Detalles del proyecto en esta hoja de cálculo. El nombre de la empresa se actualiza automáticamente en celda de la derecha. En las celdas de esta columna encontrará instrucciones útiles. Presione la flecha abajo para empezar.",{"$f":"'PARÁMETROS DEL PROYECTO'!B1","v":"Nombre de la empresa"}]
["El título de esta hoja de cálculo se encuentra en la celda a la derecha y la información de sugerencias se detalla en la celda Y2.",{"$f":"'PARÁMETROS DEL PROYECTO'!B2","v":"Plan de proyecto para bufetes de abogados"},{"$nulls":22},"INFORMACIÓN:\nPara agregar una fila, seleccione la celda inferior derecha en el cuerpo de la tabla (no en la fila totales) y presione la tecla Tab, o bien, presione la tecla MAYÚS y F10 en la tabla donde quiere que la fila se inserte y seleccione Insertar | Filas de la tabla arriba/ Filas de tabla abajo.\nAsegúrese de que se eliminan todas las filas sin usar, ya que la tabla dinámica TOTALES DEL PROYECTO usará todas las celdas de tablas y, en caso contrario, podría proporcionar resultados erróneos."]
["El mensaje de confidencialidad está en la celda a la derecha.",{"$f":"'PARÁMETROS DEL PROYECTO'!B3","v":"Nombre de la empresa confidencial"}]
["Escriba la información en la tabla Detalles que comienza en la celda de la derecha. Los tipo de proyecto en la tabla Detalles a la derecha se actualizan automáticamente a partir de la tabla de parámetros en la hoja de cálculo Parámetros del proyecto.","NOMBRE DEL PROYECTO","TIPO DE PROYECTO","FECHA DE INICIO ESTIMADA","FECHA DE FIN ESTIMADA","INICIO REAL","FECHA DE FIN REAL","HORAS DE TRABAJO ESTIMADAS","TRABAJO REAL","DURACIÓN ESTIMADA","DURACIÓN REAL","PARTNER GENERAL","ABOGADO DE EMPRESA","FISCAL DE DEFENSA","ABOGADO DE PROPIEDAD INTELECTUAL","ABOGADO QUIEBRA","PERSONAL DE ADMINISTRACIÓN","PARTNER GENERAL 2","ABOGADO DE EMPRESA 2","FISCAL DE DEFENSA 2","ABOGADO DE PROPIEDAD INTELECTUAL 2","ABOGADO QUIEBRA 2","PERSONAL DE ADMINISTRACIÓN 2"]
[null,"Proyecto 1","Incorporación de la empresa",{"$f":"TODAY()","v":"2019-02-18"},{"$f":"TODAY()+60","v":"2019-04-19"},{"$f":"TODAY()+10","v":"2019-02-28"},{"$f":"TODAY()+65","v":"2019-04-24"},200,220,{"$f":"DAYS360(Detalles[[#This Row],[FECHA DE INICIO ESTIMADA]],Detalles[[#This Row],[FECHA DE FIN ESTIMADA]],FALSE)","v":61},{"$f":"DAYS360(Detalles[[#This Row],[INICIO REAL]],Detalles[[#This Row],[FECHA DE FIN REAL]],FALSE)","v":54},{"$f":"INDEX(Parámetros[],MATCH(Detalles[[#This Row],[TIPO DE PROYECTO]],Parámetros[TIPO DE PROYECTO],0),MATCH(Detalles[[#Headers],[PARTNER GENERAL]],Parámetros[#Headers],0))*INDEX('PARÁMETROS DEL PROYECTO'!$B$12:$H$12,1,MATCH(Detalles[[#Headers],[PARTNER GENERAL]],Parámetros[#Headers],0))*Detalles[[#This Row],[HORAS DE TRABAJO ESTIMADAS]]","v":{"v":7000,"d":"7,000 €"}},{"$f":"INDEX(Parámetros[],MATCH(Detalles[[#This Row],[TIPO DE PROYECTO]],Parámetros[TIPO DE PROYECTO],0),MATCH(Detalles[[#Headers],[ABOGADO DE EMPRESA]],Parámetros[#Headers],0))*INDEX('PARÁMETROS DEL PROYECTO'!$B$12:$H$12,1,MATCH(Detalles[[#Headers],[ABOGADO DE EMPRESA]],Parámetros[#Headers],0))*Detalles[[#This Row],[HORAS DE TRABAJO ESTIMADAS]]","v":{"v":20000,"d":"20,000 €"}},{"$f":"INDEX(Parámetros[],MATCH(Detalles[[#This Row],[TIPO DE PROYECTO]],Parámetros[TIPO DE PROYECTO],0),MATCH(Detalles[[#Headers],[FISCAL DE DEFENSA]],Parámetros[#Headers],0))*INDEX('PARÁMETROS DEL PROYECTO'!$B$12:$H$12,1,MATCH(Detalles[[#Headers],[FISCAL DE DEFENSA]],Parámetros[#Headers],0))*Detalles[[#This Row],[HORAS DE TRABAJO ESTIMADAS]]","v":{"v":0,"d":"0 €"}},{"$f":"INDEX(Parámetros[],MATCH(Detalles[[#This Row],[TIPO DE PROYECTO]],Parámetros[TIPO DE PROYECTO],0),MATCH(Detalles[[#Headers],[ABOGADO DE PROPIEDAD INTELECTUAL]],Parámetros[#Headers],0))*INDEX('PARÁMETROS DEL PROYECTO'!$B$12:$H$12,1,MATCH(Detalles[[#Headers],[ABOGADO DE PROPIEDAD INTELECTUAL]],Parámetros[#Headers],0))*Detalles[[#This Row],[HORAS DE TRABAJO ESTIMADAS]]","v":{"v":0,"d":"0 €"}},{"$f":"INDEX(Parámetros[],MATCH(Detalles[[#This Row],[TIPO DE PROYECTO]],Parámetros[TIPO DE PROYECTO],0),MATCH(Detalles[[#Headers],[ABOGADO QUIEBRA]],Parámetros[#Headers],0))*INDEX('PARÁMETROS DEL PROYECTO'!$B$12:$H$12,1,MATCH(Detalles[[#Headers],[ABOGADO QUIEBRA]],Parámetros[#Headers],0))*Detalles[[#This Row],[HORAS DE TRABAJO ESTIMADAS]]","v":{"v":0,"d":"0 €"}},{"$f":"INDEX(Parámetros[],MATCH(Detalles[[#This Row],[TIPO DE PROYECTO]],Parámetros[TIPO DE PROYECTO],0),MATCH(Detalles[[#Headers],[PERSONAL DE ADMINISTRACIÓN]],Parámetros[#Headers],0))*INDEX('PARÁMETROS DEL PROYECTO'!$B$12:$H$12,1,MATCH(Detalles[[#Headers],[PERSONAL DE ADMINISTRACIÓN]],Parámetros[#Headers],0))*Detalles[[#This Row],[HORAS DE TRABAJO ESTIMADAS]]","v":{"v":12500,"d":"12,500 €"}},{"$f":"INDEX(Parámetros[],MATCH(Detalles[[#This Row],[TIPO DE PROYECTO]],Parámetros[TIPO DE PROYECTO],0),MATCH(Detalles[[#Headers],[PARTNER GENERAL]],Parámetros[#Headers],0))*INDEX('PARÁMETROS DEL PROYECTO'!$B$12:$H$12,1,MATCH(Detalles[[#Headers],[PARTNER GENERAL]],Parámetros[#Headers],0))*Detalles[[#This Row],[TRABAJO REAL]]","v":{"v":7700,"d":"7,700 €"}},{"$f":"INDEX(Parámetros[],MATCH(Detalles[[#This Row],[TIPO DE PROYECTO]],Parámetros[TIPO DE PROYECTO],0),MATCH(Detalles[[#Headers],[ABOGADO DE EMPRESA]],Parámetros[#Headers],0))*INDEX('PARÁMETROS DEL PROYECTO'!$B$12:$H$12,1,MATCH(Detalles[[#Headers],[ABOGADO DE EMPRESA]],Parámetros[#Headers],0))*Detalles[[#This Row],[TRABAJO REAL]]","v":{"v":22000,"d":"22,000 €"}},{"$f":"INDEX(Parámetros[],MATCH(Detalles[[#This Row],[TIPO DE PROYECTO]],Parámetros[TIPO DE PROYECTO],0),MATCH(Detalles[[#Headers],[FISCAL DE DEFENSA]],Parámetros[#Headers],0))*INDEX('PARÁMETROS DEL PROYECTO'!$B$12:$H$12,1,MATCH(Detalles[[#Headers],[FISCAL DE DEFENSA]],Parámetros[#Headers],0))*Detalles[[#This Row],[TRABAJO REAL]]","v":{"v":0,"d":"0 €"}},{"$f":"INDEX(Parámetros[],MATCH(Detalles[[#This Row],[TIPO DE PROYECTO]],Parámetros[TIPO DE PROYECTO],0),MATCH(Detalles[[#Headers],[ABOGADO DE PROPIEDAD INTELECTUAL]],Parámetros[#Headers],0))*INDEX('PARÁMETROS DEL PROYECTO'!$B$12:$H$12,1,MATCH(Detalles[[#Headers],[ABOGADO DE PROPIEDAD INTELECTUAL]],Parámetros[#Headers],0))*Detalles[[#This Row],[TRABAJO REAL]]","v":{"v":0,"d":"0 €"}},{"$f":"INDEX(Parámetros[],MATCH(Detalles[[#This Row],[TIPO DE PROYECTO]],Parámetros[TIPO DE PROYECTO],0),MATCH(Detalles[[#Headers],[ABOGADO QUIEBRA]],Parámetros[#Headers],0))*INDEX('PARÁMETROS DEL PROYECTO'!$B$12:$H$12,1,MATCH(Detalles[[#Headers],[ABOGADO QUIEBRA]],Parámetros[#Headers],0))*Detalles[[#This Row],[TRABAJO REAL]]","v":{"v":0,"d":"0 €"}},{"$f":"INDEX(Parámetros[],MATCH(Detalles[[#This Row],[TIPO DE PROYECTO]],Parámetros[TIPO DE PROYECTO],0),MATCH(Detalles[[#Headers],[PERSONAL DE ADMINISTRACIÓN]],Parámetros[#Headers],0))*INDEX('PARÁMETROS DEL PROYECTO'!$B$12:$H$12,1,MATCH(Detalles[[#Headers],[PERSONAL DE ADMINISTRACIÓN]],Parámetros[#Headers],0))*Detalles[[#This Row],[TRABAJO REAL]]","v":{"v":13750,"d":"13,750 €"}}]
[null,"Proyecto 2","Adquisición de la empresa",{"$f":"TODAY()+30","v":"2019-03-20"},{"$f":"TODAY()+100","v":"2019-05-29"},{"$f":"TODAY()+40","v":"2019-03-30"},{"$f":"TODAY()+110","v":"2019-06-08"},400,390,{"$f":"DAYS360(Detalles[[#This Row],[FECHA DE INICIO ESTIMADA]],Detalles[[#This Row],[FECHA DE FIN ESTIMADA]],FALSE)","v":69},{"$f":"DAYS360(Detalles[[#This Row],[INICIO REAL]],Detalles[[#This Row],[FECHA DE FIN REAL]],FALSE)","v":68},{"$f":"INDEX(Parámetros[],MATCH(Detalles[[#This Row],[TIPO DE PROYECTO]],Parámetros[TIPO DE PROYECTO],0),MATCH(Detalles[[#Headers],[PARTNER GENERAL]],Parámetros[#Headers],0))*INDEX('PARÁMETROS DEL PROYECTO'!$B$12:$H$12,1,MATCH(Detalles[[#Headers],[PARTNER GENERAL]],Parámetros[#Headers],0))*Detalles[[#This Row],[HORAS DE TRABAJO ESTIMADAS]]","v":{"v":14000,"d":"14,000 €"}},{"$f":"INDEX(Parámetros[],MATCH(Detalles[[#This Row],[TIPO DE PROYECTO]],Parámetros[TIPO DE PROYECTO],0),MATCH(Detalles[[#Headers],[ABOGADO DE EMPRESA]],Parámetros[#Headers],0))*INDEX('PARÁMETROS DEL PROYECTO'!$B$12:$H$12,1,MATCH(Detalles[[#Headers],[ABOGADO DE EMPRESA]],Parámetros[#Headers],0))*Detalles[[#This Row],[HORAS DE TRABAJO ESTIMADAS]]","v":{"v":40000,"d":"40,000 €"}},{"$f":"INDEX(Parámetros[],MATCH(Detalles[[#This Row],[TIPO DE PROYECTO]],Parámetros[TIPO DE PROYECTO],0),MATCH(Detalles[[#Headers],[FISCAL DE DEFENSA]],Parámetros[#Headers],0))*INDEX('PARÁMETROS DEL PROYECTO'!$B$12:$H$12,1,MATCH(Detalles[[#Headers],[FISCAL DE DEFENSA]],Parámetros[#Headers],0))*Detalles[[#This Row],[HORAS DE TRABAJO ESTIMADAS]]","v":{"v":0,"d":"0 €"}},{"$f":"INDEX(Parámetros[],MATCH(Detalles[[#This Row],[TIPO DE PROYECTO]],Parámetros[TIPO DE PROYECTO],0),MATCH(Detalles[[#Headers],[ABOGADO DE PROPIEDAD INTELECTUAL]],Parámetros[#Headers],0))*INDEX('PARÁMETROS DEL PROYECTO'!$B$12:$H$12,1,MATCH(Detalles[[#Headers],[ABOGADO DE PROPIEDAD INTELECTUAL]],Parámetros[#Headers],0))*Detalles[[#This Row],[HORAS DE TRABAJO ESTIMADAS]]","v":{"v":11000,"d":"11,000 €"}},{"$f":"INDEX(Parámetros[],MATCH(Detalles[[#This Row],[TIPO DE PROYECTO]],Parámetros[TIPO DE PROYECTO],0),MATCH(Detalles[[#Headers],[ABOGADO QUIEBRA]],Parámetros[#Headers],0))*INDEX('PARÁMETROS DEL PROYECTO'!$B$12:$H$12,1,MATCH(Detalles[[#Headers],[ABOGADO QUIEBRA]],Parámetros[#Headers],0))*Detalles[[#This Row],[HORAS DE TRABAJO ESTIMADAS]]","v":{"v":0,"d":"0 €"}},{"$f":"INDEX(Parámetros[],MATCH(Detalles[[#This Row],[TIPO DE PROYECTO]],Parámetros[TIPO DE PROYECTO],0),MATCH(Detalles[[#Headers],[PERSONAL DE ADMINISTRACIÓN]],Parámetros[#Headers],0))*INDEX('PARÁMETROS DEL PROYECTO'!$B$12:$H$12,1,MATCH(Detalles[[#Headers],[PERSONAL DE ADMINISTRACIÓN]],Parámetros[#Headers],0))*Detalles[[#This Row],[HORAS DE TRABAJO ESTIMADAS]]","v":{"v":20000,"d":"20,000 €"}},{"$f":"INDEX(Parámetros[],MATCH(Detalles[[#This Row],[TIPO DE PROYECTO]],Parámetros[TIPO DE PROYECTO],0),MATCH(Detalles[[#Headers],[PARTNER GENERAL]],Parámetros[#Headers],0))*INDEX('PARÁMETROS DEL PROYECTO'!$B$12:$H$12,1,MATCH(Detalles[[#Headers],[PARTNER GENERAL]],Parámetros[#Headers],0))*Detalles[[#This Row],[TRABAJO REAL]]","v":{"v":13650,"d":"13,650 €"}},{"$f":"INDEX(Parámetros[],MATCH(Detalles[[#This Row],[TIPO DE PROYECTO]],Parámetros[TIPO DE PROYECTO],0),MATCH(Detalles[[#Headers],[ABOGADO DE EMPRESA]],Parámetros[#Headers],0))*INDEX('PARÁMETROS DEL PROYECTO'!$B$12:$H$12,1,MATCH(Detalles[[#Headers],[ABOGADO DE EMPRESA]],Parámetros[#Headers],0))*Detalles[[#This Row],[TRABAJO REAL]]","v":{"v":39000,"d":"39,000 €"}},{"$f":"INDEX(Parámetros[],MATCH(Detalles[[#This Row],[TIPO DE PROYECTO]],Parámetros[TIPO DE PROYECTO],0),MATCH(Detalles[[#Headers],[FISCAL DE DEFENSA]],Parámetros[#Headers],0))*INDEX('PARÁMETROS DEL PROYECTO'!$B$12:$H$12,1,MATCH(Detalles[[#Headers],[FISCAL DE DEFENSA]],Parámetros[#Headers],0))*Detalles[[#This Row],[TRABAJO REAL]]","v":{"v":0,"d":"0 €"}},{"$f":"INDEX(Parámetros[],MATCH(Detalles[[#This Row],[TIPO DE PROYECTO]],Parámetros[TIPO DE PROYECTO],0),MATCH(Detalles[[#Headers],[ABOGADO DE PROPIEDAD INTELECTUAL]],Parámetros[#Headers],0))*INDEX('PARÁMETROS DEL PROYECTO'!$B$12:$H$12,1,MATCH(Detalles[[#Headers],[ABOGADO DE PROPIEDAD INTELECTUAL]],Parámetros[#Headers],0))*Detalles[[#This Row],[TRABAJO REAL]]","v":{"v":10725,"d":"10,725 €"}},{"$f":"INDEX(Parámetros[],MATCH(Detalles[[#This Row],[TIPO DE PROYECTO]],Parámetros[TIPO DE PROYECTO],0),MATCH(Detalles[[#Headers],[ABOGADO QUIEBRA]],Parámetros[#Headers],0))*INDEX('PARÁMETROS DEL PROYECTO'!$B$12:$H$12,1,MATCH(Detalles[[#Headers],[ABOGADO QUIEBRA]],Parámetros[#Headers],0))*Detalles[[#This Row],[TRABAJO REAL]]","v":{"v":0,"d":"0 €"}},{"$f":"INDEX(Parámetros[],MATCH(Detalles[[#This Row],[TIPO DE PROYECTO]],Parámetros[TIPO DE PROYECTO],0),MATCH(Detalles[[#Headers],[PERSONAL DE ADMINISTRACIÓN]],Parámetros[#Headers],0))*INDEX('PARÁMETROS DEL PROYECTO'!$B$12:$H$12,1,MATCH(Detalles[[#Headers],[PERSONAL DE ADMINISTRACIÓN]],Parámetros[#Headers],0))*Detalles[[#This Row],[TRABAJO REAL]]","v":{"v":19500,"d":"19,500 €"}}]
{"$rows_left_out":5}
{"sheet":"TOTALES DEL PROYECTO","index":3,"n_rows":11,"n_cols":16,"rows_kept":11,"merged":[[3,2,3,7],[3,8,3,13],[3,15,14,19]]}
["Obtenga los Totales del proyecto en esta hoja de cálculo. El nombre de la empresa se actualiza automáticamente en la celda de la derecha. En las celdas de esta columna encontrará instrucciones útiles. Presione la flecha abajo para empezar.",{"$f":"'PARÁMETROS DEL PROYECTO'!B1","v":"Nombre de la empresa"}]
["El título de esta hoja de cálculo se encuentra en la celda de la derecha.",{"$f":"'PARÁMETROS DEL PROYECTO'!B2","v":"Plan de proyecto para bufetes de abogados"}]
["El mensaje de confidencialidad está en la celda a la derecha.",{"$f":"'PARÁMETROS DEL PROYECTO'!B3","v":"Nombre de la empresa confidencial"}]
["La etiqueta Estimado está en la celda C4, la etiqueta Real en la celda I4 y la información de sugerencias en la celda P4.",null,"ESTIMADO",{"$nulls":5},"REAL",{"$nulls":6},"INFORMACIÓN: \nEsta tabla dinámica no se actualizará automáticamente.  Para actualizarla, selecciónela (cualquier celda de la tabla dinámica) y, en la pestaña de la cinta de opciones HERRAMIENTAS DE TABLA DINÁMICA | ANALIZAR, seleccione Actualizar.  O bien, presione la tecla MAYÚS y F10 en la tabla dinámica y seleccione Actualizar."]
["La tabla dinámica que comienza en la celda a la derecha también se actualiza automáticamente.","NOMBRE DEL PROYECTO","PARTNER GENERAL ","EMPRESA ","FISCAL DE DEFENSA ","PROPIEDAD INTELECTUAL ","QUIEBRA ","PERSONAL DE ADMINISTRACIÓN ","PARTNER GENERAL  ","EMPRESA","FISCAL DE DEFENSA  ","QUIEBRA","PROPIEDAD INTELECTUAL","PERSONAL DE ADMINISTRACIÓN  "]
[null,"Proyecto 1",{"v":7000,"d":"7,000.00 €"},{"v":20000,"d":"20,000.00 €"},{"v":0,"d":"0.00 €"},{"v":0,"d":"0.00 €"},{"v":0,"d":"0.00 €"},{"v":12500,"d":"12,500.00 €"},{"v":7700,"d":"7,700.00 €"},{"v":22000,"d":"22,000.00 €"},{"v":0,"d":"0.00 €"},{"v":0,"d":"0.00 €"},{"v":0,"d":"0.00 €"},{"v":13750,"d":"13,750.00 €"}]
{"$rows_left_out":5}