{"text_format":"3","workbook":"xlsx","n_sheets":2,"sheets":["Parte de horas de empleado","Búsqueda_DíaLaborable"],"not_rendered":{"defined_names":27},"read":"whole","date_system":"1900"}

{"sheet":"Parte de horas de empleado","index":0,"n_rows":36,"n_cols":26,"rows_kept":36,"merged":[[0,1,2,4],[0,5,2,9],[0,10,2,14],[0,15,3,23],[0,24,3,24],[3,1,3,3],[3,5,3,9],[3,10,3,14],[4,1,6,3],[4,4,6,6],[5,14,7,14],[5,22,7,22],[5,23,7,23],[5,24,7,24],[21,1,21,6],[22,1,23,3],[22,4,23,6],[23,14,24,14],[23,22,24,22],[23,23,24,23],[23,24,24,24],[32,1,32,6],[32,24,33,24],[32,25,33,25],[33,1,33,6],[34,1,34,6],[35,1,35,3],[35,4,35,5],[35,6,35,7],[35,8,35,14],[35,15,35,16],[35,17,35,23]]}
[null,"PARTE DE HORAS DE EMPLEADOS DE OPERACIONES",{"$nulls":3},"Nombre del empleado",{"$nulls":9},"Seleccione Sí en la celda derecha si se necesita una \nautorización de horas extras."]
[]
[]
[null,"Fecha de finalización de la nómina",null,null,{"$f":"V7","v":"2025-06-14"},"Número de empleado"]
[null,"HORAS NORMALES:",null,null,"Fecha:"]
[{"$nulls":14},"Total\nSemana 1\nHoras normales",{"$nulls":7},"Total\nSemana 2\nHoras normales","Total\nHoras normales\nHoras","Nóminas\nUsar solo\nCódigo de pago"]
[{"$nulls":7},"2025-06-01",{"$f":"Día_Uno+1","v":"2025-06-02"},{"$f":"Día_Uno+2","v":"2025-06-03"},{"$f":"Día_Uno+3","v":"2025-06-04"},{"$f":"Día_Uno+4","v":"2025-06-05"},{"$f":"Día_Uno+5","v":"2025-06-06"},{"$f":"Día_Uno+6","v":"2025-06-07"},null,{"$f":"Día_Uno+7","v":"2025-06-08"},{"$f":"Día_Uno+8","v":"2025-06-09"},{"$f":"Día_Uno+9","v":"2025-06-10"},{"$f":"Día_Uno+10","v":"2025-06-11"},{"$f":"Día_Uno+11","v":"2025-06-12"},{"$f":"Día_Uno+12","v":"2025-06-13"},{"$f":"Día_Uno+13","v":"2025-06-14"}]
[null,"Tarea","Ubicación","N.º de horas laborables","Descripción del trabajo","Puesto","N.º de puesto",{"$f":"VLOOKUP(WEEKDAY(Día_Uno),Búsqueda_DíaLaborable!$B$2:$C$8,2)","v":"dom."},{"$f":"VLOOKUP(WEEKDAY(I7),Búsqueda_DíaLaborable!$B$2:$C$8,2)","v":"lun."},{"$f":"VLOOKUP(WEEKDAY(J7),Búsqueda_DíaLaborable!$B$2:$C$8,2)","v":"mar."},{"$f":"VLOOKUP(WEEKDAY(K7),Búsqueda_DíaLaborable!$B$2:$C$8,2)","v":"mié."},{"$f":"VLOOKUP(WEEKDAY(L7),Búsqueda_DíaLaborable!$B$2:$C$8,2)","v":"Jue."},{"$f":"VLOOKUP(WEEKDAY(M7),Búsqueda_DíaLaborable!$B$2:$C$8,2)","v":"Vie."},{"$f":"VLOOKUP(WEEKDAY(N7),Búsqueda_DíaLaborable!$B$2:$C$8,2)","v":"sáb."},null,{"$f":"VLOOKUP(WEEKDAY(P7),Búsqueda_DíaLaborable!$B$2:$C$8,2)","v":"dom."},{"$f":"VLOOKUP(WEEKDAY(Q7),Búsqueda_DíaLaborable!$B$2:$C$8,2)","v":"lun."},{"$f":"VLOOKUP(WEEKDAY(R7),Búsqueda_DíaLaborable!$B$2:$C$8,2)","v":"mar."},{"$f":"VLOOKUP(WEEKDAY(S7),Búsqueda_DíaLaborable!$B$2:$C$8,2)","v":"mié."},{"$f":"VLOOKUP(WEEKDAY(T7),Búsqueda_DíaLaborable!$B$2:$C$8,2)","v":"Jue."},{"$f":"VLOOKUP(WEEKDAY(U7),Búsqueda_DíaLaborable!$B$2:$C$8,2)","v":"Vie."},{"$f":"VLOOKUP(WEEKDAY(V7),Búsqueda_DíaLaborable!$B$2:$C$8,2)","v":"sáb."}]
[{"$nulls":14},{"$f":"SUM(H9:N9)","v":{"v":0,"d":"0.00"}},{"$nulls":7},{"$f":"SUM(P9:V9)","v":{"v":0,"d":"0.00"}},{"$f":"O9+W9","v":{"v":0,"d":"0.00"}}]
[{"$nulls":14},{"v":0,"d":"0.00"},{"$nulls":7},{"v":0,"d":"0.00"},{"v":0,"d":"0.00"}]
[{"$nulls":14},{"v":0,"d":"0.00"},{"$nulls":7},{"v":0,"d":"0.00"},{"v":0,"d":"0.00"}]
[{"$nulls":14},{"v":0,"d":"0.00"},{"$nulls":7},{"v":0,"d":"0.00"},{"v":0,"d":"0.00"}]
[{"$nulls":14},{"v":0,"d":"0.00"},{"$nulls":7},{"v":0,"d":"0.00"},{"v":0,"d":"0.00"}]
[{"$nulls":14},{"v":0,"d":"0.00"},{"$nulls":7},{"v":0,"d":"0.00"},{"v":0,"d":"0.00"}]
[{"$nulls":14},{"v":0,"d":"0.00"},{"$nulls":7},{"v":0,"d":"0.00"},{"v":0,"d":"0.00"}]
[{"$nulls":14},{"$f":"SUM(H16:N16)","v":{"v":0,"d":"0.00"}},{"$nulls":7},{"$f":"SUM(P16:V16)","v":{"v":0,"d":"0.00"}},{"$f":"O16+W16","v":{"v":0,"d":"0.00"}}]
[{"$nulls":14},{"v":0,"d":"0.00"},{"$nulls":7},{"v":0,"d":"0.00"},{"v":0,"d":"0.00"}]
[{"$nulls":14},{"v":0,"d":"0.00"},{"$nulls":7},{"v":0,"d":"0.00"},{"v":0,"d":"0.00"}]
[{"$nulls":14},{"v":0,"d":"0.00"},{"$nulls":7},{"v":0,"d":"0.00"},{"v":0,"d":"0.00"}]
[{"$nulls":14},{"v":0,"d":"0.00"},{"$nulls":7},{"v":0,"d":"0.00"},{"v":0,"d":"0.00"}]
[{"$nulls":14},{"v":0,"d":"0.00"},{"$nulls":7},{"v":0,"d":"0.00"},{"v":0,"d":"0.00"}]
[null,"Total de horas normales   ",{"$nulls":5},{"$f":"SUM(H9:H21)","v":{"v":0,"d":"0.00"}},{"v":0,"d":"0.00"},{"v":0,"d":"0.00"},{"v":0,"d":"0.00"},{"v":0,"d":"0.00"},{"v":0,"d":"0.00"},{"v":0,"d":"0.00"},{"v":0,"d":"0.00"},{"v":0,"d":"0.00"},{"$f":"SUM(Q9:Q21)","v":{"v":0,"d":"0.00"}},{"v":0,"d":"0.00"},{"v":0,"d":"0.00"},{"v":0,"d":"0.00"},{"v":0,"d":"0.00"},{"v":0,"d":"0.00"},{"$f":"SUM(W9:W21)","v":{"v":0,"d":"0.00"}},{"$f":"SUM(X9:X21)","v":{"v":0,"d":"0.00"}}]
[null,"HORAS EXTRAS:",null,null,"Fecha:"]
[{"$nulls":7},{"$f":"Día_Uno","v":"2025-06-01"},{"$f":"Día_Uno+1","v":"2025-06-02"},{"$f":"Día_Uno+2","v":"2025-06-03"},{"$f":"Día_Uno+3","v":"2025-06-04"},{"$f":"Día_Uno+4","v":"2025-06-05"},{"$f":"Día_Uno+5","v":"2025-06-06"},{"$f":"Día_Uno+6","v":"2025-06-07"},"Horas extra de semana 1",{"$f":"Día_Uno+7","v":"2025-06-08"},{"$f":"Día_Uno+8","v":"2025-06-09"},{"$f":"Día_Uno+9","v":"2025-06-10"},{"$f":"Día_Uno+10","v":"2025-06-11"},{"$f":"Día_Uno+11","v":"2025-06-12"},{"$f":"Día_Uno+12","v":"2025-06-13"},{"$f":"Día_Uno+13","v":"2025-06-14"},"Horas extra de semana 2","Total de horas extras","Horas extras\nCódigo"]
[null,"Tarea","Ubicación","N.º de horas laborables","Descripción del trabajo","Puesto","N.º de puesto",{"$f":"VLOOKUP(WEEKDAY(Día_Uno),Búsqueda_DíaLaborable!$B$2:$C$8,2)","v":"dom."},{"$f":"VLOOKUP(WEEKDAY(I24),Búsqueda_DíaLaborable!$B$2:$C$8,2)","v":"lun."},{"$f":"VLOOKUP(WEEKDAY(J24),Búsqueda_DíaLaborable!$B$2:$C$8,2)","v":"mar."},{"$f":"VLOOKUP(WEEKDAY(K24),Búsqueda_DíaLaborable!$B$2:$C$8,2)","v":"mié."},{"$f":"VLOOKUP(WEEKDAY(L24),Búsqueda_DíaLaborable!$B$2:$C$8,2)","v":"Jue."},{"$f":"VLOOKUP(WEEKDAY(M24),Búsqueda_DíaLaborable!$B$2:$C$8,2)","v":"Vie."},{"$f":"VLOOKUP(WEEKDAY(N24),Búsqueda_DíaLaborable!$B$2:$C$8,2)","v":"sáb."},null,{"$f":"VLOOKUP(WEEKDAY(P24),Búsqueda_DíaLaborable!$B$2:$C$8,2)","v":"dom."},{"$f":"VLOOKUP(WEEKDAY(Q24),Búsqueda_DíaLaborable!$B$2:$C$8,2)","v":"lun."},{"$f":"VLOOKUP(WEEKDAY(R24),Búsqueda_DíaLaborable!$B$2:$C$8,2)","v":"mar."},{"$f":"VLOOKUP(WEEKDAY(S24),Búsqueda_DíaLaborable!$B$2:$C$8,2)","v":"mié."},{"$f":"VLOOKUP(WEEKDAY(T24),Búsqueda_DíaLaborable!$B$2:$C$8,2)","v":"Jue."},{"$f":"VLOOKUP(WEEKDAY(U24),Búsqueda_DíaLaborable!$B$2:$C$8,2)","v":"Vie."},{"$f":"VLOOKUP(WEEKDAY(V24),Búsqueda_DíaLaborable!$B$2:$C$8,2)","v":"sáb."}]
[{"$nulls":14},{"$f":"SUM(H26:N26)","v":{"v":0,"d":"0.00"}},{"$nulls":7},{"$f":"SUM(P26:V26)","v":{"v":0,"d":"0.00"}},{"$f":"O26+W26","v":{"v":0,"d":"0.00"}}]
[{"$nulls":14},{"v":0,"d":"0.00"},{"$nulls":7},{"v":0,"d":"0.00"},{"v":0,"d":"0.00"}]
[{"$nulls":14},{"v":0,"d":"0.00"},{"$nulls":7},{"v":0,"d":"0.00"},{"v":0,"d":"0.00"}]
[{"$nulls":14},{"v":0,"d":"0.00"},{"$nulls":7},{"v":0,"d":"0.00"},{"v":0,"d":"0.00"}]
[{"$nulls":14},{"v":0,"d":"0.00"},{"$nulls":7},{"v":0,"d":"0.00"},{"v":0,"d":"0.00"}]
[{"$nulls":14},{"v":0,"d":"0.00"},{"$nulls":7},{"v":0,"d":"0.00"},{"v":0,"d":"0.00"}]
[{"$nulls":14},{"v":0,"d":"0.00"},{"$nulls":7},{"v":0,"d":"0.00"},{"v":0,"d":"0.00"}]
[null,"Total de horas extras     ",{"$nulls":5},{"$f":"SUM(H26:H32)","v":{"v":0,"d":"0.00"}},{"v":0,"d":"0.00"},{"v":0,"d":"0.00"},{"v":0,"d":"0.00"},{"v":0,"d":"0.00"},{"v":0,"d":"0.00"},{"v":0,"d":"0.00"},{"$f":"SUM(O26:O32)","v":{"v":0,"d":"0.00"}},{"v":0,"d":"0.00"},{"v":0,"d":"0.00"},{"v":0,"d":"0.00"},{"v":0,"d":"0.00"},{"v":0,"d":"0.00"},{"v":0,"d":"0.00"},{"v":0,"d":"0.00"},{"$f":"SUM(P33:V33)","v":{"v":0,"d":"0.00"}},{"$f":"SUM(X26:X32)","v":{"v":0,"d":"0.00"}},"Total\nHoras\nTrabajadas","Total\nHoras\nPagado"]
[null,"Horas extras compensadas     ",{"$nulls":12},{"$f":"IF(SUM(H34:N34)<=O33,SUM(H34:N34),O33)","v":{"v":0,"d":"0.00"}},{"$nulls":7},{"$f":"IF(SUM(P34:V34)<=W33,SUM(P34:V34),W33)","v":{"v":0,"d":"0.00"}},{"$f":"IF(SUM(Q34:W34)<=X33,SUM(Q34:W34),X33)","v":{"v":0,"d":"0.00"}}]
[null,"Horas extras pagadas     ",{"$nulls":5},{"$f":"IF(H33>=H34,H33-H34,H33)","v":{"v":0,"d":"0.00"}},{"$f":"IF(I33>=I34,I33-I34,I33)","v":{"v":0,"d":"0.00"}},{"v":0,"d":"0.00"},{"v":0,"d":"0.00"},{"v":0,"d":"0.00"},{"v":0,"d":"0.00"},{"v":0,"d":"0.00"},{"v":0,"d":"0.00"},{"v":0,"d":"0.00"},{"v":0,"d":"0.00"},{"v":0,"d":"0.00"},{"v":0,"d":"0.00"},{"v":0,"d":"0.00"},{"v":0,"d":"0.00"},{"v":0,"d":"0.00"},{"$f":"IF(W33>=W34,W33-W34,W33)","v":{"v":0,"d":"0.00"}},{"$f":"IF(X33>=X34,X33-X34,X33)","v":{"v":0,"d":"0.00"}},{"$f":"$X$22+$X$33","v":{"v":0,"d":"0.00"}},{"$f":"X22+X35","v":{"v":0,"d":"0.00"}}]
[null,"Empleado ",{"$nulls":4},"Supervisor ",{"$nulls":8},"Supervisor "]

{"sheet":"Búsqueda_DíaLaborable","index":1,"n_rows":8,"n_cols":3,"rows_kept":8}
[null,"Día laborable\nEntero","Día laborable\nInicial"]
[null,1,"dom."]
[null,2,"lun."]
[null,3,"mar."]
[null,4,"mié."]
[null,5,"Jue."]
[null,6,"Vie."]
[null,7,"sáb."]