{"text_format":"3","workbook":"xlsx","n_sheets":7,"sheets":["Welcome","Instructions","Snapshot","Transactions","Categories","HiddenCategories","Institutions"],"not_rendered":{"charts":3,"images":2,"defined_names":10},"read":"whole","date_system":"1900"}

{"sheet":"Welcome","index":0,"n_rows":21,"n_cols":1,"rows_kept":21}
[]
["Money in Excel"]
["This template helps you see all your financial accounts in one place, make a plan, and reach your financial goals"]
["Automatically import your transactions"]
["Keep a personal record of your finances"]
["Understand your financial habits"]
["Personalize your information for your needs"]
[]
["Did you know?"]
["You must trust the Excel add-in to access Money in Excel. (The add-in is to the right of the spreadsheet.)"]
{"$rows_left_out":12}
{"sheet":"Instructions","index":1,"n_rows":43,"n_cols":2,"rows_kept":43}
[]
["Learn how to get started with Money in Excel"]
["Follow these tips and instructions to get the most out of your workbook"]
["Arrow: scroll down to learn more"]
[]
["Get started"]
[1,"Make sure the Money in Excel pane is open. If it's not, click the Money in Excel icon in on the upper right corner of your ribbon."]
[2,"Trust the add-in"]
[3,"Sign in with a Microsoft 365 Family or Personal account"]
[4,"Connect a primary financial account"]
{"$rows_left_out":34}
{"sheet":"Snapshot","index":2,"n_rows":200,"n_cols":50,"rows_kept":200,"merged":[[1,2,1,15],[3,2,3,14],[3,16,3,18]]}
[]
[null,null,"Snapshot",{"$nulls":13},"Choose month below"]
[]
[null,null,"See your spending trends month over month with easy to read graphs. To switch months, click on the blue date box to the right.",{"$nulls":13},"March 2021",{"$nulls":5},{"$f":"_xlfn.XLOOKUP(TEXT(Q4,\"mmmm yyyy\"),$V$7:$V$200,$W$7:$W$200)","v":{"$error":"#N/A"}},null,"Monthly Summary",{"$nulls":3},"Category","Count","Rank","Order","Category","$",null,"Display Axis","Current Mon.","$",{"$f":"TEXT(AK6,\"MMMM\")&\" Spending\"","v":{"$error":"#N/A"}},"Max Date","Last Mon.","$",{"$f":"TEXT(AO6,\"MMMM\")&\" Spending\"","v":{"$error":"#N/A"}},"Max Date",null,"Merchants","$","Trans Count","Trans Rank","$ Rank"]
[]
[{"$nulls":21},"Input","Month Filter",null,{"$f":"TEXT(ABS(Z9),\"$#,##0\")&\" \"&IF(Z7>Z8,\"less was spent compared to last month\",\"more was spent compared to last month\")","v":"$0 more was spent compared to last month"},{"$nulls":3},{"$f":"_xlfn.UNIQUE(INDEX(_xlfn._xlws.FILTER(CategoriesTable[],(CategoriesTable[Category type]=\"expense\")*(NOT(CategoriesTable[ID]=0)),\"\"),0,2),FALSE)","v":{"$error":"#REF!"}},{"$f":"SUMIFS(Table1[Amount $],Table1[Category],Snapshot!AC6,Table1[Month],Snapshot!$W$4)*-1","v":0},{"$f":"RANK(AD6,$AD$6:$AD$35,0)+COUNTIF(AD6:$AD$6,AD6)-1","v":1},1,{"$f":"IF(INDEX($AD$6:$AD$35,MATCH(AF6,$AE$6:$AE$35,0),0)=0,\"\",INDEX($AC$6:$AC$35,MATCH(AF6,$AE$6:$AE$35,0),0))","v":""},{"$f":"IF(INDEX($AD$6:$AD$35,MATCH(AF6,$AE$6:$AE$35,0),0)=0,0,INDEX($AD$6:$AD$35,MATCH(AF6,$AE$6:$AE$35,0),0))","v":0},null,{"$f":"DATE(2000,1,1)","v":"2000-01-01"},{"$f":"DATE(YEAR(W4),MONTH(W4),DAY(W4))","v":{"$error":"#N/A"}},{"$f":"SUMIFS(Table1[Amount $],Table1[Category Type],\"Expense\",Table1[Date],Snapshot!AK6)*-1","v":{"v":0,"d":"$0"}},{"$f":"IF(AK6>TODAY(),NA(),SUM(AL6:$AL$6))","v":{"$error":"#N/A"}},{"$f":"IF(OR(AK6=EOMONTH($AK$6,0),AK6=TODAY()),AM6,NA())","v":{"$error":"#N/A"}},{"$f":"DATE(YEAR(AK6),MONTH(AK6)-1,DAY(AK6))","v":{"$error":"#N/A"}},{"$f":"SUMIFS(Table1[Amount $],Table1[Category Type],\"Expense\",Table1[Date],Snapshot!AO6)*-1","v":{"v":0,"d":"$0"}},{"$f":"IF(AO6<=EOMONTH($AO$6,0),SUM(AP$6:$AP6),NA())","v":{"$error":"#N/A"}},{"$f":"IF(AO6=EOMONTH($AO$6,0),AQ6,NA())","v":{"$error":"#N/A"}},null,{"$f":"_xlfn.UNIQUE(_xlfn._xlws.FILTER(Table1[Merchant],(Table1[Merchant]<>\"\")*(Table1[Amount $]<0)*(Table1[Month]=Snapshot!$W$4)*(Table1[Category Type]=\"Expense\")))","v":{"$error":"#N/A"}},{"$f":"IF(ISBLANK(AT6),\"\",SUMIFS(Table1[Amount $],Table1[Merchant],Snapshot!AT6,Table1[Month],Snapshot!$W$4)*-1)","v":{"v":0,"d":"$0"}},{"$f":"IF(ISBLANK(AT6),\"\",COUNTIFS(Table1[Merchant],Snapshot!AT6,Table1[Month],Snapshot!$W$4))","v":0},{"$f":"IFERROR(RANK(AV6,$AV$6:$AV$200)+COUNTIF($AV$6:AV6,AV6)-1,\"\")","v":1},{"$f":"IFERROR(RANK(AU6,$AU$6:$AU$200)+COUNTIF($AU$6:AU6,AU6)-1,\"\")","v":1}]
[{"$nulls":3},"Current vs. previous month spending",{"$nulls":8},"This month's top spending categories",{"$nulls":8},{"$f":"IF(ISBLANK(W7),\"--\",TEXT(W7,\"mmmm\")&\" \"&TEXT(W7,\"YYYY\"))","v":{"$error":"#VALUE!"}},{"$f":"_xlfn._xlws.SORT(_xlfn.UNIQUE(_xlfn._xlws.FILTER(Table1[Month],Table1[Month]<>\"\",)),1,-1)","v":{"$error":"#VALUE!"}},null,{"$f":"IFERROR(TEXT(AO6,\"mmmm\"),\"--\")","v":"--"},{"$f":"SUMIFS(Table1[Amount $],Table1[Category Type],\"Expense\",Table1[Month],DATE(YEAR(Snapshot!$W$4),MONTH(Snapshot!$W$4)-1,DAY(Snapshot!$W$4)))*-1","v":{"v":0,"d":"$0"}},{"$nulls":3},{"$f":"SUMIFS(Table1[Amount $],Table1[Category],Snapshot!AC7,Table1[Month],Snapshot!$W$4)*-1","v":0},{"$f":"RANK(AD7,$AD$6:$AD$35,0)+COUNTIF(AD$6:$AD7,AD7)-1","v":2},2,{"$f":"IF(INDEX($AD$6:$AD$35,MATCH(AF7,$AE$6:$AE$35,0),0)=0,\"\",INDEX($AC$6:$AC$35,MATCH(AF7,$AE$6:$AE$35,0),0))","v":""},{"$f":"IF(INDEX($AD$6:$AD$35,MATCH(AF7,$AE$6:$AE$35,0),0)=0,0,INDEX($AD$6:$AD$35,MATCH(AF7,$AE$6:$AE$35,0),0))","v":0},null,{"$f":"DATE(YEAR(AJ6),MONTH(AJ6),DAY(AJ6)+1)","v":"2000-01-02"},{"$f":"IF(MONTH(AK6)=MONTH(DATE(YEAR(AK6),MONTH(AK6),DAY(AK6)+1)),DATE(YEAR(AK6),MONTH(AK6),DAY(AK6)+1),NA())","v":{"$error":"#N/A"}},{"$f":"SUMIFS(Table1[Amount $],Table1[Category Type],\"Expense\",Table1[Date],Snapshot!AK7)*-1","v":{"v":0,"d":"$0"}},{"$f":"IF(AK7>TODAY(),NA(),SUM(AL$6:$AL7))","v":{"$error":"#N/A"}},{"$f":"IF(OR(AK7=EOMONTH($AK$6,0),AK7=TODAY()),AM7,NA())","v":{"$error":"#N/A"}},{"$f":"IF(MONTH(AO6)=MONTH(DATE(YEAR(AO6),MONTH(AO6),DAY(AO6)+1)),DATE(YEAR(AO6),MONTH(AO6),DAY(AO6)+1),NA())","v":{"$error":"#N/A"}},{"$f":"SUMIFS(Table1[Amount $],Table1[Category Type],\"Expense\",Table1[Date],Snapshot!AO7)*-1","v":{"v":0,"d":"$0"}},{"$f":"IF(AO7<=EOMONTH($AO$6,0),SUM(AP$6:$AP7),NA())","v":{"$error":"#N/A"}},{"$f":"IF(AO7=EOMONTH($AO$6,0),AQ7,NA())","v":{"$error":"#N/A"}},null,null,{"$f":"IF(ISBLANK(AT7),\"\",SUMIFS(Table1[Amount $],Table1[Merchant],Snapshot!AT7,Table1[Month],Snapshot!$W$4)*-1)","v":""},{"$f":"IF(ISBLANK(AT7),\"\",COUNTIFS(Table1[Merchant],Snapshot!AT7,Table1[Month],Snapshot!$W$4))","v":""},{"$f":"IFERROR(RANK(AV7,$AV$6:$AV$200)+COUNTIF($AV$6:AV7,AV7)-1,\"\")","v":""},{"$f":"IFERROR(RANK(AU7,$AU$6:$AU$200)+COUNTIF($AU$6:AU7,AU7)-1,\"\")","v":""}]
[{"$nulls":3},{"$f":"Y6","v":"$0 more was spent compared to last month"},{"$nulls":8},{"$f":"Q10&\" accounts for \"&TEXT(S10/S22,\"0%\")&\" of money spent this month\"","v":{"$error":"#DIV/0!"}},{"$nulls":8},"--",null,null,{"$f":"IFERROR(TEXT(AK6,\"mmmm\"),\"--\")","v":"--"},{"$f":"SUMIFS(Table1[Amount $],Table1[Category Type],\"Expense\",Table1[Month],Snapshot!$W$4)*-1","v":{"v":0,"d":"$0"}},{"$nulls":3},{"$f":"SUMIFS(Table1[Amount $],Table1[Category],Snapshot!AC8,Table1[Month],Snapshot!$W$4)*-1","v":0},{"$f":"RANK(AD8,$AD$6:$AD$35,0)+COUNTIF(AD$6:$AD8,AD8)-1","v":3},3,{"$f":"IF(INDEX($AD$6:$AD$35,MATCH(AF8,$AE$6:$AE$35,0),0)=0,\"\",INDEX($AC$6:$AC$35,MATCH(AF8,$AE$6:$AE$35,0),0))","v":""},{"$f":"IF(INDEX($AD$6:$AD$35,MATCH(AF8,$AE$6:$AE$35,0),0)=0,0,INDEX($AD$6:$AD$35,MATCH(AF8,$AE$6:$AE$35,0),0))","v":0},null,{"$f":"DATE(YEAR(AJ7),MONTH(AJ7),DAY(AJ7)+1)","v":"2000-01-03"},{"$f":"IF(MONTH(AK7)=MONTH(DATE(YEAR(AK7),MONTH(AK7),DAY(AK7)+1)),DATE(YEAR(AK7),MONTH(AK7),DAY(AK7)+1),NA())","v":{"$error":"#N/A"}},{"$f":"SUMIFS(Table1[Amount $],Table1[Category Type],\"Expense\",Table1[Date],Snapshot!AK8)*-1","v":{"v":0,"d":"$0"}},{"$f":"IF(AK8>TODAY(),NA(),SUM(AL$6:$AL8))","v":{"$error":"#N/A"}},{"$error":"#N/A"},{"$f":"IF(MONTH(AO7)=MONTH(DATE(YEAR(AO7),MONTH(AO7),DAY(AO7)+1)),DATE(YEAR(AO7),MONTH(AO7),DAY(AO7)+1),NA())","v":{"$error":"#N/A"}},{"$f":"SUMIFS(Table1[Amount $],Table1[Category Type],\"Expense\",Table1[Date],Snapshot!AO8)*-1","v":{"v":0,"d":"$0"}},{"$f":"IF(AO8<=EOMONTH($AO$6,0),SUM(AP$6:$AP8),NA())","v":{"$error":"#N/A"}},{"$error":"#N/A"},null,null,{"$f":"IF(ISBLANK(AT8),\"\",SUMIFS(Table1[Amount $],Table1[Merchant],Snapshot!AT8,Table1[Month],Snapshot!$W$4)*-1)","v":""},{"$f":"IF(ISBLANK(AT8),\"\",COUNTIFS(Table1[Merchant],Snapshot!AT8,Table1[Month],Snapshot!$W$4))","v":""},{"$f":"IFERROR(RANK(AV8,$AV$6:$AV$200)+COUNTIF($AV$6:AV8,AV8)-1,\"\")","v":""},{"$f":"IFERROR(RANK(AU8,$AU$6:$AU$200)+COUNTIF($AU$6:AU8,AU8)-1,\"\")","v":""}]
[{"$nulls":21},{"$f":"IF(ISBLANK(W9),\"--\",TEXT(W9,\"mmmm\")&\" \"&TEXT(W9,\"YYYY\"))","v":"--"},null,null,"Difference",{"$f":"Z8-Z7","v":{"v":0,"d":"$0"}},{"$nulls":3},{"$f":"SUMIFS(Table1[Amount $],Table1[Category],Snapshot!AC9,Table1[Month],Snapshot!$W$4)*-1","v":0},{"$f":"RANK(AD9,$AD$6:$AD$35,0)+COUNTIF(AD$6:$AD9,AD9)-1","v":4},4,{"$f":"IF(INDEX($AD$6:$AD$35,MATCH(AF9,$AE$6:$AE$35,0),0)=0,\"\",INDEX($AC$6:$AC$35,MATCH(AF9,$AE$6:$AE$35,0),0))","v":""},{"$f":"IF(INDEX($AD$6:$AD$35,MATCH(AF9,$AE$6:$AE$35,0),0)=0,0,INDEX($AD$6:$AD$35,MATCH(AF9,$AE$6:$AE$35,0),0))","v":0},null,"2000-01-04",{"$error":"#N/A"},{"$f":"SUMIFS(Table1[Amount $],Table1[Category Type],\"Expense\",Table1[Date],Snapshot!AK9)*-1","v":{"v":0,"d":"$0"}},{"$f":"IF(AK9>TODAY(),NA(),SUM(AL$6:$AL9))","v":{"$error":"#N/A"}},{"$error":"#N/A"},{"$error":"#N/A"},{"$f":"SUMIFS(Table1[Amount $],Table1[Category Type],\"Expense\",Table1[Date],Snapshot!AO9)*-1","v":{"v":0,"d":"$0"}},{"$f":"IF(AO9<=EOMONTH($AO$6,0),SUM(AP$6:$AP9),NA())","v":{"$error":"#N/A"}},{"$error":"#N/A"},null,null,{"$f":"IF(ISBLANK(AT9),\"\",SUMIFS(Table1[Amount $],Table1[Merchant],Snapshot!AT9,Table1[Month],Snapshot!$W$4)*-1)","v":""},{"$f":"IF(ISBLANK(AT9),\"\",COUNTIFS(Table1[Merchant],Snapshot!AT9,Table1[Month],Snapshot!$W$4))","v":""},{"$f":"IFERROR(RANK(AV9,$AV$6:$AV$200)+COUNTIF($AV$6:AV9,AV9)-1,\"\")","v":""},{"$f":"IFERROR(RANK(AU9,$AU$6:$AU$200)+COUNTIF($AU$6:AU9,AU9)-1,\"\")","v":""}]
[{"$nulls":16},{"$f":"INDEX($AG$6:$AG$11,MATCH(1,$AF$6:$AF$11,0),0)","v":""},null,{"$f":"INDEX($AH$6:$AH$11,MATCH(1,$AF$6:$AF$11,0),0)","v":{"v":0,"d":"$0"}},null,null,{"$f":"IF(ISBLANK(W10),\"--\",TEXT(W10,\"mmmm\")&\" \"&TEXT(W10,\"YYYY\"))","v":"--"},{"$nulls":7},{"$f":"SUMIFS(Table1[Amount $],Table1[Category],Snapshot!AC10,Table1[Month],Snapshot!$W$4)*-1","v":0},{"$f":"RANK(AD10,$AD$6:$AD$35,0)+COUNTIF(AD$6:$AD10,AD10)-1","v":5},5,{"$f":"IF(INDEX($AD$6:$AD$35,MATCH(AF10,$AE$6:$AE$35,0),0)=0,\"\",INDEX($AC$6:$AC$35,MATCH(AF10,$AE$6:$AE$35,0),0))","v":""},{"$f":"IF(INDEX($AD$6:$AD$35,MATCH(AF10,$AE$6:$AE$35,0),0)=0,0,INDEX($AD$6:$AD$35,MATCH(AF10,$AE$6:$AE$35,0),0))","v":0},null,"2000-01-05",{"$error":"#N/A"},{"$f":"SUMIFS(Table1[Amount $],Table1[Category Type],\"Expense\",Table1[Date],Snapshot!AK10)*-1","v":{"v":0,"d":"$0"}},{"$f":"IF(AK10>TODAY(),NA(),SUM(AL$6:$AL10))","v":{"$error":"#N/A"}},{"$error":"#N/A"},{"$error":"#N/A"},{"$f":"SUMIFS(Table1[Amount $],Table1[Category Type],\"Expense\",Table1[Date],Snapshot!AO10)*-1","v":{"v":0,"d":"$0"}},{"$f":"IF(AO10<=EOMONTH($AO$6,0),SUM(AP$6:$AP10),NA())","v":{"$error":"#N/A"}},{"$error":"#N/A"},null,null,{"$f":"IF(ISBLANK(AT10),\"\",SUMIFS(Table1[Amount $],Table1[Merchant],Snapshot!AT10,Table1[Month],Snapshot!$W$4)*-1)","v":""},{"$f":"IF(ISBLANK(AT10),\"\",COUNTIFS(Table1[Merchant],Snapshot!AT10,Table1[Month],Snapshot!$W$4))","v":""},{"$f":"IFERROR(RANK(AV10,$AV$6:$AV$200)+COUNTIF($AV$6:AV10,AV10)-1,\"\")","v":""},{"$f":"IFERROR(RANK(AU10,$AU$6:$AU$200)+COUNTIF($AU$6:AU10,AU10)-1,\"\")","v":""}]
{"$rows_left_out":191}
{"sheet":"Transactions","index":3,"n_rows":8,"n_cols":20,"rows_kept":8,"merged":[[1,1,1,7],[2,1,2,7]]}
[]
[null,"Transactions"]
[null,"Transactions from your added accounts are automatically imported here. Click Sync in the task pane to import more transactions. Edit the Merchant and Category columns to better reflect where and how you spend your money."]
[]
[]
[null,"Date","Merchant","Category","Subcategory","Amount $","Account","Account Number","Institution","Transaction_ID","Account_ID","Institution_ID","Category_ID","Subcategory_ID","Category Type","Date_Day","Date_Month","Date_Year","Beginning of Week","Month"]
[]
[{"$nulls":11},{"$f":"IFERROR(INDEX(#REF!,MATCH(Table1[[#This Row],[Category]],#REF!,0),0),\"\")","v":""}]

{"sheet":"Categories","index":4,"n_rows":250,"n_cols":10,"rows_kept":250,"merged":[[1,1,1,12],[2,2,2,9],[4,2,4,3],[4,7,4,8],[5,2,5,3],[5,7,5,8]]}
[]
[null,"Categories"]
[null,null,"Add custom categories and subcategories below, then assign them to your transactions in the transactions sheet. You can only edit or delete the categories and subcategories you've added."]
[]
[null,null,"Categories",{"$nulls":4},"Subcategories"]
[null,null,"Add custom categories in the empty rows below the default categories.\nMake sure to select expenses, income, or transfers under category type.",{"$nulls":4},"To add custom subcategories in the table below, select a category from the\ndropdown menu and add the related subcategory in the next column."]
[null,"ID","Category name","Category type","Default",null,"ID","Category name","Subcategory name","Category ID"]
[{"$nulls":9},{"$f":"IF(AND(NOT(ISBLANK(SubcategoriesTable[[#This Row],[Category name]])),NOT(ISERROR(_xlfn.XLOOKUP(SubcategoriesTable[[#This Row],[Category name]],CategoryNames,CategoryNames,,,)))),_xlfn.XLOOKUP(SubcategoriesTable[[#This Row],[Category name]],CategoryNames,CategoryIdentifiers,,,),\"\")","v":""}]
[{"$nulls":9},{"$f":"IF(AND(NOT(ISBLANK(SubcategoriesTable[[#This Row],[Category name]])),NOT(ISERROR(_xlfn.XLOOKUP(SubcategoriesTable[[#This Row],[Category name]],CategoryNames,CategoryNames,,,)))),_xlfn.XLOOKUP(SubcategoriesTable[[#This Row],[Category name]],CategoryNames,CategoryIdentifiers,,,),\"\")","v":""}]
[{"$nulls":9},{"$f":"IF(AND(NOT(ISBLANK(SubcategoriesTable[[#This Row],[Category name]])),NOT(ISERROR(_xlfn.XLOOKUP(SubcategoriesTable[[#This Row],[Category name]],CategoryNames,CategoryNames,,,)))),_xlfn.XLOOKUP(SubcategoriesTable[[#This Row],[Category name]],CategoryNames,CategoryIdentifiers,,,),\"\")","v":""}]
{"$rows_left_out":241}
{"sheet":"HiddenCategories","index":5,"n_rows":100,"n_cols":245,"rows_kept":100,"hidden":true}
[null,"Category","Subcategories"]
[null,{"$f":"_xlfn.UNIQUE(_xlfn._xlws.FILTER(CategoryNames, CategoryNames<>\"\",),FALSE,FALSE)","v":{"$error":"#VALUE!"}},{"$f":"IFERROR(TRANSPOSE(INDEX(_xlfn._xlws.FILTER(INDIRECT(\"SubcategoriesTable[Subcategory name]\"),INDIRECT(\"SubcategoriesTable[Category name]\")=$B2),,)),\"No subcategories\")","v":"No subcategories"}]
[null,null,{"$f":"IFERROR(TRANSPOSE(INDEX(_xlfn._xlws.FILTER(INDIRECT(\"SubcategoriesTable[Subcategory name]\"),INDIRECT(\"SubcategoriesTable[Category name]\")=$B3),,)),\"No subcategories\")","v":0},0,0,0,0,0,0,0,0,0,0,0,0,0,0,0,0,0,0,0,0,0,0,0,0,0,0,0,0,0,0,0,0,0,0,0,0,0,0,0,0,0,0,0,0,0,0,0,0,0,0,0,0,0,0,0,0,0,0,0,0,0,0,0,0,0,0,0,0,0,0,0,0,0,0,0,0,0,0,0,0,0,0,0,0,0,0,0,0,0,0,0,0,0,0,0,0,0,0,0,0,0,0,0,0,0,0,0,0,0,0,0,0,0,0,0,0,0,0,0,0,0,0,0,0,0,0,0,0,0,0,0,0,0,0,0,0,0,0,0,0,0,0,0,0,0,0,0,0,0,0,0,0,0,0,0,0,0,0,0,0,0,0,0,0,0,0,0,0,0,0,0,0,0,0,0,0,0,0,0,0,0,0,0,0,0,0,0,0,0,0,0,0,0,0,0,0,0,0,0,0,0,0,0,0,0,0,0,0,0,0,0,0,0,0,0,0,0,0,0,0,0,0,0,0,0,0,0,0,0,0,0,0,0,0,0,0,0,0,0,0,0,0]
[null,null,{"$f":"IFERROR(TRANSPOSE(INDEX(_xlfn._xlws.FILTER(INDIRECT(\"SubcategoriesTable[Subcategory name]\"),INDIRECT(\"SubcategoriesTable[Category name]\")=$B4),,)),\"No subcategories\")","v":0},0,0,0,0,0,0,0,0,0,0,0,0,0,0,0,0,0,0,0,0,0,0,0,0,0,0,0,0,0,0,0,0,0,0,0,0,0,0,0,0,0,0,0,0,0,0,0,0,0,0,0,0,0,0,0,0,0,0,0,0,0,0,0,0,0,0,0,0,0,0,0,0,0,0,0,0,0,0,0,0,0,0,0,0,0,0,0,0,0,0,0,0,0,0,0,0,0,0,0,0,0,0,0,0,0,0,0,0,0,0,0,0,0,0,0,0,0,0,0,0,0,0,0,0,0,0,0,0,0,0,0,0,0,0,0,0,0,0,0,0,0,0,0,0,0,0,0,0,0,0,0,0,0,0,0,0,0,0,0,0,0,0,0,0,0,0,0,0,0,0,0,0,0,0,0,0,0,0,0,0,0,0,0,0,0,0,0,0,0,0,0,0,0,0,0,0,0,0,0,0,0,0,0,0,0,0,0,0,0,0,0,0,0,0,0,0,0,0,0,0,0,0,0,0,0,0,0,0,0,0,0,0,0,0,0,0,0,0,0,0,0,0]
[null,null,{"$f":"IFERROR(TRANSPOSE(INDEX(_xlfn._xlws.FILTER(INDIRECT(\"SubcategoriesTable[Subcategory name]\"),INDIRECT(\"SubcategoriesTable[Category name]\")=$B5),,)),\"No subcategories\")","v":0},0,0,0,0,0,0,0,0,0,0,0,0,0,0,0,0,0,0,0,0,0,0,0,0,0,0,0,0,0,0,0,0,0,0,0,0,0,0,0,0,0,0,0,0,0,0,0,0,0,0,0,0,0,0,0,0,0,0,0,0,0,0,0,0,0,0,0,0,0,0,0,0,0,0,0,0,0,0,0,0,0,0,0,0,0,0,0,0,0,0,0,0,0,0,0,0,0,0,0,0,0,0,0,0,0,0,0,0,0,0,0,0,0,0,0,0,0,0,0,0,0,0,0,0,0,0,0,0,0,0,0,0,0,0,0,0,0,0,0,0,0,0,0,0,0,0,0,0,0,0,0,0,0,0,0,0,0,0,0,0,0,0,0,0,0,0,0,0,0,0,0,0,0,0,0,0,0,0,0,0,0,0,0,0,0,0,0,0,0,0,0,0,0,0,0,0,0,0,0,0,0,0,0,0,0,0,0,0,0,0,0,0,0,0,0,0,0,0,0,0,0,0,0,0,0,0,0,0,0,0,0,0,0,0,0,0,0,0,0,0,0,0]
[null,null,{"$f":"IFERROR(TRANSPOSE(INDEX(_xlfn._xlws.FILTER(INDIRECT(\"SubcategoriesTable[Subcategory name]\"),INDIRECT(\"SubcategoriesTable[Category name]\")=$B6),,)),\"No subcategories\")","v":0},0,0,0,0,0,0,0,0,0,0,0,0,0,0,0,0,0,0,0,0,0,0,0,0,0,0,0,0,0,0,0,0,0,0,0,0,0,0,0,0,0,0,0,0,0,0,0,0,0,0,0,0,0,0,0,0,0,0,0,0,0,0,0,0,0,0,0,0,0,0,0,0,0,0,0,0,0,0,0,0,0,0,0,0,0,0,0,0,0,0,0,0,0,0,0,0,0,0,0,0,0,0,0,0,0,0,0,0,0,0,0,0,0,0,0,0,0,0,0,0,0,0,0,0,0,0,0,0,0,0,0,0,0,0,0,0,0,0,0,0,0,0,0,0,0,0,0,0,0,0,0,0,0,0,0,0,0,0,0,0,0,0,0,0,0,0,0,0,0,0,0,0,0,0,0,0,0,0,0,0,0,0,0,0,0,0,0,0,0,0,0,0,0,0,0,0,0,0,0,0,0,0,0,0,0,0,0,0,0,0,0,0,0,0,0,0,0,0,0,0,0,0,0,0,0,0,0,0,0,0,0,0,0,0,0,0,0,0,0,0,0,0]
[null,null,{"$f":"IFERROR(TRANSPOSE(INDEX(_xlfn._xlws.FILTER(INDIRECT(\"SubcategoriesTable[Subcategory name]\"),INDIRECT(\"SubcategoriesTable[Category name]\")=$B7),,)),\"No subcategories\")","v":0},0,0,0,0,0,0,0,0,0,0,0,0,0,0,0,0,0,0,0,0,0,0,0,0,0,0,0,0,0,0,0,0,0,0,0,0,0,0,0,0,0,0,0,0,0,0,0,0,0,0,0,0,0,0,0,0,0,0,0,0,0,0,0,0,0,0,0,0,0,0,0,0,0,0,0,0,0,0,0,0,0,0,0,0,0,0,0,0,0,0,0,0,0,0,0,0,0,0,0,0,0,0,0,0,0,0,0,0,0,0,0,0,0,0,0,0,0,0,0,0,0,0,0,0,0,0,0,0,0,0,0,0,0,0,0,0,0,0,0,0,0,0,0,0,0,0,0,0,0,0,0,0,0,0,0,0,0,0,0,0,0,0,0,0,0,0,0,0,0,0,0,0,0,0,0,0,0,0,0,0,0,0,0,0,0,0,0,0,0,0,0,0,0,0,0,0,0,0,0,0,0,0,0,0,0,0,0,0,0,0,0,0,0,0,0,0,0,0,0,0,0,0,0,0,0,0,0,0,0,0,0,0,0,0,0,0,0,0,0,0,0,0]
[null,null,{"$f":"IFERROR(TRANSPOSE(INDEX(_xlfn._xlws.FILTER(INDIRECT(\"SubcategoriesTable[Subcategory name]\"),INDIRECT(\"SubcategoriesTable[Category name]\")=$B8),,)),\"No subcategories\")","v":0},0,0,0,0,0,0,0,0,0,0,0,0,0,0,0,0,0,0,0,0,0,0,0,0,0,0,0,0,0,0,0,0,0,0,0,0,0,0,0,0,0,0,0,0,0,0,0,0,0,0,0,0,0,0,0,0,0,0,0,0,0,0,0,0,0,0,0,0,0,0,0,0,0,0,0,0,0,0,0,0,0,0,0,0,0,0,0,0,0,0,0,0,0,0,0,0,0,0,0,0,0,0,0,0,0,0,0,0,0,0,0,0,0,0,0,0,0,0,0,0,0,0,0,0,0,0,0,0,0,0,0,0,0,0,0,0,0,0,0,0,0,0,0,0,0,0,0,0,0,0,0,0,0,0,0,0,0,0,0,0,0,0,0,0,0,0,0,0,0,0,0,0,0,0,0,0,0,0,0,0,0,0,0,0,0,0,0,0,0,0,0,0,0,0,0,0,0,0,0,0,0,0,0,0,0,0,0,0,0,0,0,0,0,0,0,0,0,0,0,0,0,0,0,0,0,0,0,0,0,0,0,0,0,0,0,0,0,0,0,0,0,0]
[null,null,{"$f":"IFERROR(TRANSPOSE(INDEX(_xlfn._xlws.FILTER(INDIRECT(\"SubcategoriesTable[Subcategory name]\"),INDIRECT(\"SubcategoriesTable[Category name]\")=$B9),,)),\"No subcategories\")","v":0},0,0,0,0,0,0,0,0,0,0,0,0,0,0,0,0,0,0,0,0,0,0,0,0,0,0,0,0,0,0,0,0,0,0,0,0,0,0,0,0,0,0,0,0,0,0,0,0,0,0,0,0,0,0,0,0,0,0,0,0,0,0,0,0,0,0,0,0,0,0,0,0,0,0,0,0,0,0,0,0,0,0,0,0,0,0,0,0,0,0,0,0,0,0,0,0,0,0,0,0,0,0,0,0,0,0,0,0,0,0,0,0,0,0,0,0,0,0,0,0,0,0,0,0,0,0,0,0,0,0,0,0,0,0,0,0,0,0,0,0,0,0,0,0,0,0,0,0,0,0,0,0,0,0,0,0,0,0,0,0,0,0,0,0,0,0,0,0,0,0,0,0,0,0,0,0,0,0,0,0,0,0,0,0,0,0,0,0,0,0,0,0,0,0,0,0,0,0,0,0,0,0,0,0,0,0,0,0,0,0,0,0,0,0,0,0,0,0,0,0,0,0,0,0,0,0,0,0,0,0,0,0,0,0,0,0,0,0,0,0,0,0]
[null,null,{"$f":"IFERROR(TRANSPOSE(INDEX(_xlfn._xlws.FILTER(INDIRECT(\"SubcategoriesTable[Subcategory name]\"),INDIRECT(\"SubcategoriesTable[Category name]\")=$B10),,)),\"No subcategories\")","v":0},0,0,0,0,0,0,0,0,0,0,0,0,0,0,0,0,0,0,0,0,0,0,0,0,0,0,0,0,0,0,0,0,0,0,0,0,0,0,0,0,0,0,0,0,0,0,0,0,0,0,0,0,0,0,0,0,0,0,0,0,0,0,0,0,0,0,0,0,0,0,0,0,0,0,0,0,0,0,0,0,0,0,0,0,0,0,0,0,0,0,0,0,0,0,0,0,0,0,0,0,0,0,0,0,0,0,0,0,0,0,0,0,0,0,0,0,0,0,0,0,0,0,0,0,0,0,0,0,0,0,0,0,0,0,0,0,0,0,0,0,0,0,0,0,0,0,0,0,0,0,0,0,0,0,0,0,0,0,0,0,0,0,0,0,0,0,0,0,0,0,0,0,0,0,0,0,0,0,0,0,0,0,0,0,0,0,0,0,0,0,0,0,0,0,0,0,0,0,0,0,0,0,0,0,0,0,0,0,0,0,0,0,0,0,0,0,0,0,0,0,0,0,0,0,0,0,0,0,0,0,0,0,0,0,0,0,0,0,0,0,0,0]
{"$rows_left_out":91}
{"sheet":"Institutions","index":6,"n_rows":1,"n_cols":16,"rows_kept":1,"hidden":true}
["ID","Institution name","Institution status","Institution logo","Needs reauth","Institution nickname",null,"ID","Institution ID","Account#","Account name","Account nickname","Account balance","Account type","Account enabled","Is manual"]