{"text_format":"3","workbook":"xlsx","n_sheets":13,"sheets":["About","January","February","March","April","May","June","July","August","September","October","November","December"],"not_rendered":{"defined_names":13},"read":"whole","date_system":"1900"}

{"sheet":"About","index":0,"n_rows":13,"n_cols":16,"rows_kept":13,"merged":[[3,13,5,16]]}
[]
[null,null,"How to Use This Template"]
[]
[{"$nulls":13},"Time Entry"]
[null,null,"Step 1:",null," Enter the Year and Start Month"]
[]
[null,null,"Step 2: ",null,"Choose the Start Day"]
[{"$nulls":14},"Year",2024]
[null,null,"Step 3:",null,"Customize the Theme Colors / Fonts"]
[{"$nulls":4},"Go to Page Layout > Themes to choose different colors and fonts.",{"$nulls":9},"Start Month",1]
[]
[null,null,"Step 4:",null,"Print to Paper or PDF",{"$nulls":9},"Start Day of Week",1]
[{"$nulls":4},"Print the entire workbook, or print only the selected worksheets."]

{"sheet":"January","index":1,"n_rows":32,"n_cols":30,"rows_kept":32,"merged":[[1,2,1,29],[3,2,3,3],[3,4,3,5],[3,6,3,7],[3,8,3,9],[3,10,3,12],[3,14,3,21],[3,22,3,29],[4,2,4,3],[4,4,4,5],[4,6,4,7],[4,8,4,9],[4,10,4,12],[4,14,4,21],[4,22,4,29],[5,2,5,3],[5,4,5,5],[5,6,5,7],[5,8,5,9],[5,10,5,13],[5,14,5,21],[5,22,5,29],[6,2,7,3],[6,4,6,5],[6,6,6,7],[6,8,6,9],[6,10,6,12],[6,14,6,21],[6,22,6,29],[7,4,7,5],[7,6,7,7],[7,8,7,9],[7,10,7,12],[7,14,7,21],[7,22,7,29],[8,2,8,3],[8,4,8,5],[8,6,8,7],[8,8,8,9],[8,10,8,13],[8,14,8,21],[8,22,8,29],[9,2,10,3],[10,4,10,5],[10,6,10,7],[10,8,10,9],[10,10,10,12],[10,14,10,21],[10,22,10,29],[11,2,11,3],[11,4,11,5],[11,6,11,7],[11,8,11,9],[11,10,11,13],[11,14,11,21],[11,22,11,29],[12,2,13,3],[13,4,13,5],[13,6,13,7],[13,8,13,9],[13,10,13,12],[13,14,13,21],[13,22,13,29],[14,2,14,3],[14,4,14,5],[14,6,14,7],[14,8,14,9],[14,10,14,13],[14,14,14,21],[14,22,14,29],[15,2,16,3],[16,4,16,5],[16,6,16,7],[16,8,16,9],[16,10,16,12],[16,14,16,21],[16,22,16,29],[17,2,17,3],[17,4,17,5],[17,6,17,7],[17,8,17,9],[17,10,17,12],[17,14,17,21],[17,22,17,29],[18,2,19,3],[19,4,19,5],[19,6,19,7],[19,8,19,9],[19,10,19,12],[19,14,19,21],[19,22,19,29],[20,2,20,3],[20,4,20,5],[20,6,20,7],[20,8,20,9],[20,10,20,12],[20,14,20,21],[20,22,20,29],[24,2,25,10],[24,14,24,20],[24,23,24,29],[26,2,26,10],[27,2,28,10],[29,2,30,10]]}
[]
[null,null,{"$f":"DATE(About!P8,About!P10,1)","v":"2024-01-01"}]
[]
[null,null,{"$f":"C5","v":"2023-12-31"},null,{"$f":"E5","v":"2024-01-01"},null,{"$f":"G5","v":"2024-01-02"},null,{"$f":"I5","v":"2024-01-03"},null,{"$f":"K5","v":"2024-01-04"},{"$nulls":3},{"$f":"O5","v":"2024-01-05"},{"$nulls":7},{"$f":"W5","v":"2024-01-06"}]
[null,null,{"$f":"$C$2-(WEEKDAY($C$2,1)-(start_day-1))-IF((WEEKDAY($C$2,1)-(start_day-1))<=0,7,0)+1","v":"2023-12-31"},null,{"$f":"C5+1","v":"2024-01-01"},null,{"$f":"E5+1","v":"2024-01-02"},null,{"$f":"G5+1","v":"2024-01-03"},null,{"$f":"I5+1","v":"2024-01-04"},{"$nulls":3},{"$f":"K5+1","v":"2024-01-05"},{"$nulls":7},{"$f":"O5+1","v":"2024-01-06"}]
[]
[null,null,{"$f":"W5+1","v":"2024-01-07"}]
[{"$nulls":4},{"$f":"C7+1","v":"2024-01-08"},null,{"$f":"E8+1","v":"2024-01-09"},null,{"$f":"G8+1","v":"2024-01-10"},null,{"$f":"I8+1","v":"2024-01-11"},{"$nulls":3},{"$f":"K8+1","v":"2024-01-12"},{"$nulls":7},{"$f":"O8+1","v":"2024-01-13"}]
[]
[null,null,{"$f":"W8+1","v":"2024-01-14"}]
[{"$nulls":4},{"$f":"C10+1","v":"2024-01-15"},null,{"$f":"E11+1","v":"2024-01-16"},null,{"$f":"G11+1","v":"2024-01-17"},null,{"$f":"I11+1","v":"2024-01-18"},{"$nulls":3},{"$f":"K11+1","v":"2024-01-19"},{"$nulls":7},{"$f":"O11+1","v":"2024-01-20"}]
[]
[null,null,{"$f":"W11+1","v":"2024-01-21"}]
[{"$nulls":4},{"$f":"C13+1","v":"2024-01-22"},null,{"$f":"E14+1","v":"2024-01-23"},null,{"$f":"G14+1","v":"2024-01-24"},null,{"$f":"I14+1","v":"2024-01-25"},{"$nulls":3},{"$f":"K14+1","v":"2024-01-26"},{"$nulls":7},{"$f":"O14+1","v":"2024-01-27"}]
[]
[null,null,{"$f":"W14+1","v":"2024-01-28"}]
[{"$nulls":4},{"$f":"C16+1","v":"2024-01-29"},null,{"$f":"E17+1","v":"2024-01-30"},null,{"$f":"G17+1","v":"2024-01-31"},null,{"$f":"I17+1","v":"2024-02-01"},{"$nulls":3},{"$f":"K17+1","v":"2024-02-02"},{"$nulls":7},{"$f":"O17+1","v":"2024-02-03"}]
[]
[null,null,{"$f":"W17+1","v":"2024-02-04"}]
[{"$nulls":4},{"$f":"C19+1","v":"2024-02-05"},null,{"$f":"E20+1","v":"2024-02-06"},null,{"$f":"G20+1","v":"2024-02-07"},null,{"$f":"I20+1","v":"2024-02-08"},{"$nulls":3},{"$f":"K20+1","v":"2024-02-09"},{"$nulls":7},{"$f":"O20+1","v":"2024-02-10"}]
[]
[]
[]
[]
[null,null,"Notes",{"$nulls":11},{"$f":"DATE(YEAR(C2),MONTH(C2)-1,1)","v":"2023-12-01"},{"$nulls":8},{"$f":"DATE(YEAR(C2),MONTH(C2)+1,1)","v":"2024-02-01"}]
[{"$nulls":14},{"$f":"INDEX({\"S\";\"M\";\"T\";\"W\";\"T\";\"F\";\"S\"},1+MOD(start_day+1-2,7))","v":"S"},{"$f":"INDEX({\"S\";\"M\";\"T\";\"W\";\"T\";\"F\";\"S\"},1+MOD(start_day+2-2,7))","v":"M"},{"$f":"INDEX({\"S\";\"M\";\"T\";\"W\";\"T\";\"F\";\"S\"},1+MOD(start_day+3-2,7))","v":"T"},{"$f":"INDEX({\"S\";\"M\";\"T\";\"W\";\"T\";\"F\";\"S\"},1+MOD(start_day+4-2,7))","v":"W"},{"$f":"INDEX({\"S\";\"M\";\"T\";\"W\";\"T\";\"F\";\"S\"},1+MOD(start_day+5-2,7))","v":"T"},{"$f":"INDEX({\"S\";\"M\";\"T\";\"W\";\"T\";\"F\";\"S\"},1+MOD(start_day+6-2,7))","v":"F"},{"$f":"INDEX({\"S\";\"M\";\"T\";\"W\";\"T\";\"F\";\"S\"},1+MOD(start_day+7-2,7))","v":"S"},null,null,{"$f":"INDEX({\"S\";\"M\";\"T\";\"W\";\"T\";\"F\";\"S\"},1+MOD(start_day+1-2,7))","v":"S"},{"$f":"INDEX({\"S\";\"M\";\"T\";\"W\";\"T\";\"F\";\"S\"},1+MOD(start_day+2-2,7))","v":"M"},{"$f":"INDEX({\"S\";\"M\";\"T\";\"W\";\"T\";\"F\";\"S\"},1+MOD(start_day+3-2,7))","v":"T"},{"$f":"INDEX({\"S\";\"M\";\"T\";\"W\";\"T\";\"F\";\"S\"},1+MOD(start_day+4-2,7))","v":"W"},{"$f":"INDEX({\"S\";\"M\";\"T\";\"W\";\"T\";\"F\";\"S\"},1+MOD(start_day+5-2,7))","v":"T"},{"$f":"INDEX({\"S\";\"M\";\"T\";\"W\";\"T\";\"F\";\"S\"},1+MOD(start_day+6-2,7))","v":"F"},{"$f":"INDEX({\"S\";\"M\";\"T\";\"W\";\"T\";\"F\";\"S\"},1+MOD(start_day+7-2,7))","v":"S"}]
[{"$nulls":14},{"$f":"IF(MONTH($O$25)<>MONTH($O$25-(WEEKDAY($O$25,1)-(start_day-1))-IF((WEEKDAY($O$25,1)-(start_day-1))<=0,7,0)+(ROW(O27)-ROW($O$27))*7+(COLUMN(O27)-COLUMN($O$27)+1)),\"\",$O$25-(WEEKDAY($O$25,1)-(start_day-1))-IF((WEEKDAY($O$25,1)-(start_day-1))<=0,7,0)+(ROW(O27)-ROW($O$27))*7+(COLUMN(O27)-COLUMN($O$27)+1))","v":""},"","","","","2023-12-01","2023-12-02",null,null,{"$f":"IF(MONTH($X$25)<>MONTH($X$25-(WEEKDAY($X$25,1)-(start_day-1))-IF((WEEKDAY($X$25,1)-(start_day-1))<=0,7,0)+(ROW(X27)-ROW($X$27))*7+(COLUMN(X27)-COLUMN($X$27)+1)),\"\",$X$25-(WEEKDAY($X$25,1)-(start_day-1))-IF((WEEKDAY($X$25,1)-(start_day-1))<=0,7,0)+(ROW(X27)-ROW($X$27))*7+(COLUMN(X27)-COLUMN($X$27)+1))","v":""},"","","","2024-02-01","2024-02-02","2024-02-03"]
[{"$nulls":14},"2023-12-03","2023-12-04","2023-12-05","2023-12-06","2023-12-07","2023-12-08","2023-12-09",null,null,"2024-02-04","2024-02-05","2024-02-06","2024-02-07","2024-02-08","2024-02-09","2024-02-10"]
[{"$nulls":14},"2023-12-10","2023-12-11","2023-12-12","2023-12-13","2023-12-14","2023-12-15","2023-12-16",null,null,"2024-02-11","2024-02-12","2024-02-13","2024-02-14","2024-02-15","2024-02-16","2024-02-17"]
[{"$nulls":14},"2023-12-17","2023-12-18","2023-12-19","2023-12-20","2023-12-21","2023-12-22","2023-12-23",null,null,"2024-02-18","2024-02-19","2024-02-20","2024-02-21","2024-02-22","2024-02-23","2024-02-24"]
[{"$nulls":14},"2023-12-24","2023-12-25","2023-12-26","2023-12-27","2023-12-28","2023-12-29","2023-12-30",null,null,"2024-02-25","2024-02-26","2024-02-27","2024-02-28","2024-02-29","",""]
[{"$nulls":14},"2023-12-31","","","","","","",null,null,"","","","","","",""]

{"sheet":"February","index":2,"n_rows":32,"n_cols":30,"rows_kept":32,"merged":[[1,2,1,29],[3,2,3,3],[3,4,3,5],[3,6,3,7],[3,8,3,9],[3,10,3,12],[3,14,3,21],[3,22,3,29],[4,2,4,3],[4,4,4,5],[4,6,4,7],[4,8,4,9],[4,10,4,12],[4,14,4,21],[4,22,4,29],[5,2,5,3],[5,4,5,5],[5,6,5,7],[5,8,5,9],[5,10,5,13],[5,14,5,21],[5,22,5,29],[6,2,7,3],[6,4,6,5],[6,6,6,7],[6,8,6,9],[6,10,6,12],[6,14,6,21],[6,22,6,29],[7,4,7,5],[7,6,7,7],[7,8,7,9],[7,10,7,12],[7,14,7,21],[7,22,7,29],[8,2,8,3],[8,4,8,5],[8,6,8,7],[8,8,8,9],[8,10,8,13],[8,14,8,21],[8,22,8,29],[9,2,10,3],[10,4,10,5],[10,6,10,7],[10,8,10,9],[10,10,10,12],[10,14,10,21],[10,22,10,29],[11,2,11,3],[11,4,11,5],[11,6,11,7],[11,8,11,9],[11,10,11,13],[11,14,11,21],[11,22,11,29],[12,2,13,3],[13,4,13,5],[13,6,13,7],[13,8,13,9],[13,10,13,12],[13,14,13,21],[13,22,13,29],[14,2,14,3],[14,4,14,5],[14,6,14,7],[14,8,14,9],[14,10,14,13],[14,14,14,21],[14,22,14,29],[15,2,16,3],[16,4,16,5],[16,6,16,7],[16,8,16,9],[16,10,16,12],[16,14,16,21],[16,22,16,29],[17,2,17,3],[17,4,17,5],[17,6,17,7],[17,8,17,9],[17,10,17,12],[17,14,17,21],[17,22,17,29],[18,2,19,3],[19,4,19,5],[19,6,19,7],[19,8,19,9],[19,10,19,12],[19,14,19,21],[19,22,19,29],[20,2,20,3],[20,4,20,5],[20,6,20,7],[20,8,20,9],[20,10,20,12],[20,14,20,21],[20,22,20,29],[24,2,25,10],[24,14,24,20],[24,23,24,29],[26,2,26,10],[27,2,28,10],[29,2,30,10]]}
[]
[null,null,{"$f":"DATE(About!P8,About!P10+1,1)","v":"2024-02-01"}]
[]
[null,null,{"$f":"C5","v":"2024-01-28"},null,{"$f":"E5","v":"2024-01-29"},null,{"$f":"G5","v":"2024-01-30"},null,{"$f":"I5","v":"2024-01-31"},null,{"$f":"K5","v":"2024-02-01"},{"$nulls":3},{"$f":"O5","v":"2024-02-02"},{"$nulls":7},{"$f":"W5","v":"2024-02-03"}]
[null,null,{"$f":"$C$2-(WEEKDAY($C$2,1)-(start_day-1))-IF((WEEKDAY($C$2,1)-(start_day-1))<=0,7,0)+1","v":"2024-01-28"},null,{"$f":"C5+1","v":"2024-01-29"},null,{"$f":"E5+1","v":"2024-01-30"},null,{"$f":"G5+1","v":"2024-01-31"},null,{"$f":"I5+1","v":"2024-02-01"},{"$nulls":3},{"$f":"K5+1","v":"2024-02-02"},{"$nulls":7},{"$f":"O5+1","v":"2024-02-03"}]
[]
[null,null,{"$f":"W5+1","v":"2024-02-04"}]
[{"$nulls":4},{"$f":"C7+1","v":"2024-02-05"},null,{"$f":"E8+1","v":"2024-02-06"},null,{"$f":"G8+1","v":"2024-02-07"},null,{"$f":"I8+1","v":"2024-02-08"},{"$nulls":3},{"$f":"K8+1","v":"2024-02-09"},{"$nulls":7},{"$f":"O8+1","v":"2024-02-10"}]
[]
[null,null,{"$f":"W8+1","v":"2024-02-11"}]
[{"$nulls":4},{"$f":"C10+1","v":"2024-02-12"},null,{"$f":"E11+1","v":"2024-02-13"},null,{"$f":"G11+1","v":"2024-02-14"},null,{"$f":"I11+1","v":"2024-02-15"},{"$nulls":3},{"$f":"K11+1","v":"2024-02-16"},{"$nulls":7},{"$f":"O11+1","v":"2024-02-17"}]
[]
[null,null,{"$f":"W11+1","v":"2024-02-18"}]
[{"$nulls":4},{"$f":"C13+1","v":"2024-02-19"},null,{"$f":"E14+1","v":"2024-02-20"},null,{"$f":"G14+1","v":"2024-02-21"},null,{"$f":"I14+1","v":"2024-02-22"},{"$nulls":3},{"$f":"K14+1","v":"2024-02-23"},{"$nulls":7},{"$f":"O14+1","v":"2024-02-24"}]
[]
[null,null,{"$f":"W14+1","v":"2024-02-25"}]
[{"$nulls":4},{"$f":"C16+1","v":"2024-02-26"},null,{"$f":"E17+1","v":"2024-02-27"},null,{"$f":"G17+1","v":"2024-02-28"},null,{"$f":"I17+1","v":"2024-02-29"},{"$nulls":3},{"$f":"K17+1","v":"2024-03-01"},{"$nulls":7},{"$f":"O17+1","v":"2024-03-02"}]
[]
[null,null,{"$f":"W17+1","v":"2024-03-03"}]
[{"$nulls":4},{"$f":"C19+1","v":"2024-03-04"},null,{"$f":"E20+1","v":"2024-03-05"},null,{"$f":"G20+1","v":"2024-03-06"},null,{"$f":"I20+1","v":"2024-03-07"},{"$nulls":3},{"$f":"K20+1","v":"2024-03-08"},{"$nulls":7},{"$f":"O20+1","v":"2024-03-09"}]
[]
[]
[]
[]
[null,null,"Notes",{"$nulls":11},{"$f":"DATE(YEAR(C2),MONTH(C2)-1,1)","v":"2024-01-01"},{"$nulls":8},{"$f":"DATE(YEAR(C2),MONTH(C2)+1,1)","v":"2024-03-01"}]
[{"$nulls":14},{"$f":"INDEX({\"S\";\"M\";\"T\";\"W\";\"T\";\"F\";\"S\"},1+MOD(start_day+1-2,7))","v":"S"},{"$f":"INDEX({\"S\";\"M\";\"T\";\"W\";\"T\";\"F\";\"S\"},1+MOD(start_day+2-2,7))","v":"M"},{"$f":"INDEX({\"S\";\"M\";\"T\";\"W\";\"T\";\"F\";\"S\"},1+MOD(start_day+3-2,7))","v":"T"},{"$f":"INDEX({\"S\";\"M\";\"T\";\"W\";\"T\";\"F\";\"S\"},1+MOD(start_day+4-2,7))","v":"W"},{"$f":"INDEX({\"S\";\"M\";\"T\";\"W\";\"T\";\"F\";\"S\"},1+MOD(start_day+5-2,7))","v":"T"},{"$f":"INDEX({\"S\";\"M\";\"T\";\"W\";\"T\";\"F\";\"S\"},1+MOD(start_day+6-2,7))","v":"F"},{"$f":"INDEX({\"S\";\"M\";\"T\";\"W\";\"T\";\"F\";\"S\"},1+MOD(start_day+7-2,7))","v":"S"},null,null,{"$f":"INDEX({\"S\";\"M\";\"T\";\"W\";\"T\";\"F\";\"S\"},1+MOD(start_day+1-2,7))","v":"S"},{"$f":"INDEX({\"S\";\"M\";\"T\";\"W\";\"T\";\"F\";\"S\"},1+MOD(start_day+2-2,7))","v":"M"},{"$f":"INDEX({\"S\";\"M\";\"T\";\"W\";\"T\";\"F\";\"S\"},1+MOD(start_day+3-2,7))","v":"T"},{"$f":"INDEX({\"S\";\"M\";\"T\";\"W\";\"T\";\"F\";\"S\"},1+MOD(start_day+4-2,7))","v":"W"},{"$f":"INDEX({\"S\";\"M\";\"T\";\"W\";\"T\";\"F\";\"S\"},1+MOD(start_day+5-2,7))","v":"T"},{"$f":"INDEX({\"S\";\"M\";\"T\";\"W\";\"T\";\"F\";\"S\"},1+MOD(start_day+6-2,7))","v":"F"},{"$f":"INDEX({\"S\";\"M\";\"T\";\"W\";\"T\";\"F\";\"S\"},1+MOD(start_day+7-2,7))","v":"S"}]
[{"$nulls":14},{"$f":"IF(MONTH($O$25)<>MONTH($O$25-(WEEKDAY($O$25,1)-(start_day-1))-IF((WEEKDAY($O$25,1)-(start_day-1))<=0,7,0)+(ROW(O27)-ROW($O$27))*7+(COLUMN(O27)-COLUMN($O$27)+1)),\"\",$O$25-(WEEKDAY($O$25,1)-(start_day-1))-IF((WEEKDAY($O$25,1)-(start_day-1))<=0,7,0)+(ROW(O27)-ROW($O$27))*7+(COLUMN(O27)-COLUMN($O$27)+1))","v":""},"2024-01-01","2024-01-02","2024-01-03","2024-01-04","2024-01-05","2024-01-06",null,null,{"$f":"IF(MONTH($X$25)<>MONTH($X$25-(WEEKDAY($X$25,1)-(start_day-1))-IF((WEEKDAY($X$25,1)-(start_day-1))<=0,7,0)+(ROW(X27)-ROW($X$27))*7+(COLUMN(X27)-COLUMN($X$27)+1)),\"\",$X$25-(WEEKDAY($X$25,1)-(start_day-1))-IF((WEEKDAY($X$25,1)-(start_day-1))<=0,7,0)+(ROW(X27)-ROW($X$27))*7+(COLUMN(X27)-COLUMN($X$27)+1))","v":""},"","","","","2024-03-01","2024-03-02"]
[{"$nulls":14},"2024-01-07","2024-01-08","2024-01-09","2024-01-10","2024-01-11","2024-01-12","2024-01-13",null,null,"2024-03-03","2024-03-04","2024-03-05","2024-03-06","2024-03-07","2024-03-08","2024-03-09"]
[{"$nulls":14},"2024-01-14","2024-01-15","2024-01-16","2024-01-17","2024-01-18","2024-01-19","2024-01-20",null,null,"2024-03-10","2024-03-11","2024-03-12","2024-03-13","2024-03-14","2024-03-15","2024-03-16"]
[{"$nulls":14},"2024-01-21","2024-01-22","2024-01-23","2024-01-24","2024-01-25","2024-01-26","2024-01-27",null,null,"2024-03-17","2024-03-18","2024-03-19","2024-03-20","2024-03-21","2024-03-22","2024-03-23"]
[{"$nulls":14},"2024-01-28","2024-01-29","2024-01-30","2024-01-31","","","",null,null,"2024-03-24","2024-03-25","2024-03-26","2024-03-27","2024-03-28","2024-03-29","2024-03-30"]
[{"$nulls":14},"","","","","","","",null,null,"2024-03-31","","","","","",""]

{"sheet":"March","index":3,"n_rows":32,"n_cols":30,"rows_kept":32,"merged":[[1,2,1,29],[3,2,3,3],[3,4,3,5],[3,6,3,7],[3,8,3,9],[3,10,3,12],[3,14,3,21],[3,22,3,29],[4,2,4,3],[4,4,4,5],[4,6,4,7],[4,8,4,9],[4,10,4,12],[4,14,4,21],[4,22,4,29],[5,2,5,3],[5,4,5,5],[5,6,5,7],[5,8,5,9],[5,10,5,13],[5,14,5,21],[5,22,5,29],[6,2,7,3],[6,4,6,5],[6,6,6,7],[6,8,6,9],[6,10,6,12],[6,14,6,21],[6,22,6,29],[7,4,7,5],[7,6,7,7],[7,8,7,9],[7,10,7,12],[7,14,7,21],[7,22,7,29],[8,2,8,3],[8,4,8,5],[8,6,8,7],[8,8,8,9],[8,10,8,13],[8,14,8,21],[8,22,8,29],[9,2,10,3],[10,4,10,5],[10,6,10,7],[10,8,10,9],[10,10,10,12],[10,14,10,21],[10,22,10,29],[11,2,11,3],[11,4,11,5],[11,6,11,7],[11,8,11,9],[11,10,11,13],[11,14,11,21],[11,22,11,29],[12,2,13,3],[13,4,13,5],[13,6,13,7],[13,8,13,9],[13,10,13,12],[13,14,13,21],[13,22,13,29],[14,2,14,3],[14,4,14,5],[14,6,14,7],[14,8,14,9],[14,10,14,13],[14,14,14,21],[14,22,14,29],[15,2,16,3],[15,8,15,9],[15,14,15,21],[16,4,16,5],[16,6,16,7],[16,8,16,9],[16,10,16,13],[16,14,16,21],[16,22,16,29],[17,2,17,3],[17,4,17,5],[17,6,17,7],[17,8,17,9],[17,10,17,13],[17,14,17,21],[17,22,17,29],[18,2,19,3],[18,8,18,9],[18,14,18,21],[19,4,19,5],[19,6,19,7],[19,8,19,9],[19,10,19,13],[19,14,19,21],[19,22,19,29],[20,2,20,3],[20,4,20,5],[20,6,20,7],[20,8,20,9],[20,10,20,13],[20,14,20,21],[20,22,20,29],[24,2,25,10],[24,14,24,20],[24,23,24,29],[26,2,26,10],[27,2,28,10],[29,2,30,10]]}
[]
[null,null,{"$f":"DATE(About!P8,About!P10+2,1)","v":"2024-03-01"}]
[]
[null,null,{"$f":"C5","v":"2024-02-25"},null,{"$f":"E5","v":"2024-02-26"},null,{"$f":"G5","v":"2024-02-27"},null,{"$f":"I5","v":"2024-02-28"},null,{"$f":"K5","v":"2024-02-29"},{"$nulls":3},{"$f":"O5","v":"2024-03-01"},{"$nulls":7},{"$f":"W5","v":"2024-03-02"}]
[null,null,{"$f":"$C$2-(WEEKDAY($C$2,1)-(start_day-1))-IF((WEEKDAY($C$2,1)-(start_day-1))<=0,7,0)+1","v":"2024-02-25"},null,{"$f":"C5+1","v":"2024-02-26"},null,{"$f":"E5+1","v":"2024-02-27"},null,{"$f":"G5+1","v":"2024-02-28"},null,{"$f":"I5+1","v":"2024-02-29"},{"$nulls":3},{"$f":"K5+1","v":"2024-03-01"},{"$nulls":7},{"$f":"O5+1","v":"2024-03-02"}]
[]
[null,null,{"$f":"W5+1","v":"2024-03-03"}]
[{"$nulls":4},{"$f":"C7+1","v":"2024-03-04"},null,{"$f":"E8+1","v":"2024-03-05"},null,{"$f":"G8+1","v":"2024-03-06"},null,{"$f":"I8+1","v":"2024-03-07"},{"$nulls":3},{"$f":"K8+1","v":"2024-03-08"},{"$nulls":7},{"$f":"O8+1","v":"2024-03-09"}]
[]
[null,null,{"$f":"W8+1","v":"2024-03-10"}]
[{"$nulls":4},{"$f":"C10+1","v":"2024-03-11"},null,{"$f":"E11+1","v":"2024-03-12"},null,{"$f":"G11+1","v":"2024-03-13"},null,{"$f":"I11+1","v":"2024-03-14"},{"$nulls":3},{"$f":"K11+1","v":"2024-03-15"},{"$nulls":7},{"$f":"O11+1","v":"2024-03-16"}]
[]
[null,null,{"$f":"W11+1","v":"2024-03-17"}]
[{"$nulls":4},{"$f":"C13+1","v":"2024-03-18"},null,{"$f":"E14+1","v":"2024-03-19"},null,{"$f":"G14+1","v":"2024-03-20"},null,{"$f":"I14+1","v":"2024-03-21"},{"$nulls":3},{"$f":"K14+1","v":"2024-03-22"},{"$nulls":7},{"$f":"O14+1","v":"2024-03-23"}]
[]
[null,null,{"$f":"W14+1","v":"2024-03-24"}]
[{"$nulls":4},{"$f":"C16+1","v":"2024-03-25"},null,{"$f":"E17+1","v":"2024-03-26"},null,{"$f":"G17+1","v":"2024-03-27"},null,{"$f":"I17+1","v":"2024-03-28"},{"$nulls":3},{"$f":"K17+1","v":"2024-03-29"},{"$nulls":7},{"$f":"O17+1","v":"2024-03-30"}]
[]
[null,null,{"$f":"W17+1","v":"2024-03-31"}]
[{"$nulls":4},{"$f":"C19+1","v":"2024-04-01"},null,{"$f":"E20+1","v":"2024-04-02"},null,{"$f":"G20+1","v":"2024-04-03"},null,{"$f":"I20+1","v":"2024-04-04"},{"$nulls":3},{"$f":"K20+1","v":"2024-04-05"},{"$nulls":7},{"$f":"O20+1","v":"2024-04-06"}]
[]
[]
[]
[]
[null,null,"Notes",{"$nulls":11},{"$f":"DATE(YEAR(C2),MONTH(C2)-1,1)","v":"2024-02-01"},{"$nulls":8},{"$f":"DATE(YEAR(C2),MONTH(C2)+1,1)","v":"2024-04-01"}]
[{"$nulls":14},{"$f":"INDEX({\"S\";\"M\";\"T\";\"W\";\"T\";\"F\";\"S\"},1+MOD(start_day+1-2,7))","v":"S"},{"$f":"INDEX({\"S\";\"M\";\"T\";\"W\";\"T\";\"F\";\"S\"},1+MOD(start_day+2-2,7))","v":"M"},{"$f":"INDEX({\"S\";\"M\";\"T\";\"W\";\"T\";\"F\";\"S\"},1+MOD(start_day+3-2,7))","v":"T"},{"$f":"INDEX({\"S\";\"M\";\"T\";\"W\";\"T\";\"F\";\"S\"},1+MOD(start_day+4-2,7))","v":"W"},{"$f":"INDEX({\"S\";\"M\";\"T\";\"W\";\"T\";\"F\";\"S\"},1+MOD(start_day+5-2,7))","v":"T"},{"$f":"INDEX({\"S\";\"M\";\"T\";\"W\";\"T\";\"F\";\"S\"},1+MOD(start_day+6-2,7))","v":"F"},{"$f":"INDEX({\"S\";\"M\";\"T\";\"W\";\"T\";\"F\";\"S\"},1+MOD(start_day+7-2,7))","v":"S"},null,null,{"$f":"INDEX({\"S\";\"M\";\"T\";\"W\";\"T\";\"F\";\"S\"},1+MOD(start_day+1-2,7))","v":"S"},{"$f":"INDEX({\"S\";\"M\";\"T\";\"W\";\"T\";\"F\";\"S\"},1+MOD(start_day+2-2,7))","v":"M"},{"$f":"INDEX({\"S\";\"M\";\"T\";\"W\";\"T\";\"F\";\"S\"},1+MOD(start_day+3-2,7))","v":"T"},{"$f":"INDEX({\"S\";\"M\";\"T\";\"W\";\"T\";\"F\";\"S\"},1+MOD(start_day+4-2,7))","v":"W"},{"$f":"INDEX({\"S\";\"M\";\"T\";\"W\";\"T\";\"F\";\"S\"},1+MOD(start_day+5-2,7))","v":"T"},{"$f":"INDEX({\"S\";\"M\";\"T\";\"W\";\"T\";\"F\";\"S\"},1+MOD(start_day+6-2,7))","v":"F"},{"$f":"INDEX({\"S\";\"M\";\"T\";\"W\";\"T\";\"F\";\"S\"},1+MOD(start_day+7-2,7))","v":"S"}]
[{"$nulls":14},{"$f":"IF(MONTH($O$25)<>MONTH($O$25-(WEEKDAY($O$25,1)-(start_day-1))-IF((WEEKDAY($O$25,1)-(start_day-1))<=0,7,0)+(ROW(O27)-ROW($O$27))*7+(COLUMN(O27)-COLUMN($O$27)+1)),\"\",$O$25-(WEEKDAY($O$25,1)-(start_day-1))-IF((WEEKDAY($O$25,1)-(start_day-1))<=0,7,0)+(ROW(O27)-ROW($O$27))*7+(COLUMN(O27)-COLUMN($O$27)+1))","v":""},"","","","2024-02-01","2024-02-02","2024-02-03",null,null,{"$f":"IF(MONTH($X$25)<>MONTH($X$25-(WEEKDAY($X$25,1)-(start_day-1))-IF((WEEKDAY($X$25,1)-(start_day-1))<=0,7,0)+(ROW(X27)-ROW($X$27))*7+(COLUMN(X27)-COLUMN($X$27)+1)),\"\",$X$25-(WEEKDAY($X$25,1)-(start_day-1))-IF((WEEKDAY($X$25,1)-(start_day-1))<=0,7,0)+(ROW(X27)-ROW($X$27))*7+(COLUMN(X27)-COLUMN($X$27)+1))","v":""},"2024-04-01","2024-04-02","2024-04-03","2024-04-04","2024-04-05","2024-04-06"]
[{"$nulls":14},"2024-02-04","2024-02-05","2024-02-06","2024-02-07","2024-02-08","2024-02-09","2024-02-10",null,null,"2024-04-07","2024-04-08","2024-04-09","2024-04-10","2024-04-11","2024-04-12","2024-04-13"]
[{"$nulls":14},"2024-02-11","2024-02-12","2024-02-13","2024-02-14","2024-02-15","2024-02-16","2024-02-17",null,null,"2024-04-14","2024-04-15","2024-04-16","2024-04-17","2024-04-18","2024-04-19","2024-04-20"]
[{"$nulls":14},"2024-02-18","2024-02-19","2024-02-20","2024-02-21","2024-02-22","2024-02-23","2024-02-24",null,null,"2024-04-21","2024-04-22","2024-04-23","2024-04-24","2024-04-25","2024-04-26","2024-04-27"]
[{"$nulls":14},"2024-02-25","2024-02-26","2024-02-27","2024-02-28","2024-02-29","","",null,null,"2024-04-28","2024-04-29","2024-04-30","","","",""]
[{"$nulls":14},"","","","","","","",null,null,"","","","","","",""]

{"sheet":"April","index":4,"n_rows":32,"n_cols":30,"rows_kept":32,"merged":[[1,2,1,29],[3,2,3,3],[3,4,3,5],[3,6,3,7],[3,8,3,9],[3,10,3,12],[3,14,3,21],[3,22,3,29],[4,2,4,3],[4,4,4,5],[4,6,4,7],[4,8,4,9],[4,10,4,12],[4,14,4,21],[4,22,4,29],[5,2,5,3],[5,4,5,5],[5,6,5,7],[5,8,5,9],[5,10,5,13],[5,14,5,21],[5,22,5,29],[6,2,7,3],[6,4,6,5],[6,6,6,7],[6,8,6,9],[6,10,6,12],[6,14,6,21],[6,22,6,29],[7,4,7,5],[7,6,7,7],[7,8,7,9],[7,10,7,12],[7,14,7,21],[7,22,7,29],[8,2,8,3],[8,4,8,5],[8,6,8,7],[8,8,8,9],[8,10,8,13],[8,14,8,21],[8,22,8,29],[9,2,10,3],[10,4,10,5],[10,6,10,7],[10,8,10,9],[10,10,10,12],[10,14,10,21],[10,22,10,29],[11,2,11,3],[11,4,11,5],[11,6,11,7],[11,8,11,9],[11,10,11,13],[11,14,11,21],[11,22,11,29],[12,2,13,3],[13,4,13,5],[13,6,13,7],[13,8,13,9],[13,10,13,12],[13,14,13,21],[13,22,13,29],[14,2,14,3],[14,4,14,5],[14,6,14,7],[14,8,14,9],[14,10,14,13],[14,14,14,21],[14,22,14,29],[15,2,16,3],[15,8,15,9],[15,14,15,21],[15,22,15,29],[16,4,16,5],[16,6,16,7],[16,8,16,9],[16,14,16,21],[16,22,16,29],[17,2,17,3],[17,4,17,5],[17,6,17,7],[17,8,17,9],[17,14,17,21],[17,22,17,29],[18,2,19,3],[18,8,18,9],[18,14,18,21],[18,22,18,29],[19,4,19,5],[19,6,19,7],[19,8,19,9],[19,14,19,21],[19,22,19,29],[20,2,20,3],[20,4,20,5],[20,6,20,7],[20,8,20,9],[20,14,20,21],[20,22,20,29],[24,2,25,10],[24,14,24,20],[24,23,24,29],[26,2,26,10],[27,2,28,10],[29,2,30,10]]}
[]
[null,null,{"$f":"DATE(About!P8,About!P10+3,1)","v":"2024-04-01"}]
[]
[null,null,{"$f":"C5","v":"2024-03-31"},null,{"$f":"E5","v":"2024-04-01"},null,{"$f":"G5","v":"2024-04-02"},null,{"$f":"I5","v":"2024-04-03"},null,{"$f":"K5","v":"2024-04-04"},{"$nulls":3},{"$f":"O5","v":"2024-04-05"},{"$nulls":7},{"$f":"W5","v":"2024-04-06"}]
[null,null,{"$f":"$C$2-(WEEKDAY($C$2,1)-(start_day-1))-IF((WEEKDAY($C$2,1)-(start_day-1))<=0,7,0)+1","v":"2024-03-31"},null,{"$f":"C5+1","v":"2024-04-01"},null,{"$f":"E5+1","v":"2024-04-02"},null,{"$f":"G5+1","v":"2024-04-03"},null,{"$f":"I5+1","v":"2024-04-04"},{"$nulls":3},{"$f":"K5+1","v":"2024-04-05"},{"$nulls":7},{"$f":"O5+1","v":"2024-04-06"}]
[]
[null,null,{"$f":"W5+1","v":"2024-04-07"}]
[{"$nulls":4},{"$f":"C7+1","v":"2024-04-08"},null,{"$f":"E8+1","v":"2024-04-09"},null,{"$f":"G8+1","v":"2024-04-10"},null,{"$f":"I8+1","v":"2024-04-11"},{"$nulls":3},{"$f":"K8+1","v":"2024-04-12"},{"$nulls":7},{"$f":"O8+1","v":"2024-04-13"}]
[]
[null,null,{"$f":"W8+1","v":"2024-04-14"}]
[{"$nulls":4},{"$f":"C10+1","v":"2024-04-15"},null,{"$f":"E11+1","v":"2024-04-16"},null,{"$f":"G11+1","v":"2024-04-17"},null,{"$f":"I11+1","v":"2024-04-18"},{"$nulls":3},{"$f":"K11+1","v":"2024-04-19"},{"$nulls":7},{"$f":"O11+1","v":"2024-04-20"}]
[]
[null,null,{"$f":"W11+1","v":"2024-04-21"}]
[{"$nulls":4},{"$f":"C13+1","v":"2024-04-22"},null,{"$f":"E14+1","v":"2024-04-23"},null,{"$f":"G14+1","v":"2024-04-24"},null,{"$f":"I14+1","v":"2024-04-25"},{"$nulls":3},{"$f":"K14+1","v":"2024-04-26"},{"$nulls":7},{"$f":"O14+1","v":"2024-04-27"}]
[]
[null,null,{"$f":"W14+1","v":"2024-04-28"}]
[{"$nulls":4},{"$f":"C16+1","v":"2024-04-29"},null,{"$f":"E17+1","v":"2024-04-30"},null,{"$f":"G17+1","v":"2024-05-01"},null,{"$f":"I17+1","v":"2024-05-02"},{"$nulls":3},{"$f":"K17+1","v":"2024-05-03"},{"$nulls":7},{"$f":"O17+1","v":"2024-05-04"}]
[]
[null,null,{"$f":"W17+1","v":"2024-05-05"}]
[{"$nulls":4},{"$f":"C19+1","v":"2024-05-06"},null,{"$f":"E20+1","v":"2024-05-07"},null,{"$f":"G20+1","v":"2024-05-08"},null,{"$f":"I20+1","v":"2024-05-09"},{"$nulls":3},{"$f":"K20+1","v":"2024-05-10"},{"$nulls":7},{"$f":"O20+1","v":"2024-05-11"}]
[]
[]
[]
[]
[null,null,"Notes",{"$nulls":11},{"$f":"DATE(YEAR(C2),MONTH(C2)-1,1)","v":"2024-03-01"},{"$nulls":8},{"$f":"DATE(YEAR(C2),MONTH(C2)+1,1)","v":"2024-05-01"}]
[{"$nulls":14},{"$f":"INDEX({\"S\";\"M\";\"T\";\"W\";\"T\";\"F\";\"S\"},1+MOD(start_day+1-2,7))","v":"S"},{"$f":"INDEX({\"S\";\"M\";\"T\";\"W\";\"T\";\"F\";\"S\"},1+MOD(start_day+2-2,7))","v":"M"},{"$f":"INDEX({\"S\";\"M\";\"T\";\"W\";\"T\";\"F\";\"S\"},1+MOD(start_day+3-2,7))","v":"T"},{"$f":"INDEX({\"S\";\"M\";\"T\";\"W\";\"T\";\"F\";\"S\"},1+MOD(start_day+4-2,7))","v":"W"},{"$f":"INDEX({\"S\";\"M\";\"T\";\"W\";\"T\";\"F\";\"S\"},1+MOD(start_day+5-2,7))","v":"T"},{"$f":"INDEX({\"S\";\"M\";\"T\";\"W\";\"T\";\"F\";\"S\"},1+MOD(start_day+6-2,7))","v":"F"},{"$f":"INDEX({\"S\";\"M\";\"T\";\"W\";\"T\";\"F\";\"S\"},1+MOD(start_day+7-2,7))","v":"S"},null,null,{"$f":"INDEX({\"S\";\"M\";\"T\";\"W\";\"T\";\"F\";\"S\"},1+MOD(start_day+1-2,7))","v":"S"},{"$f":"INDEX({\"S\";\"M\";\"T\";\"W\";\"T\";\"F\";\"S\"},1+MOD(start_day+2-2,7))","v":"M"},{"$f":"INDEX({\"S\";\"M\";\"T\";\"W\";\"T\";\"F\";\"S\"},1+MOD(start_day+3-2,7))","v":"T"},{"$f":"INDEX({\"S\";\"M\";\"T\";\"W\";\"T\";\"F\";\"S\"},1+MOD(start_day+4-2,7))","v":"W"},{"$f":"INDEX({\"S\";\"M\";\"T\";\"W\";\"T\";\"F\";\"S\"},1+MOD(start_day+5-2,7))","v":"T"},{"$f":"INDEX({\"S\";\"M\";\"T\";\"W\";\"T\";\"F\";\"S\"},1+MOD(start_day+6-2,7))","v":"F"},{"$f":"INDEX({\"S\";\"M\";\"T\";\"W\";\"T\";\"F\";\"S\"},1+MOD(start_day+7-2,7))","v":"S"}]
[{"$nulls":14},{"$f":"IF(MONTH($O$25)<>MONTH($O$25-(WEEKDAY($O$25,1)-(start_day-1))-IF((WEEKDAY($O$25,1)-(start_day-1))<=0,7,0)+(ROW(O27)-ROW($O$27))*7+(COLUMN(O27)-COLUMN($O$27)+1)),\"\",$O$25-(WEEKDAY($O$25,1)-(start_day-1))-IF((WEEKDAY($O$25,1)-(start_day-1))<=0,7,0)+(ROW(O27)-ROW($O$27))*7+(COLUMN(O27)-COLUMN($O$27)+1))","v":""},"","","","","2024-03-01","2024-03-02",null,null,{"$f":"IF(MONTH($X$25)<>MONTH($X$25-(WEEKDAY($X$25,1)-(start_day-1))-IF((WEEKDAY($X$25,1)-(start_day-1))<=0,7,0)+(ROW(X27)-ROW($X$27))*7+(COLUMN(X27)-COLUMN($X$27)+1)),\"\",$X$25-(WEEKDAY($X$25,1)-(start_day-1))-IF((WEEKDAY($X$25,1)-(start_day-1))<=0,7,0)+(ROW(X27)-ROW($X$27))*7+(COLUMN(X27)-COLUMN($X$27)+1))","v":""},"","","2024-05-01","2024-05-02","2024-05-03","2024-05-04"]
[{"$nulls":14},"2024-03-03","2024-03-04","2024-03-05","2024-03-06","2024-03-07","2024-03-08","2024-03-09",null,null,"2024-05-05","2024-05-06","2024-05-07","2024-05-08","2024-05-09","2024-05-10","2024-05-11"]
[{"$nulls":14},"2024-03-10","2024-03-11","2024-03-12","2024-03-13","2024-03-14","2024-03-15","2024-03-16",null,null,"2024-05-12","2024-05-13","2024-05-14","2024-05-15","2024-05-16","2024-05-17","2024-05-18"]
[{"$nulls":14},"2024-03-17","2024-03-18","2024-03-19","2024-03-20","2024-03-21","2024-03-22","2024-03-23",null,null,"2024-05-19","2024-05-20","2024-05-21","2024-05-22","2024-05-23","2024-05-24","2024-05-25"]
[{"$nulls":14},"2024-03-24","2024-03-25","2024-03-26","2024-03-27","2024-03-28","2024-03-29","2024-03-30",null,null,"2024-05-26","2024-05-27","2024-05-28","2024-05-29","2024-05-30","2024-05-31",""]
[{"$nulls":14},"2024-03-31","","","","","","",null,null,"","","","","","",""]

{"sheet":"May","index":5,"n_rows":32,"n_cols":30,"rows_kept":32,"merged":[[1,2,1,29],[3,2,3,3],[3,4,3,5],[3,6,3,7],[3,8,3,9],[3,10,3,12],[3,14,3,21],[3,22,3,29],[4,2,4,3],[4,4,4,5],[4,6,4,7],[4,8,4,9],[4,10,4,12],[4,14,4,21],[4,22,4,29],[5,2,5,3],[5,4,5,5],[5,6,5,7],[5,8,5,9],[5,10,5,13],[5,14,5,21],[5,22,5,29],[6,2,7,3],[6,4,6,5],[6,6,6,7],[6,8,6,9],[6,10,6,12],[6,14,6,21],[6,22,6,29],[7,4,7,5],[7,6,7,7],[7,8,7,9],[7,10,7,12],[7,14,7,21],[7,22,7,29],[8,2,8,3],[8,4,8,5],[8,6,8,7],[8,8,8,9],[8,10,8,13],[8,14,8,21],[8,22,8,29],[9,2,10,3],[10,4,10,5],[10,6,10,7],[10,8,10,9],[10,10,10,12],[10,14,10,21],[10,22,10,29],[11,2,11,3],[11,4,11,5],[11,6,11,7],[11,8,11,9],[11,10,11,13],[11,14,11,21],[11,22,11,29],[12,2,13,3],[13,4,13,5],[13,6,13,7],[13,8,13,9],[13,10,13,12],[13,14,13,21],[13,22,13,29],[14,2,14,3],[14,4,14,5],[14,6,14,7],[14,8,14,9],[14,10,14,13],[14,14,14,21],[14,22,14,29],[15,2,16,3],[15,8,15,9],[16,4,16,5],[16,6,16,7],[16,8,16,9],[16,10,16,12],[16,14,16,21],[16,22,16,29],[17,2,17,3],[17,4,17,5],[17,6,17,7],[17,8,17,9],[17,10,17,12],[17,14,17,21],[17,22,17,29],[18,2,19,3],[18,8,18,9],[19,4,19,5],[19,6,19,7],[19,8,19,9],[19,10,19,12],[19,14,19,21],[19,22,19,29],[20,2,20,3],[20,4,20,5],[20,6,20,7],[20,8,20,9],[20,10,20,12],[20,14,20,21],[20,22,20,29],[24,2,25,10],[24,14,24,20],[24,23,24,29],[26,2,26,10],[27,2,28,10],[29,2,30,10]]}
[]
[null,null,{"$f":"DATE(About!P8,About!P10+4,1)","v":"2024-05-01"}]
[]
[null,null,{"$f":"C5","v":"2024-04-28"},null,{"$f":"E5","v":"2024-04-29"},null,{"$f":"G5","v":"2024-04-30"},null,{"$f":"I5","v":"2024-05-01"},null,{"$f":"K5","v":"2024-05-02"},{"$nulls":3},{"$f":"O5","v":"2024-05-03"},{"$nulls":7},{"$f":"W5","v":"2024-05-04"}]
[null,null,{"$f":"$C$2-(WEEKDAY($C$2,1)-(start_day-1))-IF((WEEKDAY($C$2,1)-(start_day-1))<=0,7,0)+1","v":"2024-04-28"},null,{"$f":"C5+1","v":"2024-04-29"},null,{"$f":"E5+1","v":"2024-04-30"},null,{"$f":"G5+1","v":"2024-05-01"},null,{"$f":"I5+1","v":"2024-05-02"},{"$nulls":3},{"$f":"K5+1","v":"2024-05-03"},{"$nulls":7},{"$f":"O5+1","v":"2024-05-04"}]
[]
[null,null,{"$f":"W5+1","v":"2024-05-05"}]
[{"$nulls":4},{"$f":"C7+1","v":"2024-05-06"},null,{"$f":"E8+1","v":"2024-05-07"},null,{"$f":"G8+1","v":"2024-05-08"},null,{"$f":"I8+1","v":"2024-05-09"},{"$nulls":3},{"$f":"K8+1","v":"2024-05-10"},{"$nulls":7},{"$f":"O8+1","v":"2024-05-11"}]
[]
[null,null,{"$f":"W8+1","v":"2024-05-12"}]
[{"$nulls":4},{"$f":"C10+1","v":"2024-05-13"},null,{"$f":"E11+1","v":"2024-05-14"},null,{"$f":"G11+1","v":"2024-05-15"},null,{"$f":"I11+1","v":"2024-05-16"},{"$nulls":3},{"$f":"K11+1","v":"2024-05-17"},{"$nulls":7},{"$f":"O11+1","v":"2024-05-18"}]
[]
[null,null,{"$f":"W11+1","v":"2024-05-19"}]
[{"$nulls":4},{"$f":"C13+1","v":"2024-05-20"},null,{"$f":"E14+1","v":"2024-05-21"},null,{"$f":"G14+1","v":"2024-05-22"},null,{"$f":"I14+1","v":"2024-05-23"},{"$nulls":3},{"$f":"K14+1","v":"2024-05-24"},{"$nulls":7},{"$f":"O14+1","v":"2024-05-25"}]
[]
[null,null,{"$f":"W14+1","v":"2024-05-26"}]
[{"$nulls":4},{"$f":"C16+1","v":"2024-05-27"},null,{"$f":"E17+1","v":"2024-05-28"},null,{"$f":"G17+1","v":"2024-05-29"},null,{"$f":"I17+1","v":"2024-05-30"},{"$nulls":3},{"$f":"K17+1","v":"2024-05-31"},{"$nulls":7},{"$f":"O17+1","v":"2024-06-01"}]
[]
[null,null,{"$f":"W17+1","v":"2024-06-02"}]
[{"$nulls":4},{"$f":"C19+1","v":"2024-06-03"},null,{"$f":"E20+1","v":"2024-06-04"},null,{"$f":"G20+1","v":"2024-06-05"},null,{"$f":"I20+1","v":"2024-06-06"},{"$nulls":3},{"$f":"K20+1","v":"2024-06-07"},{"$nulls":7},{"$f":"O20+1","v":"2024-06-08"}]
[]
[]
[]
[]
[null,null,"Notes",{"$nulls":11},{"$f":"DATE(YEAR(C2),MONTH(C2)-1,1)","v":"2024-04-01"},{"$nulls":8},{"$f":"DATE(YEAR(C2),MONTH(C2)+1,1)","v":"2024-06-01"}]
[{"$nulls":14},{"$f":"INDEX({\"S\";\"M\";\"T\";\"W\";\"T\";\"F\";\"S\"},1+MOD(start_day+1-2,7))","v":"S"},{"$f":"INDEX({\"S\";\"M\";\"T\";\"W\";\"T\";\"F\";\"S\"},1+MOD(start_day+2-2,7))","v":"M"},{"$f":"INDEX({\"S\";\"M\";\"T\";\"W\";\"T\";\"F\";\"S\"},1+MOD(start_day+3-2,7))","v":"T"},{"$f":"INDEX({\"S\";\"M\";\"T\";\"W\";\"T\";\"F\";\"S\"},1+MOD(start_day+4-2,7))","v":"W"},{"$f":"INDEX({\"S\";\"M\";\"T\";\"W\";\"T\";\"F\";\"S\"},1+MOD(start_day+5-2,7))","v":"T"},{"$f":"INDEX({\"S\";\"M\";\"T\";\"W\";\"T\";\"F\";\"S\"},1+MOD(start_day+6-2,7))","v":"F"},{"$f":"INDEX({\"S\";\"M\";\"T\";\"W\";\"T\";\"F\";\"S\"},1+MOD(start_day+7-2,7))","v":"S"},null,null,{"$f":"INDEX({\"S\";\"M\";\"T\";\"W\";\"T\";\"F\";\"S\"},1+MOD(start_day+1-2,7))","v":"S"},{"$f":"INDEX({\"S\";\"M\";\"T\";\"W\";\"T\";\"F\";\"S\"},1+MOD(start_day+2-2,7))","v":"M"},{"$f":"INDEX({\"S\";\"M\";\"T\";\"W\";\"T\";\"F\";\"S\"},1+MOD(start_day+3-2,7))","v":"T"},{"$f":"INDEX({\"S\";\"M\";\"T\";\"W\";\"T\";\"F\";\"S\"},1+MOD(start_day+4-2,7))","v":"W"},{"$f":"INDEX({\"S\";\"M\";\"T\";\"W\";\"T\";\"F\";\"S\"},1+MOD(start_day+5-2,7))","v":"T"},{"$f":"INDEX({\"S\";\"M\";\"T\";\"W\";\"T\";\"F\";\"S\"},1+MOD(start_day+6-2,7))","v":"F"},{"$f":"INDEX({\"S\";\"M\";\"T\";\"W\";\"T\";\"F\";\"S\"},1+MOD(start_day+7-2,7))","v":"S"}]
[{"$nulls":14},{"$f":"IF(MONTH($O$25)<>MONTH($O$25-(WEEKDAY($O$25,1)-(start_day-1))-IF((WEEKDAY($O$25,1)-(start_day-1))<=0,7,0)+(ROW(O27)-ROW($O$27))*7+(COLUMN(O27)-COLUMN($O$27)+1)),\"\",$O$25-(WEEKDAY($O$25,1)-(start_day-1))-IF((WEEKDAY($O$25,1)-(start_day-1))<=0,7,0)+(ROW(O27)-ROW($O$27))*7+(COLUMN(O27)-COLUMN($O$27)+1))","v":""},"2024-04-01","2024-04-02","2024-04-03","2024-04-04","2024-04-05","2024-04-06",null,null,{"$f":"IF(MONTH($X$25)<>MONTH($X$25-(WEEKDAY($X$25,1)-(start_day-1))-IF((WEEKDAY($X$25,1)-(start_day-1))<=0,7,0)+(ROW(X27)-ROW($X$27))*7+(COLUMN(X27)-COLUMN($X$27)+1)),\"\",$X$25-(WEEKDAY($X$25,1)-(start_day-1))-IF((WEEKDAY($X$25,1)-(start_day-1))<=0,7,0)+(ROW(X27)-ROW($X$27))*7+(COLUMN(X27)-COLUMN($X$27)+1))","v":""},"","","","","","2024-06-01"]
[{"$nulls":14},"2024-04-07","2024-04-08","2024-04-09","2024-04-10","2024-04-11","2024-04-12","2024-04-13",null,null,"2024-06-02","2024-06-03","2024-06-04","2024-06-05","2024-06-06","2024-06-07","2024-06-08"]
[{"$nulls":14},"2024-04-14","2024-04-15","2024-04-16","2024-04-17","2024-04-18","2024-04-19","2024-04-20",null,null,"2024-06-09","2024-06-10","2024-06-11","2024-06-12","2024-06-13","2024-06-14","2024-06-15"]
[{"$nulls":14},"2024-04-21","2024-04-22","2024-04-23","2024-04-24","2024-04-25","2024-04-26","2024-04-27",null,null,"2024-06-16","2024-06-17","2024-06-18","2024-06-19","2024-06-20","2024-06-21","2024-06-22"]
[{"$nulls":14},"2024-04-28","2024-04-29","2024-04-30","","","","",null,null,"2024-06-23","2024-06-24","2024-06-25","2024-06-26","2024-06-27","2024-06-28","2024-06-29"]
[{"$nulls":14},"","","","","","","",null,null,"2024-06-30","","","","","",""]

{"sheet":"June","index":6,"n_rows":32,"n_cols":30,"rows_kept":32,"merged":[[1,2,1,29],[3,2,3,3],[3,4,3,5],[3,6,3,7],[3,8,3,9],[3,10,3,12],[3,14,3,21],[3,22,3,29],[4,2,4,3],[4,4,4,5],[4,6,4,7],[4,8,4,9],[4,10,4,12],[4,14,4,21],[4,22,4,29],[5,2,5,3],[5,4,5,5],[5,6,5,7],[5,8,5,9],[5,10,5,13],[5,14,5,21],[5,22,5,29],[6,2,7,3],[6,4,6,5],[6,6,6,7],[6,8,6,9],[6,10,6,12],[6,14,6,21],[6,22,6,29],[7,4,7,5],[7,6,7,7],[7,8,7,9],[7,10,7,12],[7,14,7,21],[7,22,7,29],[8,2,8,3],[8,4,8,5],[8,6,8,7],[8,8,8,9],[8,10,8,13],[8,14,8,21],[8,22,8,29],[9,2,10,3],[10,4,10,5],[10,6,10,7],[10,8,10,9],[10,10,10,12],[10,14,10,21],[10,22,10,29],[11,2,11,3],[11,4,11,5],[11,6,11,7],[11,8,11,9],[11,10,11,13],[11,14,11,21],[11,22,11,29],[12,2,13,3],[13,4,13,5],[13,6,13,7],[13,8,13,9],[13,10,13,12],[13,14,13,21],[13,22,13,29],[14,2,14,3],[14,4,14,5],[14,6,14,7],[14,8,14,9],[14,10,14,13],[14,14,14,21],[14,22,14,29],[15,2,16,3],[16,4,16,5],[16,6,16,7],[16,8,16,9],[16,10,16,12],[16,14,16,21],[16,22,16,29],[17,2,17,3],[17,4,17,5],[17,6,17,7],[17,8,17,9],[17,10,17,12],[17,14,17,21],[17,22,17,29],[18,2,19,3],[19,4,19,5],[19,6,19,7],[19,8,19,9],[19,10,19,12],[19,14,19,21],[19,22,19,29],[20,2,20,3],[20,4,20,5],[20,6,20,7],[20,8,20,9],[20,10,20,12],[20,14,20,21],[20,22,20,29],[24,2,25,10],[24,14,24,20],[24,23,24,29],[26,2,26,10],[27,2,28,10],[29,2,30,10]]}
[]
[null,null,{"$f":"DATE(About!P8,About!P10+5,1)","v":"2024-06-01"}]
[]
[null,null,{"$f":"C5","v":"2024-05-26"},null,{"$f":"E5","v":"2024-05-27"},null,{"$f":"G5","v":"2024-05-28"},null,{"$f":"I5","v":"2024-05-29"},null,{"$f":"K5","v":"2024-05-30"},{"$nulls":3},{"$f":"O5","v":"2024-05-31"},{"$nulls":7},{"$f":"W5","v":"2024-06-01"}]
[null,null,{"$f":"$C$2-(WEEKDAY($C$2,1)-(start_day-1))-IF((WEEKDAY($C$2,1)-(start_day-1))<=0,7,0)+1","v":"2024-05-26"},null,{"$f":"C5+1","v":"2024-05-27"},null,{"$f":"E5+1","v":"2024-05-28"},null,{"$f":"G5+1","v":"2024-05-29"},null,{"$f":"I5+1","v":"2024-05-30"},{"$nulls":3},{"$f":"K5+1","v":"2024-05-31"},{"$nulls":7},{"$f":"O5+1","v":"2024-06-01"}]
[]
[null,null,{"$f":"W5+1","v":"2024-06-02"}]
[{"$nulls":4},{"$f":"C7+1","v":"2024-06-03"},null,{"$f":"E8+1","v":"2024-06-04"},null,{"$f":"G8+1","v":"2024-06-05"},null,{"$f":"I8+1","v":"2024-06-06"},{"$nulls":3},{"$f":"K8+1","v":"2024-06-07"},{"$nulls":7},{"$f":"O8+1","v":"2024-06-08"}]
[]
[null,null,{"$f":"W8+1","v":"2024-06-09"}]
[{"$nulls":4},{"$f":"C10+1","v":"2024-06-10"},null,{"$f":"E11+1","v":"2024-06-11"},null,{"$f":"G11+1","v":"2024-06-12"},null,{"$f":"I11+1","v":"2024-06-13"},{"$nulls":3},{"$f":"K11+1","v":"2024-06-14"},{"$nulls":7},{"$f":"O11+1","v":"2024-06-15"}]
[]
[null,null,{"$f":"W11+1","v":"2024-06-16"}]
[{"$nulls":4},{"$f":"C13+1","v":"2024-06-17"},null,{"$f":"E14+1","v":"2024-06-18"},null,{"$f":"G14+1","v":"2024-06-19"},null,{"$f":"I14+1","v":"2024-06-20"},{"$nulls":3},{"$f":"K14+1","v":"2024-06-21"},{"$nulls":7},{"$f":"O14+1","v":"2024-06-22"}]
[]
[null,null,{"$f":"W14+1","v":"2024-06-23"}]
[{"$nulls":4},{"$f":"C16+1","v":"2024-06-24"},null,{"$f":"E17+1","v":"2024-06-25"},null,{"$f":"G17+1","v":"2024-06-26"},null,{"$f":"I17+1","v":"2024-06-27"},{"$nulls":3},{"$f":"K17+1","v":"2024-06-28"},{"$nulls":7},{"$f":"O17+1","v":"2024-06-29"}]
[]
[null,null,{"$f":"W17+1","v":"2024-06-30"}]
[{"$nulls":4},{"$f":"C19+1","v":"2024-07-01"},null,{"$f":"E20+1","v":"2024-07-02"},null,{"$f":"G20+1","v":"2024-07-03"},null,{"$f":"I20+1","v":"2024-07-04"},{"$nulls":3},{"$f":"K20+1","v":"2024-07-05"},{"$nulls":7},{"$f":"O20+1","v":"2024-07-06"}]
[]
[]
[]
[]
[null,null,"Notes",{"$nulls":11},{"$f":"DATE(YEAR(C2),MONTH(C2)-1,1)","v":"2024-05-01"},{"$nulls":8},{"$f":"DATE(YEAR(C2),MONTH(C2)+1,1)","v":"2024-07-01"}]
[{"$nulls":14},{"$f":"INDEX({\"S\";\"M\";\"T\";\"W\";\"T\";\"F\";\"S\"},1+MOD(start_day+1-2,7))","v":"S"},{"$f":"INDEX({\"S\";\"M\";\"T\";\"W\";\"T\";\"F\";\"S\"},1+MOD(start_day+2-2,7))","v":"M"},{"$f":"INDEX({\"S\";\"M\";\"T\";\"W\";\"T\";\"F\";\"S\"},1+MOD(start_day+3-2,7))","v":"T"},{"$f":"INDEX({\"S\";\"M\";\"T\";\"W\";\"T\";\"F\";\"S\"},1+MOD(start_day+4-2,7))","v":"W"},{"$f":"INDEX({\"S\";\"M\";\"T\";\"W\";\"T\";\"F\";\"S\"},1+MOD(start_day+5-2,7))","v":"T"},{"$f":"INDEX({\"S\";\"M\";\"T\";\"W\";\"T\";\"F\";\"S\"},1+MOD(start_day+6-2,7))","v":"F"},{"$f":"INDEX({\"S\";\"M\";\"T\";\"W\";\"T\";\"F\";\"S\"},1+MOD(start_day+7-2,7))","v":"S"},null,null,{"$f":"INDEX({\"S\";\"M\";\"T\";\"W\";\"T\";\"F\";\"S\"},1+MOD(start_day+1-2,7))","v":"S"},{"$f":"INDEX({\"S\";\"M\";\"T\";\"W\";\"T\";\"F\";\"S\"},1+MOD(start_day+2-2,7))","v":"M"},{"$f":"INDEX({\"S\";\"M\";\"T\";\"W\";\"T\";\"F\";\"S\"},1+MOD(start_day+3-2,7))","v":"T"},{"$f":"INDEX({\"S\";\"M\";\"T\";\"W\";\"T\";\"F\";\"S\"},1+MOD(start_day+4-2,7))","v":"W"},{"$f":"INDEX({\"S\";\"M\";\"T\";\"W\";\"T\";\"F\";\"S\"},1+MOD(start_day+5-2,7))","v":"T"},{"$f":"INDEX({\"S\";\"M\";\"T\";\"W\";\"T\";\"F\";\"S\"},1+MOD(start_day+6-2,7))","v":"F"},{"$f":"INDEX({\"S\";\"M\";\"T\";\"W\";\"T\";\"F\";\"S\"},1+MOD(start_day+7-2,7))","v":"S"}]
[{"$nulls":14},{"$f":"IF(MONTH($O$25)<>MONTH($O$25-(WEEKDAY($O$25,1)-(start_day-1))-IF((WEEKDAY($O$25,1)-(start_day-1))<=0,7,0)+(ROW(O27)-ROW($O$27))*7+(COLUMN(O27)-COLUMN($O$27)+1)),\"\",$O$25-(WEEKDAY($O$25,1)-(start_day-1))-IF((WEEKDAY($O$25,1)-(start_day-1))<=0,7,0)+(ROW(O27)-ROW($O$27))*7+(COLUMN(O27)-COLUMN($O$27)+1))","v":""},"","","2024-05-01","2024-05-02","2024-05-03","2024-05-04",null,null,{"$f":"IF(MONTH($X$25)<>MONTH($X$25-(WEEKDAY($X$25,1)-(start_day-1))-IF((WEEKDAY($X$25,1)-(start_day-1))<=0,7,0)+(ROW(X27)-ROW($X$27))*7+(COLUMN(X27)-COLUMN($X$27)+1)),\"\",$X$25-(WEEKDAY($X$25,1)-(start_day-1))-IF((WEEKDAY($X$25,1)-(start_day-1))<=0,7,0)+(ROW(X27)-ROW($X$27))*7+(COLUMN(X27)-COLUMN($X$27)+1))","v":""},"2024-07-01","2024-07-02","2024-07-03","2024-07-04","2024-07-05","2024-07-06"]
[{"$nulls":14},"2024-05-05","2024-05-06","2024-05-07","2024-05-08","2024-05-09","2024-05-10","2024-05-11",null,null,"2024-07-07","2024-07-08","2024-07-09","2024-07-10","2024-07-11","2024-07-12","2024-07-13"]
[{"$nulls":14},"2024-05-12","2024-05-13","2024-05-14","2024-05-15","2024-05-16","2024-05-17","2024-05-18",null,null,"2024-07-14","2024-07-15","2024-07-16","2024-07-17","2024-07-18","2024-07-19","2024-07-20"]
[{"$nulls":14},"2024-05-19","2024-05-20","2024-05-21","2024-05-22","2024-05-23","2024-05-24","2024-05-25",null,null,"2024-07-21","2024-07-22","2024-07-23","2024-07-24","2024-07-25","2024-07-26","2024-07-27"]
[{"$nulls":14},"2024-05-26","2024-05-27","2024-05-28","2024-05-29","2024-05-30","2024-05-31","",null,null,"2024-07-28","2024-07-29","2024-07-30","2024-07-31","","",""]
[{"$nulls":14},"","","","","","","",null,null,"","","","","","",""]

{"sheet":"July","index":7,"n_rows":32,"n_cols":30,"rows_kept":32,"merged":[[1,2,1,29],[3,2,3,3],[3,4,3,5],[3,6,3,7],[3,8,3,9],[3,10,3,12],[3,14,3,21],[3,22,3,29],[4,2,4,3],[4,4,4,5],[4,6,4,7],[4,8,4,9],[4,10,4,12],[4,14,4,21],[4,22,4,29],[5,2,5,3],[5,4,5,5],[5,6,5,7],[5,8,5,9],[5,10,5,13],[5,14,5,21],[5,22,5,29],[6,2,7,3],[6,4,6,5],[6,6,6,7],[6,8,6,9],[6,10,6,12],[6,14,6,21],[6,22,6,29],[7,4,7,5],[7,6,7,7],[7,8,7,9],[7,10,7,12],[7,14,7,21],[7,22,7,29],[8,2,8,3],[8,4,8,5],[8,6,8,7],[8,8,8,9],[8,10,8,13],[8,14,8,21],[8,22,8,29],[9,2,10,3],[10,4,10,5],[10,6,10,7],[10,8,10,9],[10,10,10,12],[10,14,10,21],[10,22,10,29],[11,2,11,3],[11,4,11,5],[11,6,11,7],[11,8,11,9],[11,10,11,13],[11,14,11,21],[11,22,11,29],[12,2,13,3],[13,4,13,5],[13,6,13,7],[13,8,13,9],[13,10,13,12],[13,14,13,21],[13,22,13,29],[14,2,14,3],[14,4,14,5],[14,6,14,7],[14,8,14,9],[14,10,14,13],[14,14,14,21],[14,22,14,29],[15,2,16,3],[15,8,15,9],[16,4,16,5],[16,6,16,7],[16,8,16,9],[16,14,16,21],[16,22,16,29],[17,2,17,3],[17,4,17,5],[17,6,17,7],[17,8,17,9],[17,14,17,21],[17,22,17,29],[18,2,19,3],[18,8,18,9],[19,4,19,5],[19,6,19,7],[19,8,19,9],[19,14,19,21],[19,22,19,29],[20,2,20,3],[20,4,20,5],[20,6,20,7],[20,8,20,9],[20,14,20,21],[20,22,20,29],[24,2,25,10],[24,14,24,20],[24,23,24,29],[26,2,26,10],[27,2,28,10],[29,2,30,10]]}
[]
[null,null,{"$f":"DATE(About!P8,About!P10+6,1)","v":"2024-07-01"}]
[]
[null,null,{"$f":"C5","v":"2024-06-30"},null,{"$f":"E5","v":"2024-07-01"},null,{"$f":"G5","v":"2024-07-02"},null,{"$f":"I5","v":"2024-07-03"},null,{"$f":"K5","v":"2024-07-04"},{"$nulls":3},{"$f":"O5","v":"2024-07-05"},{"$nulls":7},{"$f":"W5","v":"2024-07-06"}]
[null,null,{"$f":"$C$2-(WEEKDAY($C$2,1)-(start_day-1))-IF((WEEKDAY($C$2,1)-(start_day-1))<=0,7,0)+1","v":"2024-06-30"},null,{"$f":"C5+1","v":"2024-07-01"},null,{"$f":"E5+1","v":"2024-07-02"},null,{"$f":"G5+1","v":"2024-07-03"},null,{"$f":"I5+1","v":"2024-07-04"},{"$nulls":3},{"$f":"K5+1","v":"2024-07-05"},{"$nulls":7},{"$f":"O5+1","v":"2024-07-06"}]
[]
[null,null,{"$f":"W5+1","v":"2024-07-07"}]
[{"$nulls":4},{"$f":"C7+1","v":"2024-07-08"},null,{"$f":"E8+1","v":"2024-07-09"},null,{"$f":"G8+1","v":"2024-07-10"},null,{"$f":"I8+1","v":"2024-07-11"},{"$nulls":3},{"$f":"K8+1","v":"2024-07-12"},{"$nulls":7},{"$f":"O8+1","v":"2024-07-13"}]
[]
[null,null,{"$f":"W8+1","v":"2024-07-14"}]
[{"$nulls":4},{"$f":"C10+1","v":"2024-07-15"},null,{"$f":"E11+1","v":"2024-07-16"},null,{"$f":"G11+1","v":"2024-07-17"},null,{"$f":"I11+1","v":"2024-07-18"},{"$nulls":3},{"$f":"K11+1","v":"2024-07-19"},{"$nulls":7},{"$f":"O11+1","v":"2024-07-20"}]
[]
[null,null,{"$f":"W11+1","v":"2024-07-21"}]
[{"$nulls":4},{"$f":"C13+1","v":"2024-07-22"},null,{"$f":"E14+1","v":"2024-07-23"},null,{"$f":"G14+1","v":"2024-07-24"},null,{"$f":"I14+1","v":"2024-07-25"},{"$nulls":3},{"$f":"K14+1","v":"2024-07-26"},{"$nulls":7},{"$f":"O14+1","v":"2024-07-27"}]
[]
[null,null,{"$f":"W14+1","v":"2024-07-28"}]
[{"$nulls":4},{"$f":"C16+1","v":"2024-07-29"},null,{"$f":"E17+1","v":"2024-07-30"},null,{"$f":"G17+1","v":"2024-07-31"},null,{"$f":"I17+1","v":"2024-08-01"},{"$nulls":3},{"$f":"K17+1","v":"2024-08-02"},{"$nulls":7},{"$f":"O17+1","v":"2024-08-03"}]
[]
[null,null,{"$f":"W17+1","v":"2024-08-04"}]
[{"$nulls":4},{"$f":"C19+1","v":"2024-08-05"},null,{"$f":"E20+1","v":"2024-08-06"},null,{"$f":"G20+1","v":"2024-08-07"},null,{"$f":"I20+1","v":"2024-08-08"},{"$nulls":3},{"$f":"K20+1","v":"2024-08-09"},{"$nulls":7},{"$f":"O20+1","v":"2024-08-10"}]
[]
[]
[]
[]
[null,null,"Notes",{"$nulls":11},{"$f":"DATE(YEAR(C2),MONTH(C2)-1,1)","v":"2024-06-01"},{"$nulls":8},{"$f":"DATE(YEAR(C2),MONTH(C2)+1,1)","v":"2024-08-01"}]
[{"$nulls":14},{"$f":"INDEX({\"S\";\"M\";\"T\";\"W\";\"T\";\"F\";\"S\"},1+MOD(start_day+1-2,7))","v":"S"},{"$f":"INDEX({\"S\";\"M\";\"T\";\"W\";\"T\";\"F\";\"S\"},1+MOD(start_day+2-2,7))","v":"M"},{"$f":"INDEX({\"S\";\"M\";\"T\";\"W\";\"T\";\"F\";\"S\"},1+MOD(start_day+3-2,7))","v":"T"},{"$f":"INDEX({\"S\";\"M\";\"T\";\"W\";\"T\";\"F\";\"S\"},1+MOD(start_day+4-2,7))","v":"W"},{"$f":"INDEX({\"S\";\"M\";\"T\";\"W\";\"T\";\"F\";\"S\"},1+MOD(start_day+5-2,7))","v":"T"},{"$f":"INDEX({\"S\";\"M\";\"T\";\"W\";\"T\";\"F\";\"S\"},1+MOD(start_day+6-2,7))","v":"F"},{"$f":"INDEX({\"S\";\"M\";\"T\";\"W\";\"T\";\"F\";\"S\"},1+MOD(start_day+7-2,7))","v":"S"},null,null,{"$f":"INDEX({\"S\";\"M\";\"T\";\"W\";\"T\";\"F\";\"S\"},1+MOD(start_day+1-2,7))","v":"S"},{"$f":"INDEX({\"S\";\"M\";\"T\";\"W\";\"T\";\"F\";\"S\"},1+MOD(start_day+2-2,7))","v":"M"},{"$f":"INDEX({\"S\";\"M\";\"T\";\"W\";\"T\";\"F\";\"S\"},1+MOD(start_day+3-2,7))","v":"T"},{"$f":"INDEX({\"S\";\"M\";\"T\";\"W\";\"T\";\"F\";\"S\"},1+MOD(start_day+4-2,7))","v":"W"},{"$f":"INDEX({\"S\";\"M\";\"T\";\"W\";\"T\";\"F\";\"S\"},1+MOD(start_day+5-2,7))","v":"T"},{"$f":"INDEX({\"S\";\"M\";\"T\";\"W\";\"T\";\"F\";\"S\"},1+MOD(start_day+6-2,7))","v":"F"},{"$f":"INDEX({\"S\";\"M\";\"T\";\"W\";\"T\";\"F\";\"S\"},1+MOD(start_day+7-2,7))","v":"S"}]
[{"$nulls":14},{"$f":"IF(MONTH($O$25)<>MONTH($O$25-(WEEKDAY($O$25,1)-(start_day-1))-IF((WEEKDAY($O$25,1)-(start_day-1))<=0,7,0)+(ROW(O27)-ROW($O$27))*7+(COLUMN(O27)-COLUMN($O$27)+1)),\"\",$O$25-(WEEKDAY($O$25,1)-(start_day-1))-IF((WEEKDAY($O$25,1)-(start_day-1))<=0,7,0)+(ROW(O27)-ROW($O$27))*7+(COLUMN(O27)-COLUMN($O$27)+1))","v":""},"","","","","","2024-06-01",null,null,{"$f":"IF(MONTH($X$25)<>MONTH($X$25-(WEEKDAY($X$25,1)-(start_day-1))-IF((WEEKDAY($X$25,1)-(start_day-1))<=0,7,0)+(ROW(X27)-ROW($X$27))*7+(COLUMN(X27)-COLUMN($X$27)+1)),\"\",$X$25-(WEEKDAY($X$25,1)-(start_day-1))-IF((WEEKDAY($X$25,1)-(start_day-1))<=0,7,0)+(ROW(X27)-ROW($X$27))*7+(COLUMN(X27)-COLUMN($X$27)+1))","v":""},"","","","2024-08-01","2024-08-02","2024-08-03"]
[{"$nulls":14},"2024-06-02","2024-06-03","2024-06-04","2024-06-05","2024-06-06","2024-06-07","2024-06-08",null,null,"2024-08-04","2024-08-05","2024-08-06","2024-08-07","2024-08-08","2024-08-09","2024-08-10"]
[{"$nulls":14},"2024-06-09","2024-06-10","2024-06-11","2024-06-12","2024-06-13","2024-06-14","2024-06-15",null,null,"2024-08-11","2024-08-12","2024-08-13","2024-08-14","2024-08-15","2024-08-16","2024-08-17"]
[{"$nulls":14},"2024-06-16","2024-06-17","2024-06-18","2024-06-19","2024-06-20","2024-06-21","2024-06-22",null,null,"2024-08-18","2024-08-19","2024-08-20","2024-08-21","2024-08-22","2024-08-23","2024-08-24"]
[{"$nulls":14},"2024-06-23","2024-06-24","2024-06-25","2024-06-26","2024-06-27","2024-06-28","2024-06-29",null,null,"2024-08-25","2024-08-26","2024-08-27","2024-08-28","2024-08-29","2024-08-30","2024-08-31"]
[{"$nulls":14},"2024-06-30","","","","","","",null,null,"","","","","","",""]

{"sheet":"August","index":8,"n_rows":32,"n_cols":30,"rows_kept":32,"merged":[[1,2,1,29],[3,2,3,3],[3,4,3,5],[3,6,3,7],[3,8,3,9],[3,10,3,12],[3,14,3,21],[3,22,3,29],[4,2,4,3],[4,4,4,5],[4,6,4,7],[4,8,4,9],[4,10,4,12],[4,14,4,21],[4,22,4,29],[5,2,5,3],[5,4,5,5],[5,6,5,7],[5,8,5,9],[5,10,5,13],[5,14,5,21],[5,22,5,29],[6,2,7,3],[6,4,6,5],[6,6,6,7],[6,8,6,9],[6,10,6,12],[6,14,6,21],[6,22,6,29],[7,4,7,5],[7,6,7,7],[7,8,7,9],[7,10,7,12],[7,14,7,21],[7,22,7,29],[8,2,8,3],[8,4,8,5],[8,6,8,7],[8,8,8,9],[8,10,8,13],[8,14,8,21],[8,22,8,29],[9,2,10,3],[10,4,10,5],[10,6,10,7],[10,8,10,9],[10,10,10,12],[10,14,10,21],[10,22,10,29],[11,2,11,3],[11,4,11,5],[11,6,11,7],[11,8,11,9],[11,10,11,13],[11,14,11,21],[11,22,11,29],[12,2,13,3],[13,4,13,5],[13,6,13,7],[13,8,13,9],[13,10,13,12],[13,14,13,21],[13,22,13,29],[14,2,14,3],[14,4,14,5],[14,6,14,7],[14,8,14,9],[14,10,14,13],[14,14,14,21],[14,22,14,29],[15,2,16,3],[15,8,15,9],[16,4,16,5],[16,6,16,7],[16,8,16,9],[16,14,16,21],[16,22,16,29],[17,2,17,3],[17,4,17,5],[17,6,17,7],[17,8,17,9],[17,14,17,21],[17,22,17,29],[18,2,19,3],[18,8,18,9],[19,4,19,5],[19,6,19,7],[19,8,19,9],[19,14,19,21],[19,22,19,29],[20,2,20,3],[20,4,20,5],[20,6,20,7],[20,8,20,9],[20,14,20,21],[20,22,20,29],[24,2,25,10],[24,14,24,20],[24,23,24,29],[26,2,26,10],[27,2,28,10],[29,2,30,10]]}
[]
[null,null,{"$f":"DATE(About!P8,About!P10+7,1)","v":"2024-08-01"}]
[]
[null,null,{"$f":"C5","v":"2024-07-28"},null,{"$f":"E5","v":"2024-07-29"},null,{"$f":"G5","v":"2024-07-30"},null,{"$f":"I5","v":"2024-07-31"},null,{"$f":"K5","v":"2024-08-01"},{"$nulls":3},{"$f":"O5","v":"2024-08-02"},{"$nulls":7},{"$f":"W5","v":"2024-08-03"}]
[null,null,{"$f":"$C$2-(WEEKDAY($C$2,1)-(start_day-1))-IF((WEEKDAY($C$2,1)-(start_day-1))<=0,7,0)+1","v":"2024-07-28"},null,{"$f":"C5+1","v":"2024-07-29"},null,{"$f":"E5+1","v":"2024-07-30"},null,{"$f":"G5+1","v":"2024-07-31"},null,{"$f":"I5+1","v":"2024-08-01"},{"$nulls":3},{"$f":"K5+1","v":"2024-08-02"},{"$nulls":7},{"$f":"O5+1","v":"2024-08-03"}]
[]
[null,null,{"$f":"W5+1","v":"2024-08-04"}]
[{"$nulls":4},{"$f":"C7+1","v":"2024-08-05"},null,{"$f":"E8+1","v":"2024-08-06"},null,{"$f":"G8+1","v":"2024-08-07"},null,{"$f":"I8+1","v":"2024-08-08"},{"$nulls":3},{"$f":"K8+1","v":"2024-08-09"},{"$nulls":7},{"$f":"O8+1","v":"2024-08-10"}]
[]
[null,null,{"$f":"W8+1","v":"2024-08-11"}]
[{"$nulls":4},{"$f":"C10+1","v":"2024-08-12"},null,{"$f":"E11+1","v":"2024-08-13"},null,{"$f":"G11+1","v":"2024-08-14"},null,{"$f":"I11+1","v":"2024-08-15"},{"$nulls":3},{"$f":"K11+1","v":"2024-08-16"},{"$nulls":7},{"$f":"O11+1","v":"2024-08-17"}]
[]
[null,null,{"$f":"W11+1","v":"2024-08-18"}]
[{"$nulls":4},{"$f":"C13+1","v":"2024-08-19"},null,{"$f":"E14+1","v":"2024-08-20"},null,{"$f":"G14+1","v":"2024-08-21"},null,{"$f":"I14+1","v":"2024-08-22"},{"$nulls":3},{"$f":"K14+1","v":"2024-08-23"},{"$nulls":7},{"$f":"O14+1","v":"2024-08-24"}]
[]
[null,null,{"$f":"W14+1","v":"2024-08-25"}]
[{"$nulls":4},{"$f":"C16+1","v":"2024-08-26"},null,{"$f":"E17+1","v":"2024-08-27"},null,{"$f":"G17+1","v":"2024-08-28"},null,{"$f":"I17+1","v":"2024-08-29"},{"$nulls":3},{"$f":"K17+1","v":"2024-08-30"},{"$nulls":7},{"$f":"O17+1","v":"2024-08-31"}]
[]
[null,null,{"$f":"W17+1","v":"2024-09-01"}]
[{"$nulls":4},{"$f":"C19+1","v":"2024-09-02"},null,{"$f":"E20+1","v":"2024-09-03"},null,{"$f":"G20+1","v":"2024-09-04"},null,{"$f":"I20+1","v":"2024-09-05"},{"$nulls":3},{"$f":"K20+1","v":"2024-09-06"},{"$nulls":7},{"$f":"O20+1","v":"2024-09-07"}]
[]
[]
[]
[]
[null,null,"Notes",{"$nulls":11},{"$f":"DATE(YEAR(C2),MONTH(C2)-1,1)","v":"2024-07-01"},{"$nulls":8},{"$f":"DATE(YEAR(C2),MONTH(C2)+1,1)","v":"2024-09-01"}]
[{"$nulls":14},{"$f":"INDEX({\"S\";\"M\";\"T\";\"W\";\"T\";\"F\";\"S\"},1+MOD(start_day+1-2,7))","v":"S"},{"$f":"INDEX({\"S\";\"M\";\"T\";\"W\";\"T\";\"F\";\"S\"},1+MOD(start_day+2-2,7))","v":"M"},{"$f":"INDEX({\"S\";\"M\";\"T\";\"W\";\"T\";\"F\";\"S\"},1+MOD(start_day+3-2,7))","v":"T"},{"$f":"INDEX({\"S\";\"M\";\"T\";\"W\";\"T\";\"F\";\"S\"},1+MOD(start_day+4-2,7))","v":"W"},{"$f":"INDEX({\"S\";\"M\";\"T\";\"W\";\"T\";\"F\";\"S\"},1+MOD(start_day+5-2,7))","v":"T"},{"$f":"INDEX({\"S\";\"M\";\"T\";\"W\";\"T\";\"F\";\"S\"},1+MOD(start_day+6-2,7))","v":"F"},{"$f":"INDEX({\"S\";\"M\";\"T\";\"W\";\"T\";\"F\";\"S\"},1+MOD(start_day+7-2,7))","v":"S"},null,null,{"$f":"INDEX({\"S\";\"M\";\"T\";\"W\";\"T\";\"F\";\"S\"},1+MOD(start_day+1-2,7))","v":"S"},{"$f":"INDEX({\"S\";\"M\";\"T\";\"W\";\"T\";\"F\";\"S\"},1+MOD(start_day+2-2,7))","v":"M"},{"$f":"INDEX({\"S\";\"M\";\"T\";\"W\";\"T\";\"F\";\"S\"},1+MOD(start_day+3-2,7))","v":"T"},{"$f":"INDEX({\"S\";\"M\";\"T\";\"W\";\"T\";\"F\";\"S\"},1+MOD(start_day+4-2,7))","v":"W"},{"$f":"INDEX({\"S\";\"M\";\"T\";\"W\";\"T\";\"F\";\"S\"},1+MOD(start_day+5-2,7))","v":"T"},{"$f":"INDEX({\"S\";\"M\";\"T\";\"W\";\"T\";\"F\";\"S\"},1+MOD(start_day+6-2,7))","v":"F"},{"$f":"INDEX({\"S\";\"M\";\"T\";\"W\";\"T\";\"F\";\"S\"},1+MOD(start_day+7-2,7))","v":"S"}]
[{"$nulls":14},{"$f":"IF(MONTH($O$25)<>MONTH($O$25-(WEEKDAY($O$25,1)-(start_day-1))-IF((WEEKDAY($O$25,1)-(start_day-1))<=0,7,0)+(ROW(O27)-ROW($O$27))*7+(COLUMN(O27)-COLUMN($O$27)+1)),\"\",$O$25-(WEEKDAY($O$25,1)-(start_day-1))-IF((WEEKDAY($O$25,1)-(start_day-1))<=0,7,0)+(ROW(O27)-ROW($O$27))*7+(COLUMN(O27)-COLUMN($O$27)+1))","v":""},"2024-07-01","2024-07-02","2024-07-03","2024-07-04","2024-07-05","2024-07-06",null,null,{"$f":"IF(MONTH($X$25)<>MONTH($X$25-(WEEKDAY($X$25,1)-(start_day-1))-IF((WEEKDAY($X$25,1)-(start_day-1))<=0,7,0)+(ROW(X27)-ROW($X$27))*7+(COLUMN(X27)-COLUMN($X$27)+1)),\"\",$X$25-(WEEKDAY($X$25,1)-(start_day-1))-IF((WEEKDAY($X$25,1)-(start_day-1))<=0,7,0)+(ROW(X27)-ROW($X$27))*7+(COLUMN(X27)-COLUMN($X$27)+1))","v":"2024-09-01"},"2024-09-02","2024-09-03","2024-09-04","2024-09-05","2024-09-06","2024-09-07"]
[{"$nulls":14},"2024-07-07","2024-07-08","2024-07-09","2024-07-10","2024-07-11","2024-07-12","2024-07-13",null,null,"2024-09-08","2024-09-09","2024-09-10","2024-09-11","2024-09-12","2024-09-13","2024-09-14"]
[{"$nulls":14},"2024-07-14","2024-07-15","2024-07-16","2024-07-17","2024-07-18","2024-07-19","2024-07-20",null,null,"2024-09-15","2024-09-16","2024-09-17","2024-09-18","2024-09-19","2024-09-20","2024-09-21"]
[{"$nulls":14},"2024-07-21","2024-07-22","2024-07-23","2024-07-24","2024-07-25","2024-07-26","2024-07-27",null,null,"2024-09-22","2024-09-23","2024-09-24","2024-09-25","2024-09-26","2024-09-27","2024-09-28"]
[{"$nulls":14},"2024-07-28","2024-07-29","2024-07-30","2024-07-31","","","",null,null,"2024-09-29","2024-09-30","","","","",""]
[{"$nulls":14},"","","","","","","",null,null,"","","","","","",""]

{"sheet":"September","index":9,"n_rows":32,"n_cols":30,"rows_kept":32,"merged":[[1,2,1,29],[3,2,3,3],[3,4,3,5],[3,6,3,7],[3,8,3,9],[3,10,3,12],[3,14,3,21],[3,22,3,29],[4,2,4,3],[4,4,4,5],[4,6,4,7],[4,8,4,9],[4,10,4,12],[4,14,4,21],[4,22,4,29],[5,2,5,3],[5,4,5,5],[5,6,5,7],[5,8,5,9],[5,10,5,13],[5,14,5,21],[5,22,5,29],[6,2,7,3],[6,4,6,5],[6,6,6,7],[6,8,6,9],[6,10,6,12],[6,14,6,21],[6,22,6,29],[7,4,7,5],[7,6,7,7],[7,8,7,9],[7,10,7,12],[7,14,7,21],[7,22,7,29],[8,2,8,3],[8,4,8,5],[8,6,8,7],[8,8,8,9],[8,10,8,13],[8,14,8,21],[8,22,8,29],[9,2,10,3],[10,4,10,5],[10,6,10,7],[10,8,10,9],[10,10,10,12],[10,14,10,21],[10,22,10,29],[11,2,11,3],[11,4,11,5],[11,6,11,7],[11,8,11,9],[11,10,11,13],[11,14,11,21],[11,22,11,29],[12,2,13,3],[13,4,13,5],[13,6,13,7],[13,8,13,9],[13,10,13,12],[13,14,13,21],[13,22,13,29],[14,2,14,3],[14,4,14,5],[14,6,14,7],[14,8,14,9],[14,10,14,13],[14,14,14,21],[14,22,14,29],[15,2,16,3],[15,8,15,9],[15,14,15,21],[16,4,16,5],[16,6,16,7],[16,8,16,9],[16,14,16,21],[16,22,16,29],[17,2,17,3],[17,4,17,5],[17,6,17,7],[17,8,17,9],[17,14,17,21],[17,22,17,29],[18,2,19,3],[18,8,18,9],[18,14,18,21],[19,4,19,5],[19,6,19,7],[19,8,19,9],[19,14,19,21],[19,22,19,29],[20,2,20,3],[20,4,20,5],[20,6,20,7],[20,8,20,9],[20,14,20,21],[20,22,20,29],[24,2,25,10],[24,14,24,20],[24,23,24,29],[26,2,26,10],[27,2,28,10],[29,2,30,10]]}
[]
[null,null,{"$f":"DATE(About!P8,About!P10+8,1)","v":"2024-09-01"}]
[]
[null,null,{"$f":"C5","v":"2024-09-01"},null,{"$f":"E5","v":"2024-09-02"},null,{"$f":"G5","v":"2024-09-03"},null,{"$f":"I5","v":"2024-09-04"},null,{"$f":"K5","v":"2024-09-05"},{"$nulls":3},{"$f":"O5","v":"2024-09-06"},{"$nulls":7},{"$f":"W5","v":"2024-09-07"}]
[null,null,{"$f":"$C$2-(WEEKDAY($C$2,1)-(start_day-1))-IF((WEEKDAY($C$2,1)-(start_day-1))<=0,7,0)+1","v":"2024-09-01"},null,{"$f":"C5+1","v":"2024-09-02"},null,{"$f":"E5+1","v":"2024-09-03"},null,{"$f":"G5+1","v":"2024-09-04"},null,{"$f":"I5+1","v":"2024-09-05"},{"$nulls":3},{"$f":"K5+1","v":"2024-09-06"},{"$nulls":7},{"$f":"O5+1","v":"2024-09-07"}]
[]
[null,null,{"$f":"W5+1","v":"2024-09-08"}]
[{"$nulls":4},{"$f":"C7+1","v":"2024-09-09"},null,{"$f":"E8+1","v":"2024-09-10"},null,{"$f":"G8+1","v":"2024-09-11"},null,{"$f":"I8+1","v":"2024-09-12"},{"$nulls":3},{"$f":"K8+1","v":"2024-09-13"},{"$nulls":7},{"$f":"O8+1","v":"2024-09-14"}]
[]
[null,null,{"$f":"W8+1","v":"2024-09-15"}]
[{"$nulls":4},{"$f":"C10+1","v":"2024-09-16"},null,{"$f":"E11+1","v":"2024-09-17"},null,{"$f":"G11+1","v":"2024-09-18"},null,{"$f":"I11+1","v":"2024-09-19"},{"$nulls":3},{"$f":"K11+1","v":"2024-09-20"},{"$nulls":7},{"$f":"O11+1","v":"2024-09-21"}]
[]
[null,null,{"$f":"W11+1","v":"2024-09-22"}]
[{"$nulls":4},{"$f":"C13+1","v":"2024-09-23"},null,{"$f":"E14+1","v":"2024-09-24"},null,{"$f":"G14+1","v":"2024-09-25"},null,{"$f":"I14+1","v":"2024-09-26"},{"$nulls":3},{"$f":"K14+1","v":"2024-09-27"},{"$nulls":7},{"$f":"O14+1","v":"2024-09-28"}]
[]
[null,null,{"$f":"W14+1","v":"2024-09-29"}]
[{"$nulls":4},{"$f":"C16+1","v":"2024-09-30"},null,{"$f":"E17+1","v":"2024-10-01"},null,{"$f":"G17+1","v":"2024-10-02"},null,{"$f":"I17+1","v":"2024-10-03"},{"$nulls":3},{"$f":"K17+1","v":"2024-10-04"},{"$nulls":7},{"$f":"O17+1","v":"2024-10-05"}]
[]
[null,null,{"$f":"W17+1","v":"2024-10-06"}]
[{"$nulls":4},{"$f":"C19+1","v":"2024-10-07"},null,{"$f":"E20+1","v":"2024-10-08"},null,{"$f":"G20+1","v":"2024-10-09"},null,{"$f":"I20+1","v":"2024-10-10"},{"$nulls":3},{"$f":"K20+1","v":"2024-10-11"},{"$nulls":7},{"$f":"O20+1","v":"2024-10-12"}]
[]
[]
[]
[]
[null,null,"Notes",{"$nulls":11},{"$f":"DATE(YEAR(C2),MONTH(C2)-1,1)","v":"2024-08-01"},{"$nulls":8},{"$f":"DATE(YEAR(C2),MONTH(C2)+1,1)","v":"2024-10-01"}]
[{"$nulls":14},{"$f":"INDEX({\"S\";\"M\";\"T\";\"W\";\"T\";\"F\";\"S\"},1+MOD(start_day+1-2,7))","v":"S"},{"$f":"INDEX({\"S\";\"M\";\"T\";\"W\";\"T\";\"F\";\"S\"},1+MOD(start_day+2-2,7))","v":"M"},{"$f":"INDEX({\"S\";\"M\";\"T\";\"W\";\"T\";\"F\";\"S\"},1+MOD(start_day+3-2,7))","v":"T"},{"$f":"INDEX({\"S\";\"M\";\"T\";\"W\";\"T\";\"F\";\"S\"},1+MOD(start_day+4-2,7))","v":"W"},{"$f":"INDEX({\"S\";\"M\";\"T\";\"W\";\"T\";\"F\";\"S\"},1+MOD(start_day+5-2,7))","v":"T"},{"$f":"INDEX({\"S\";\"M\";\"T\";\"W\";\"T\";\"F\";\"S\"},1+MOD(start_day+6-2,7))","v":"F"},{"$f":"INDEX({\"S\";\"M\";\"T\";\"W\";\"T\";\"F\";\"S\"},1+MOD(start_day+7-2,7))","v":"S"},null,null,{"$f":"INDEX({\"S\";\"M\";\"T\";\"W\";\"T\";\"F\";\"S\"},1+MOD(start_day+1-2,7))","v":"S"},{"$f":"INDEX({\"S\";\"M\";\"T\";\"W\";\"T\";\"F\";\"S\"},1+MOD(start_day+2-2,7))","v":"M"},{"$f":"INDEX({\"S\";\"M\";\"T\";\"W\";\"T\";\"F\";\"S\"},1+MOD(start_day+3-2,7))","v":"T"},{"$f":"INDEX({\"S\";\"M\";\"T\";\"W\";\"T\";\"F\";\"S\"},1+MOD(start_day+4-2,7))","v":"W"},{"$f":"INDEX({\"S\";\"M\";\"T\";\"W\";\"T\";\"F\";\"S\"},1+MOD(start_day+5-2,7))","v":"T"},{"$f":"INDEX({\"S\";\"M\";\"T\";\"W\";\"T\";\"F\";\"S\"},1+MOD(start_day+6-2,7))","v":"F"},{"$f":"INDEX({\"S\";\"M\";\"T\";\"W\";\"T\";\"F\";\"S\"},1+MOD(start_day+7-2,7))","v":"S"}]
[{"$nulls":14},{"$f":"IF(MONTH($O$25)<>MONTH($O$25-(WEEKDAY($O$25,1)-(start_day-1))-IF((WEEKDAY($O$25,1)-(start_day-1))<=0,7,0)+(ROW(O27)-ROW($O$27))*7+(COLUMN(O27)-COLUMN($O$27)+1)),\"\",$O$25-(WEEKDAY($O$25,1)-(start_day-1))-IF((WEEKDAY($O$25,1)-(start_day-1))<=0,7,0)+(ROW(O27)-ROW($O$27))*7+(COLUMN(O27)-COLUMN($O$27)+1))","v":""},"","","","2024-08-01","2024-08-02","2024-08-03",null,null,{"$f":"IF(MONTH($X$25)<>MONTH($X$25-(WEEKDAY($X$25,1)-(start_day-1))-IF((WEEKDAY($X$25,1)-(start_day-1))<=0,7,0)+(ROW(X27)-ROW($X$27))*7+(COLUMN(X27)-COLUMN($X$27)+1)),\"\",$X$25-(WEEKDAY($X$25,1)-(start_day-1))-IF((WEEKDAY($X$25,1)-(start_day-1))<=0,7,0)+(ROW(X27)-ROW($X$27))*7+(COLUMN(X27)-COLUMN($X$27)+1))","v":""},"","2024-10-01","2024-10-02","2024-10-03","2024-10-04","2024-10-05"]
[{"$nulls":14},"2024-08-04","2024-08-05","2024-08-06","2024-08-07","2024-08-08","2024-08-09","2024-08-10",null,null,"2024-10-06","2024-10-07","2024-10-08","2024-10-09","2024-10-10","2024-10-11","2024-10-12"]
[{"$nulls":14},"2024-08-11","2024-08-12","2024-08-13","2024-08-14","2024-08-15","2024-08-16","2024-08-17",null,null,"2024-10-13","2024-10-14","2024-10-15","2024-10-16","2024-10-17","2024-10-18","2024-10-19"]
[{"$nulls":14},"2024-08-18","2024-08-19","2024-08-20","2024-08-21","2024-08-22","2024-08-23","2024-08-24",null,null,"2024-10-20","2024-10-21","2024-10-22","2024-10-23","2024-10-24","2024-10-25","2024-10-26"]
[{"$nulls":14},"2024-08-25","2024-08-26","2024-08-27","2024-08-28","2024-08-29","2024-08-30","2024-08-31",null,null,"2024-10-27","2024-10-28","2024-10-29","2024-10-30","2024-10-31","",""]
[{"$nulls":14},"","","","","","","",null,null,"","","","","","",""]

{"sheet":"October","index":10,"n_rows":32,"n_cols":30,"rows_kept":32,"merged":[[1,2,1,29],[3,2,3,3],[3,4,3,5],[3,6,3,7],[3,8,3,9],[3,10,3,12],[3,14,3,21],[3,22,3,29],[4,2,4,3],[4,4,4,5],[4,6,4,7],[4,8,4,9],[4,10,4,12],[4,14,4,21],[4,22,4,29],[5,2,5,3],[5,4,5,5],[5,6,5,7],[5,8,5,9],[5,10,5,13],[5,14,5,21],[5,22,5,29],[6,2,7,3],[6,4,6,5],[6,6,6,7],[6,8,6,9],[6,10,6,12],[6,14,6,21],[6,22,6,29],[7,4,7,5],[7,6,7,7],[7,8,7,9],[7,10,7,12],[7,14,7,21],[7,22,7,29],[8,2,8,3],[8,4,8,5],[8,6,8,7],[8,8,8,9],[8,10,8,13],[8,14,8,21],[8,22,8,29],[9,2,10,3],[10,4,10,5],[10,6,10,7],[10,8,10,9],[10,10,10,12],[10,14,10,21],[10,22,10,29],[11,2,11,3],[11,4,11,5],[11,6,11,7],[11,8,11,9],[11,10,11,13],[11,14,11,21],[11,22,11,29],[12,2,13,3],[13,4,13,5],[13,6,13,7],[13,8,13,9],[13,10,13,12],[13,14,13,21],[13,22,13,29],[14,2,14,3],[14,4,14,5],[14,6,14,7],[14,8,14,9],[14,10,14,13],[14,14,14,21],[14,22,14,29],[15,2,16,3],[16,4,16,5],[16,6,16,7],[16,8,16,9],[16,10,16,12],[16,14,16,21],[16,22,16,29],[17,2,17,3],[17,4,17,5],[17,6,17,7],[17,8,17,9],[17,10,17,12],[17,14,17,21],[17,22,17,29],[18,2,19,3],[19,4,19,5],[19,6,19,7],[19,8,19,9],[19,10,19,12],[19,14,19,21],[19,22,19,29],[20,2,20,3],[20,4,20,5],[20,6,20,7],[20,8,20,9],[20,10,20,12],[20,14,20,21],[20,22,20,29],[24,2,25,10],[24,14,24,20],[24,23,24,29],[26,2,26,10],[27,2,28,10],[29,2,30,10]]}
[]
[null,null,{"$f":"DATE(About!P8,About!P10+9,1)","v":"2024-10-01"}]
[]
[null,null,{"$f":"C5","v":"2024-09-29"},null,{"$f":"E5","v":"2024-09-30"},null,{"$f":"G5","v":"2024-10-01"},null,{"$f":"I5","v":"2024-10-02"},null,{"$f":"K5","v":"2024-10-03"},{"$nulls":3},{"$f":"O5","v":"2024-10-04"},{"$nulls":7},{"$f":"W5","v":"2024-10-05"}]
[null,null,{"$f":"$C$2-(WEEKDAY($C$2,1)-(start_day-1))-IF((WEEKDAY($C$2,1)-(start_day-1))<=0,7,0)+1","v":"2024-09-29"},null,{"$f":"C5+1","v":"2024-09-30"},null,{"$f":"E5+1","v":"2024-10-01"},null,{"$f":"G5+1","v":"2024-10-02"},null,{"$f":"I5+1","v":"2024-10-03"},{"$nulls":3},{"$f":"K5+1","v":"2024-10-04"},{"$nulls":7},{"$f":"O5+1","v":"2024-10-05"}]
[]
[null,null,{"$f":"W5+1","v":"2024-10-06"}]
[{"$nulls":4},{"$f":"C7+1","v":"2024-10-07"},null,{"$f":"E8+1","v":"2024-10-08"},null,{"$f":"G8+1","v":"2024-10-09"},null,{"$f":"I8+1","v":"2024-10-10"},{"$nulls":3},{"$f":"K8+1","v":"2024-10-11"},{"$nulls":7},{"$f":"O8+1","v":"2024-10-12"}]
[]
[null,null,{"$f":"W8+1","v":"2024-10-13"}]
[{"$nulls":4},{"$f":"C10+1","v":"2024-10-14"},null,{"$f":"E11+1","v":"2024-10-15"},null,{"$f":"G11+1","v":"2024-10-16"},null,{"$f":"I11+1","v":"2024-10-17"},{"$nulls":3},{"$f":"K11+1","v":"2024-10-18"},{"$nulls":7},{"$f":"O11+1","v":"2024-10-19"}]
[]
[null,null,{"$f":"W11+1","v":"2024-10-20"}]
[{"$nulls":4},{"$f":"C13+1","v":"2024-10-21"},null,{"$f":"E14+1","v":"2024-10-22"},null,{"$f":"G14+1","v":"2024-10-23"},null,{"$f":"I14+1","v":"2024-10-24"},{"$nulls":3},{"$f":"K14+1","v":"2024-10-25"},{"$nulls":7},{"$f":"O14+1","v":"2024-10-26"}]
[]
[null,null,{"$f":"W14+1","v":"2024-10-27"}]
[{"$nulls":4},{"$f":"C16+1","v":"2024-10-28"},null,{"$f":"E17+1","v":"2024-10-29"},null,{"$f":"G17+1","v":"2024-10-30"},null,{"$f":"I17+1","v":"2024-10-31"},{"$nulls":3},{"$f":"K17+1","v":"2024-11-01"},{"$nulls":7},{"$f":"O17+1","v":"2024-11-02"}]
[]
[null,null,{"$f":"W17+1","v":"2024-11-03"}]
[{"$nulls":4},{"$f":"C19+1","v":"2024-11-04"},null,{"$f":"E20+1","v":"2024-11-05"},null,{"$f":"G20+1","v":"2024-11-06"},null,{"$f":"I20+1","v":"2024-11-07"},{"$nulls":3},{"$f":"K20+1","v":"2024-11-08"},{"$nulls":7},{"$f":"O20+1","v":"2024-11-09"}]
[]
[]
[]
[]
[null,null,"Notes",{"$nulls":11},{"$f":"DATE(YEAR(C2),MONTH(C2)-1,1)","v":"2024-09-01"},{"$nulls":8},{"$f":"DATE(YEAR(C2),MONTH(C2)+1,1)","v":"2024-11-01"}]
[{"$nulls":14},{"$f":"INDEX({\"S\";\"M\";\"T\";\"W\";\"T\";\"F\";\"S\"},1+MOD(start_day+1-2,7))","v":"S"},{"$f":"INDEX({\"S\";\"M\";\"T\";\"W\";\"T\";\"F\";\"S\"},1+MOD(start_day+2-2,7))","v":"M"},{"$f":"INDEX({\"S\";\"M\";\"T\";\"W\";\"T\";\"F\";\"S\"},1+MOD(start_day+3-2,7))","v":"T"},{"$f":"INDEX({\"S\";\"M\";\"T\";\"W\";\"T\";\"F\";\"S\"},1+MOD(start_day+4-2,7))","v":"W"},{"$f":"INDEX({\"S\";\"M\";\"T\";\"W\";\"T\";\"F\";\"S\"},1+MOD(start_day+5-2,7))","v":"T"},{"$f":"INDEX({\"S\";\"M\";\"T\";\"W\";\"T\";\"F\";\"S\"},1+MOD(start_day+6-2,7))","v":"F"},{"$f":"INDEX({\"S\";\"M\";\"T\";\"W\";\"T\";\"F\";\"S\"},1+MOD(start_day+7-2,7))","v":"S"},null,null,{"$f":"INDEX({\"S\";\"M\";\"T\";\"W\";\"T\";\"F\";\"S\"},1+MOD(start_day+1-2,7))","v":"S"},{"$f":"INDEX({\"S\";\"M\";\"T\";\"W\";\"T\";\"F\";\"S\"},1+MOD(start_day+2-2,7))","v":"M"},{"$f":"INDEX({\"S\";\"M\";\"T\";\"W\";\"T\";\"F\";\"S\"},1+MOD(start_day+3-2,7))","v":"T"},{"$f":"INDEX({\"S\";\"M\";\"T\";\"W\";\"T\";\"F\";\"S\"},1+MOD(start_day+4-2,7))","v":"W"},{"$f":"INDEX({\"S\";\"M\";\"T\";\"W\";\"T\";\"F\";\"S\"},1+MOD(start_day+5-2,7))","v":"T"},{"$f":"INDEX({\"S\";\"M\";\"T\";\"W\";\"T\";\"F\";\"S\"},1+MOD(start_day+6-2,7))","v":"F"},{"$f":"INDEX({\"S\";\"M\";\"T\";\"W\";\"T\";\"F\";\"S\"},1+MOD(start_day+7-2,7))","v":"S"}]
[{"$nulls":14},{"$f":"IF(MONTH($O$25)<>MONTH($O$25-(WEEKDAY($O$25,1)-(start_day-1))-IF((WEEKDAY($O$25,1)-(start_day-1))<=0,7,0)+(ROW(O27)-ROW($O$27))*7+(COLUMN(O27)-COLUMN($O$27)+1)),\"\",$O$25-(WEEKDAY($O$25,1)-(start_day-1))-IF((WEEKDAY($O$25,1)-(start_day-1))<=0,7,0)+(ROW(O27)-ROW($O$27))*7+(COLUMN(O27)-COLUMN($O$27)+1))","v":"2024-09-01"},"2024-09-02","2024-09-03","2024-09-04","2024-09-05","2024-09-06","2024-09-07",null,null,{"$f":"IF(MONTH($X$25)<>MONTH($X$25-(WEEKDAY($X$25,1)-(start_day-1))-IF((WEEKDAY($X$25,1)-(start_day-1))<=0,7,0)+(ROW(X27)-ROW($X$27))*7+(COLUMN(X27)-COLUMN($X$27)+1)),\"\",$X$25-(WEEKDAY($X$25,1)-(start_day-1))-IF((WEEKDAY($X$25,1)-(start_day-1))<=0,7,0)+(ROW(X27)-ROW($X$27))*7+(COLUMN(X27)-COLUMN($X$27)+1))","v":""},"","","","","2024-11-01","2024-11-02"]
[{"$nulls":14},"2024-09-08","2024-09-09","2024-09-10","2024-09-11","2024-09-12","2024-09-13","2024-09-14",null,null,"2024-11-03","2024-11-04","2024-11-05","2024-11-06","2024-11-07","2024-11-08","2024-11-09"]
[{"$nulls":14},"2024-09-15","2024-09-16","2024-09-17","2024-09-18","2024-09-19","2024-09-20","2024-09-21",null,null,"2024-11-10","2024-11-11","2024-11-12","2024-11-13","2024-11-14","2024-11-15","2024-11-16"]
[{"$nulls":14},"2024-09-22","2024-09-23","2024-09-24","2024-09-25","2024-09-26","2024-09-27","2024-09-28",null,null,"2024-11-17","2024-11-18","2024-11-19","2024-11-20","2024-11-21","2024-11-22","2024-11-23"]
[{"$nulls":14},"2024-09-29","2024-09-30","","","","","",null,null,"2024-11-24","2024-11-25","2024-11-26","2024-11-27","2024-11-28","2024-11-29","2024-11-30"]
[{"$nulls":14},"","","","","","","",null,null,"","","","","","",""]

{"sheet":"November","index":11,"n_rows":32,"n_cols":30,"rows_kept":32,"merged":[[1,2,1,29],[3,2,3,3],[3,4,3,5],[3,6,3,7],[3,8,3,9],[3,10,3,12],[3,14,3,21],[3,22,3,29],[4,2,4,3],[4,4,4,5],[4,6,4,7],[4,8,4,9],[4,10,4,12],[4,14,4,21],[4,22,4,29],[5,2,5,3],[5,4,5,5],[5,6,5,7],[5,8,5,9],[5,10,5,13],[5,14,5,21],[5,22,5,29],[6,2,7,3],[6,4,6,5],[6,6,6,7],[6,8,6,9],[6,10,6,12],[6,14,6,21],[6,22,6,29],[7,4,7,5],[7,6,7,7],[7,8,7,9],[7,10,7,12],[7,14,7,21],[7,22,7,29],[8,2,8,3],[8,4,8,5],[8,6,8,7],[8,8,8,9],[8,10,8,13],[8,14,8,21],[8,22,8,29],[9,2,10,3],[10,4,10,5],[10,6,10,7],[10,8,10,9],[10,10,10,12],[10,14,10,21],[10,22,10,29],[11,2,11,3],[11,4,11,5],[11,6,11,7],[11,8,11,9],[11,10,11,13],[11,14,11,21],[11,22,11,29],[12,2,13,3],[13,4,13,5],[13,6,13,7],[13,8,13,9],[13,10,13,12],[13,14,13,21],[13,22,13,29],[14,2,14,3],[14,4,14,5],[14,6,14,7],[14,8,14,9],[14,10,14,13],[14,14,14,21],[14,22,14,29],[15,2,16,3],[15,8,15,9],[16,4,16,5],[16,6,16,7],[16,8,16,9],[16,10,16,13],[16,14,16,21],[16,22,16,29],[17,2,17,3],[17,4,17,5],[17,6,17,7],[17,8,17,9],[17,10,17,13],[17,14,17,21],[17,22,17,29],[18,2,19,3],[18,8,18,9],[19,4,19,5],[19,6,19,7],[19,8,19,9],[19,10,19,13],[19,14,19,21],[19,22,19,29],[20,2,20,3],[20,4,20,5],[20,6,20,7],[20,8,20,9],[20,10,20,13],[20,14,20,21],[20,22,20,29],[24,2,25,10],[24,14,24,20],[24,23,24,29],[26,2,26,10],[27,2,28,10],[29,2,30,10]]}
[]
[null,null,{"$f":"DATE(About!P8,About!P10+10,1)","v":"2024-11-01"}]
[]
[null,null,{"$f":"C5","v":"2024-10-27"},null,{"$f":"E5","v":"2024-10-28"},null,{"$f":"G5","v":"2024-10-29"},null,{"$f":"I5","v":"2024-10-30"},null,{"$f":"K5","v":"2024-10-31"},{"$nulls":3},{"$f":"O5","v":"2024-11-01"},{"$nulls":7},{"$f":"W5","v":"2024-11-02"}]
[null,null,{"$f":"$C$2-(WEEKDAY($C$2,1)-(start_day-1))-IF((WEEKDAY($C$2,1)-(start_day-1))<=0,7,0)+1","v":"2024-10-27"},null,{"$f":"C5+1","v":"2024-10-28"},null,{"$f":"E5+1","v":"2024-10-29"},null,{"$f":"G5+1","v":"2024-10-30"},null,{"$f":"I5+1","v":"2024-10-31"},{"$nulls":3},{"$f":"K5+1","v":"2024-11-01"},{"$nulls":7},{"$f":"O5+1","v":"2024-11-02"}]
[]
[null,null,{"$f":"W5+1","v":"2024-11-03"}]
[{"$nulls":4},{"$f":"C7+1","v":"2024-11-04"},null,{"$f":"E8+1","v":"2024-11-05"},null,{"$f":"G8+1","v":"2024-11-06"},null,{"$f":"I8+1","v":"2024-11-07"},{"$nulls":3},{"$f":"K8+1","v":"2024-11-08"},{"$nulls":7},{"$f":"O8+1","v":"2024-11-09"}]
[]
[null,null,{"$f":"W8+1","v":"2024-11-10"}]
[{"$nulls":4},{"$f":"C10+1","v":"2024-11-11"},null,{"$f":"E11+1","v":"2024-11-12"},null,{"$f":"G11+1","v":"2024-11-13"},null,{"$f":"I11+1","v":"2024-11-14"},{"$nulls":3},{"$f":"K11+1","v":"2024-11-15"},{"$nulls":7},{"$f":"O11+1","v":"2024-11-16"}]
[]
[null,null,{"$f":"W11+1","v":"2024-11-17"}]
[{"$nulls":4},{"$f":"C13+1","v":"2024-11-18"},null,{"$f":"E14+1","v":"2024-11-19"},null,{"$f":"G14+1","v":"2024-11-20"},null,{"$f":"I14+1","v":"2024-11-21"},{"$nulls":3},{"$f":"K14+1","v":"2024-11-22"},{"$nulls":7},{"$f":"O14+1","v":"2024-11-23"}]
[]
[null,null,{"$f":"W14+1","v":"2024-11-24"}]
[{"$nulls":4},{"$f":"C16+1","v":"2024-11-25"},null,{"$f":"E17+1","v":"2024-11-26"},null,{"$f":"G17+1","v":"2024-11-27"},null,{"$f":"I17+1","v":"2024-11-28"},{"$nulls":3},{"$f":"K17+1","v":"2024-11-29"},{"$nulls":7},{"$f":"O17+1","v":"2024-11-30"}]
[]
[null,null,{"$f":"W17+1","v":"2024-12-01"}]
[{"$nulls":4},{"$f":"C19+1","v":"2024-12-02"},null,{"$f":"E20+1","v":"2024-12-03"},null,{"$f":"G20+1","v":"2024-12-04"},null,{"$f":"I20+1","v":"2024-12-05"},{"$nulls":3},{"$f":"K20+1","v":"2024-12-06"},{"$nulls":7},{"$f":"O20+1","v":"2024-12-07"}]
[]
[]
[]
[]
[null,null,"Notes",{"$nulls":11},{"$f":"DATE(YEAR(C2),MONTH(C2)-1,1)","v":"2024-10-01"},{"$nulls":8},{"$f":"DATE(YEAR(C2),MONTH(C2)+1,1)","v":"2024-12-01"}]
[{"$nulls":14},{"$f":"INDEX({\"S\";\"M\";\"T\";\"W\";\"T\";\"F\";\"S\"},1+MOD(start_day+1-2,7))","v":"S"},{"$f":"INDEX({\"S\";\"M\";\"T\";\"W\";\"T\";\"F\";\"S\"},1+MOD(start_day+2-2,7))","v":"M"},{"$f":"INDEX({\"S\";\"M\";\"T\";\"W\";\"T\";\"F\";\"S\"},1+MOD(start_day+3-2,7))","v":"T"},{"$f":"INDEX({\"S\";\"M\";\"T\";\"W\";\"T\";\"F\";\"S\"},1+MOD(start_day+4-2,7))","v":"W"},{"$f":"INDEX({\"S\";\"M\";\"T\";\"W\";\"T\";\"F\";\"S\"},1+MOD(start_day+5-2,7))","v":"T"},{"$f":"INDEX({\"S\";\"M\";\"T\";\"W\";\"T\";\"F\";\"S\"},1+MOD(start_day+6-2,7))","v":"F"},{"$f":"INDEX({\"S\";\"M\";\"T\";\"W\";\"T\";\"F\";\"S\"},1+MOD(start_day+7-2,7))","v":"S"},null,null,{"$f":"INDEX({\"S\";\"M\";\"T\";\"W\";\"T\";\"F\";\"S\"},1+MOD(start_day+1-2,7))","v":"S"},{"$f":"INDEX({\"S\";\"M\";\"T\";\"W\";\"T\";\"F\";\"S\"},1+MOD(start_day+2-2,7))","v":"M"},{"$f":"INDEX({\"S\";\"M\";\"T\";\"W\";\"T\";\"F\";\"S\"},1+MOD(start_day+3-2,7))","v":"T"},{"$f":"INDEX({\"S\";\"M\";\"T\";\"W\";\"T\";\"F\";\"S\"},1+MOD(start_day+4-2,7))","v":"W"},{"$f":"INDEX({\"S\";\"M\";\"T\";\"W\";\"T\";\"F\";\"S\"},1+MOD(start_day+5-2,7))","v":"T"},{"$f":"INDEX({\"S\";\"M\";\"T\";\"W\";\"T\";\"F\";\"S\"},1+MOD(start_day+6-2,7))","v":"F"},{"$f":"INDEX({\"S\";\"M\";\"T\";\"W\";\"T\";\"F\";\"S\"},1+MOD(start_day+7-2,7))","v":"S"}]
[{"$nulls":14},{"$f":"IF(MONTH($O$25)<>MONTH($O$25-(WEEKDAY($O$25,1)-(start_day-1))-IF((WEEKDAY($O$25,1)-(start_day-1))<=0,7,0)+(ROW(O27)-ROW($O$27))*7+(COLUMN(O27)-COLUMN($O$27)+1)),\"\",$O$25-(WEEKDAY($O$25,1)-(start_day-1))-IF((WEEKDAY($O$25,1)-(start_day-1))<=0,7,0)+(ROW(O27)-ROW($O$27))*7+(COLUMN(O27)-COLUMN($O$27)+1))","v":""},"","2024-10-01","2024-10-02","2024-10-03","2024-10-04","2024-10-05",null,null,{"$f":"IF(MONTH($X$25)<>MONTH($X$25-(WEEKDAY($X$25,1)-(start_day-1))-IF((WEEKDAY($X$25,1)-(start_day-1))<=0,7,0)+(ROW(X27)-ROW($X$27))*7+(COLUMN(X27)-COLUMN($X$27)+1)),\"\",$X$25-(WEEKDAY($X$25,1)-(start_day-1))-IF((WEEKDAY($X$25,1)-(start_day-1))<=0,7,0)+(ROW(X27)-ROW($X$27))*7+(COLUMN(X27)-COLUMN($X$27)+1))","v":"2024-12-01"},"2024-12-02","2024-12-03","2024-12-04","2024-12-05","2024-12-06","2024-12-07"]
[{"$nulls":14},"2024-10-06","2024-10-07","2024-10-08","2024-10-09","2024-10-10","2024-10-11","2024-10-12",null,null,"2024-12-08","2024-12-09","2024-12-10","2024-12-11","2024-12-12","2024-12-13","2024-12-14"]
[{"$nulls":14},"2024-10-13","2024-10-14","2024-10-15","2024-10-16","2024-10-17","2024-10-18","2024-10-19",null,null,"2024-12-15","2024-12-16","2024-12-17","2024-12-18","2024-12-19","2024-12-20","2024-12-21"]
[{"$nulls":14},"2024-10-20","2024-10-21","2024-10-22","2024-10-23","2024-10-24","2024-10-25","2024-10-26",null,null,"2024-12-22","2024-12-23","2024-12-24","2024-12-25","2024-12-26","2024-12-27","2024-12-28"]
[{"$nulls":14},"2024-10-27","2024-10-28","2024-10-29","2024-10-30","2024-10-31","","",null,null,"2024-12-29","2024-12-30","2024-12-31","","","",""]
[{"$nulls":14},"","","","","","","",null,null,"","","","","","",""]

{"sheet":"December","index":12,"n_rows":32,"n_cols":30,"rows_kept":32,"merged":[[1,2,1,29],[3,2,3,3],[3,4,3,5],[3,6,3,7],[3,8,3,9],[3,10,3,12],[3,14,3,21],[3,22,3,29],[4,2,4,3],[4,4,4,5],[4,6,4,7],[4,8,4,9],[4,10,4,12],[4,14,4,21],[4,22,4,29],[5,2,5,3],[5,4,5,5],[5,6,5,7],[5,8,5,9],[5,10,5,13],[5,14,5,21],[5,22,5,29],[6,2,7,3],[6,4,6,5],[6,6,6,7],[6,8,6,9],[6,10,6,12],[6,14,6,21],[6,22,6,29],[7,4,7,5],[7,6,7,7],[7,8,7,9],[7,10,7,12],[7,14,7,21],[7,22,7,29],[8,2,8,3],[8,4,8,5],[8,6,8,7],[8,8,8,9],[8,10,8,13],[8,14,8,21],[8,22,8,29],[9,2,10,3],[10,4,10,5],[10,6,10,7],[10,8,10,9],[10,10,10,12],[10,14,10,21],[10,22,10,29],[11,2,11,3],[11,4,11,5],[11,6,11,7],[11,8,11,9],[11,10,11,13],[11,14,11,21],[11,22,11,29],[12,2,13,3],[13,4,13,5],[13,6,13,7],[13,8,13,9],[13,10,13,12],[13,14,13,21],[13,22,13,29],[14,2,14,3],[14,4,14,5],[14,6,14,7],[14,8,14,9],[14,10,14,13],[14,14,14,21],[14,22,14,29],[15,2,16,3],[16,4,16,5],[16,6,16,7],[16,8,16,9],[16,10,16,13],[16,14,16,21],[16,22,16,29],[17,2,17,3],[17,4,17,5],[17,6,17,7],[17,8,17,9],[17,10,17,13],[17,14,17,21],[17,22,17,29],[18,2,19,3],[19,4,19,5],[19,6,19,7],[19,8,19,9],[19,10,19,13],[19,14,19,21],[19,22,19,29],[20,2,20,3],[20,4,20,5],[20,6,20,7],[20,8,20,9],[20,10,20,13],[20,14,20,21],[20,22,20,29],[24,2,25,10],[24,14,24,20],[24,23,24,29],[26,2,26,10],[27,2,28,10],[29,2,30,10]]}
[]
[null,null,{"$f":"DATE(About!P8,About!P10+11,1)","v":"2024-12-01"}]
[]
[null,null,{"$f":"C5","v":"2024-12-01"},null,{"$f":"E5","v":"2024-12-02"},null,{"$f":"G5","v":"2024-12-03"},null,{"$f":"I5","v":"2024-12-04"},null,{"$f":"K5","v":"2024-12-05"},{"$nulls":3},{"$f":"O5","v":"2024-12-06"},{"$nulls":7},{"$f":"W5","v":"2024-12-07"}]
[null,null,{"$f":"$C$2-(WEEKDAY($C$2,1)-(start_day-1))-IF((WEEKDAY($C$2,1)-(start_day-1))<=0,7,0)+1","v":"2024-12-01"},null,{"$f":"C5+1","v":"2024-12-02"},null,{"$f":"E5+1","v":"2024-12-03"},null,{"$f":"G5+1","v":"2024-12-04"},null,{"$f":"I5+1","v":"2024-12-05"},{"$nulls":3},{"$f":"K5+1","v":"2024-12-06"},{"$nulls":7},{"$f":"O5+1","v":"2024-12-07"}]
[]
[null,null,{"$f":"W5+1","v":"2024-12-08"}]
[{"$nulls":4},{"$f":"C7+1","v":"2024-12-09"},null,{"$f":"E8+1","v":"2024-12-10"},null,{"$f":"G8+1","v":"2024-12-11"},null,{"$f":"I8+1","v":"2024-12-12"},{"$nulls":3},{"$f":"K8+1","v":"2024-12-13"},{"$nulls":7},{"$f":"O8+1","v":"2024-12-14"}]
[]
[null,null,{"$f":"W8+1","v":"2024-12-15"}]
[{"$nulls":4},{"$f":"C10+1","v":"2024-12-16"},null,{"$f":"E11+1","v":"2024-12-17"},null,{"$f":"G11+1","v":"2024-12-18"},null,{"$f":"I11+1","v":"2024-12-19"},{"$nulls":3},{"$f":"K11+1","v":"2024-12-20"},{"$nulls":7},{"$f":"O11+1","v":"2024-12-21"}]
[]
[null,null,{"$f":"W11+1","v":"2024-12-22"}]
[{"$nulls":4},{"$f":"C13+1","v":"2024-12-23"},null,{"$f":"E14+1","v":"2024-12-24"},null,{"$f":"G14+1","v":"2024-12-25"},null,{"$f":"I14+1","v":"2024-12-26"},{"$nulls":3},{"$f":"K14+1","v":"2024-12-27"},{"$nulls":7},{"$f":"O14+1","v":"2024-12-28"}]
[]
[null,null,{"$f":"W14+1","v":"2024-12-29"}]
[{"$nulls":4},{"$f":"C16+1","v":"2024-12-30"},null,{"$f":"E17+1","v":"2024-12-31"},null,{"$f":"G17+1","v":"2025-01-01"},null,{"$f":"I17+1","v":"2025-01-02"},{"$nulls":3},{"$f":"K17+1","v":"2025-01-03"},{"$nulls":7},{"$f":"O17+1","v":"2025-01-04"}]
[]
[null,null,{"$f":"W17+1","v":"2025-01-05"}]
[{"$nulls":4},{"$f":"C19+1","v":"2025-01-06"},null,{"$f":"E20+1","v":"2025-01-07"},null,{"$f":"G20+1","v":"2025-01-08"},null,{"$f":"I20+1","v":"2025-01-09"},{"$nulls":3},{"$f":"K20+1","v":"2025-01-10"},{"$nulls":7},{"$f":"O20+1","v":"2025-01-11"}]
[]
[]
[]
[]
[null,null,"Notes",{"$nulls":11},{"$f":"DATE(YEAR(C2),MONTH(C2)-1,1)","v":"2024-11-01"},{"$nulls":8},{"$f":"DATE(YEAR(C2),MONTH(C2)+1,1)","v":"2025-01-01"}]
[{"$nulls":14},{"$f":"INDEX({\"S\";\"M\";\"T\";\"W\";\"T\";\"F\";\"S\"},1+MOD(start_day+1-2,7))","v":"S"},{"$f":"INDEX({\"S\";\"M\";\"T\";\"W\";\"T\";\"F\";\"S\"},1+MOD(start_day+2-2,7))","v":"M"},{"$f":"INDEX({\"S\";\"M\";\"T\";\"W\";\"T\";\"F\";\"S\"},1+MOD(start_day+3-2,7))","v":"T"},{"$f":"INDEX({\"S\";\"M\";\"T\";\"W\";\"T\";\"F\";\"S\"},1+MOD(start_day+4-2,7))","v":"W"},{"$f":"INDEX({\"S\";\"M\";\"T\";\"W\";\"T\";\"F\";\"S\"},1+MOD(start_day+5-2,7))","v":"T"},{"$f":"INDEX({\"S\";\"M\";\"T\";\"W\";\"T\";\"F\";\"S\"},1+MOD(start_day+6-2,7))","v":"F"},{"$f":"INDEX({\"S\";\"M\";\"T\";\"W\";\"T\";\"F\";\"S\"},1+MOD(start_day+7-2,7))","v":"S"},null,null,{"$f":"INDEX({\"S\";\"M\";\"T\";\"W\";\"T\";\"F\";\"S\"},1+MOD(start_day+1-2,7))","v":"S"},{"$f":"INDEX({\"S\";\"M\";\"T\";\"W\";\"T\";\"F\";\"S\"},1+MOD(start_day+2-2,7))","v":"M"},{"$f":"INDEX({\"S\";\"M\";\"T\";\"W\";\"T\";\"F\";\"S\"},1+MOD(start_day+3-2,7))","v":"T"},{"$f":"INDEX({\"S\";\"M\";\"T\";\"W\";\"T\";\"F\";\"S\"},1+MOD(start_day+4-2,7))","v":"W"},{"$f":"INDEX({\"S\";\"M\";\"T\";\"W\";\"T\";\"F\";\"S\"},1+MOD(start_day+5-2,7))","v":"T"},{"$f":"INDEX({\"S\";\"M\";\"T\";\"W\";\"T\";\"F\";\"S\"},1+MOD(start_day+6-2,7))","v":"F"},{"$f":"INDEX({\"S\";\"M\";\"T\";\"W\";\"T\";\"F\";\"S\"},1+MOD(start_day+7-2,7))","v":"S"}]
[{"$nulls":14},{"$f":"IF(MONTH($O$25)<>MONTH($O$25-(WEEKDAY($O$25,1)-(start_day-1))-IF((WEEKDAY($O$25,1)-(start_day-1))<=0,7,0)+(ROW(O27)-ROW($O$27))*7+(COLUMN(O27)-COLUMN($O$27)+1)),\"\",$O$25-(WEEKDAY($O$25,1)-(start_day-1))-IF((WEEKDAY($O$25,1)-(start_day-1))<=0,7,0)+(ROW(O27)-ROW($O$27))*7+(COLUMN(O27)-COLUMN($O$27)+1))","v":""},"","","","","2024-11-01","2024-11-02",null,null,{"$f":"IF(MONTH($X$25)<>MONTH($X$25-(WEEKDAY($X$25,1)-(start_day-1))-IF((WEEKDAY($X$25,1)-(start_day-1))<=0,7,0)+(ROW(X27)-ROW($X$27))*7+(COLUMN(X27)-COLUMN($X$27)+1)),\"\",$X$25-(WEEKDAY($X$25,1)-(start_day-1))-IF((WEEKDAY($X$25,1)-(start_day-1))<=0,7,0)+(ROW(X27)-ROW($X$27))*7+(COLUMN(X27)-COLUMN($X$27)+1))","v":""},"","","2025-01-01","2025-01-02","2025-01-03","2025-01-04"]
[{"$nulls":14},"2024-11-03","2024-11-04","2024-11-05","2024-11-06","2024-11-07","2024-11-08","2024-11-09",null,null,"2025-01-05","2025-01-06","2025-01-07","2025-01-08","2025-01-09","2025-01-10","2025-01-11"]
[{"$nulls":14},"2024-11-10","2024-11-11","2024-11-12","2024-11-13","2024-11-14","2024-11-15","2024-11-16",null,null,"2025-01-12","2025-01-13","2025-01-14","2025-01-15","2025-01-16","2025-01-17","2025-01-18"]
[{"$nulls":14},"2024-11-17","2024-11-18","2024-11-19","2024-11-20","2024-11-21","2024-11-22","2024-11-23",null,null,"2025-01-19","2025-01-20","2025-01-21","2025-01-22","2025-01-23","2025-01-24","2025-01-25"]
[{"$nulls":14},"2024-11-24","2024-11-25","2024-11-26","2024-11-27","2024-11-28","2024-11-29","2024-11-30",null,null,"2025-01-26","2025-01-27","2025-01-28","2025-01-29","2025-01-30","2025-01-31",""]
[{"$nulls":14},"","","","","","","",null,null,"","","","","","",""]