{"text_format":"3","workbook":"xlsx","n_sheets":4,"sheets":["Overview","Guest List","DataAnalysis","What to Bring"],"not_rendered":{"images":2,"defined_names":14},"read":"whole","date_system":"1900"}

{"sheet":"Overview","index":0,"n_rows":13,"n_cols":7,"rows_kept":13}
[]
[null,"Group Event Planner"]
[null,"Enter event details on the left; summary details appear automatically on the right. Add guests and assign them items to bring. Or share this worksheet so they can RSVP and sign up themselves. "]
[null,"EVENT",null,"SUMMARY",null,null,{"$f":"\"Outstanding RSVPS: \"&OutstandingRSVPs","v":"Outstanding RSVPS: 1"}]
[null,"Neighborhood block party",null,"Guests","Spending","Flag","Bringing"]
[null,"DATE",null,{"$f":"IFERROR(IF(LEN(INDEX(GuestList[#All],ROW($A2),1))=0,\"\",INDEX(GuestList[#All],ROW($A2),1)),\"\")","v":"Person 1"},{"$f":"IFERROR(IF(LEN(EventSummary[Guests])=0,\"\",SUMIFS(WhatToBring[Total Cost],WhatToBring[Assigned To],EventSummary[[#This Row],[Guests]])),\"\")","v":{"v":25,"d":"$25.00"}},{"$f":"IFERROR(IF(LEN(EventSummary[Guests])=0,\"\",IF(EventSummary[[#This Row],[Spending]]>PER_PERSON_BUDGET,1,0)),\"\")","v":1},{"$f":"IFERROR(IF(AND(VLOOKUP(EventSummary[[#This Row],[Guests]],GuestList[],5,FALSE)=\"No\", EventSummary[[#This Row],[Spending]]>0), CONCATENATE(\"Not Attending but signed up to bring \",VLOOKUP(EventSummary[[#This Row],[Guests]],SortedData[[results]:[Text]],3,FALSE)),IF(VLOOKUP(EventSummary[[#This Row],[Guests]],GuestList[],5,FALSE)=\"No\",\"Not Attending\",VLOOKUP(EventSummary[[#This Row],[Guests]],SortedData[[results]:[Text]],3,FALSE))),\"\")","v":"Wine, Juice boxes"}]
[null,{"$f":"TODAY()","v":"2019-07-08"},null,{"$f":"IFERROR(IF(LEN(INDEX(GuestList[#All],ROW($A3),1))=0,\"\",INDEX(GuestList[#All],ROW($A3),1)),\"\")","v":"Person 2"},{"$f":"IFERROR(IF(LEN(EventSummary[Guests])=0,\"\",SUMIFS(WhatToBring[Total Cost],WhatToBring[Assigned To],EventSummary[[#This Row],[Guests]])),\"\")","v":{"v":47,"d":"$47.00"}},{"$f":"IFERROR(IF(LEN(EventSummary[Guests])=0,\"\",IF(EventSummary[[#This Row],[Spending]]>PER_PERSON_BUDGET,1,0)),\"\")","v":1},{"$f":"IFERROR(IF(AND(VLOOKUP(EventSummary[[#This Row],[Guests]],GuestList[],5,FALSE)=\"No\", EventSummary[[#This Row],[Spending]]>0), CONCATENATE(\"Not Attending but signed up to bring \",VLOOKUP(EventSummary[[#This Row],[Guests]],SortedData[[results]:[Text]],3,FALSE)),IF(VLOOKUP(EventSummary[[#This Row],[Guests]],GuestList[],5,FALSE)=\"No\",\"Not Attending\",VLOOKUP(EventSummary[[#This Row],[Guests]],SortedData[[results]:[Text]],3,FALSE))),\"\")","v":"Assorted vegetables, Chicken wings, Cake"}]
[null,"TIME",null,{"$f":"IFERROR(IF(LEN(INDEX(GuestList[#All],ROW($A4),1))=0,\"\",INDEX(GuestList[#All],ROW($A4),1)),\"\")","v":"Person 3"},{"$f":"IFERROR(IF(LEN(EventSummary[Guests])=0,\"\",SUMIFS(WhatToBring[Total Cost],WhatToBring[Assigned To],EventSummary[[#This Row],[Guests]])),\"\")","v":{"v":10,"d":"$10.00"}},{"$f":"IFERROR(IF(LEN(EventSummary[Guests])=0,\"\",IF(EventSummary[[#This Row],[Spending]]>PER_PERSON_BUDGET,1,0)),\"\")","v":0},{"$f":"IFERROR(IF(AND(VLOOKUP(EventSummary[[#This Row],[Guests]],GuestList[],5,FALSE)=\"No\", EventSummary[[#This Row],[Spending]]>0), CONCATENATE(\"Not Attending but signed up to bring \",VLOOKUP(EventSummary[[#This Row],[Guests]],SortedData[[results]:[Text]],3,FALSE)),IF(VLOOKUP(EventSummary[[#This Row],[Guests]],GuestList[],5,FALSE)=\"No\",\"Not Attending\",VLOOKUP(EventSummary[[#This Row],[Guests]],SortedData[[results]:[Text]],3,FALSE))),\"\")","v":"Ice cream, Soda"}]
[null,"2 pm to 4 pm",null,{"$f":"IFERROR(IF(LEN(INDEX(GuestList[#All],ROW($A5),1))=0,\"\",INDEX(GuestList[#All],ROW($A5),1)),\"\")","v":"Person 4"},{"$f":"IFERROR(IF(LEN(EventSummary[Guests])=0,\"\",SUMIFS(WhatToBring[Total Cost],WhatToBring[Assigned To],EventSummary[[#This Row],[Guests]])),\"\")","v":{"v":0,"d":"$0.00"}},{"$f":"IFERROR(IF(LEN(EventSummary[Guests])=0,\"\",IF(EventSummary[[#This Row],[Spending]]>PER_PERSON_BUDGET,1,0)),\"\")","v":0},{"$f":"IFERROR(IF(AND(VLOOKUP(EventSummary[[#This Row],[Guests]],GuestList[],5,FALSE)=\"No\", EventSummary[[#This Row],[Spending]]>0), CONCATENATE(\"Not Attending but signed up to bring \",VLOOKUP(EventSummary[[#This Row],[Guests]],SortedData[[results]:[Text]],3,FALSE)),IF(VLOOKUP(EventSummary[[#This Row],[Guests]],GuestList[],5,FALSE)=\"No\",\"Not Attending\",VLOOKUP(EventSummary[[#This Row],[Guests]],SortedData[[results]:[Text]],3,FALSE))),\"\")","v":""}]
[null,"LOCATION",null,{"$f":"IFERROR(IF(LEN(INDEX(GuestList[#All],ROW($A6),1))=0,\"\",INDEX(GuestList[#All],ROW($A6),1)),\"\")","v":"Person 5"},{"$f":"IFERROR(IF(LEN(EventSummary[Guests])=0,\"\",SUMIFS(WhatToBring[Total Cost],WhatToBring[Assigned To],EventSummary[[#This Row],[Guests]])),\"\")","v":{"v":51,"d":"$51.00"}},{"$f":"IFERROR(IF(LEN(EventSummary[Guests])=0,\"\",IF(EventSummary[[#This Row],[Spending]]>PER_PERSON_BUDGET,1,0)),\"\")","v":1},{"$f":"IFERROR(IF(AND(VLOOKUP(EventSummary[[#This Row],[Guests]],GuestList[],5,FALSE)=\"No\", EventSummary[[#This Row],[Spending]]>0), CONCATENATE(\"Not Attending but signed up to bring \",VLOOKUP(EventSummary[[#This Row],[Guests]],SortedData[[results]:[Text]],3,FALSE)),IF(VLOOKUP(EventSummary[[#This Row],[Guests]],GuestList[],5,FALSE)=\"No\",\"Not Attending\",VLOOKUP(EventSummary[[#This Row],[Guests]],SortedData[[results]:[Text]],3,FALSE))),\"\")","v":"Paper towels, Coffee, Cups, Plates, Spoons, Forks, Stuffed mushrooms"}]
{"$rows_left_out":4}
{"sheet":"Guest List","index":1,"n_rows":9,"n_cols":7,"rows_kept":9}
[null,"Guest List",{"$nulls":4},"Share this list with others so they can RSVP and sign up to bring items in the What to Bring worksheet. Select Share in the upper right or press ALT then YU. Save the file to OneDrive and send the link to your friends."]
[null,"Name","Phone","Email","Shared?","RSVP"]
[null,"Person 1","Phone 1","Email1","Yes","Yes"]
[null,"Person 2","Phone 2","Email2","Yes","Yes"]
[null,"Person 3","Phone 3","Email3","Yes","Yes"]
[null,"Person 4","Phone 4","Email4"]
[null,"Person 5","Phone 5","Email5",null,"Yes"]
[null,"Person 6","Phone 6","Email6",null,"Yes"]
[null,"Person 7","Phone 7","Email7","Yes","No"]

{"sheet":"DataAnalysis","index":2,"n_rows":50,"n_cols":16,"rows_kept":50,"hidden":true}
[]
[{"$nulls":3},"data analysis",{"$nulls":5},"sorted data"]
[null,"start row",3,"TIE BREAK","RANK","Assigned To","Item","NUM",null,"Rank Sorted","assigned to","item","Hdr","results","# of occurences","Text"]
[null,"last entry",{"$f":"IFERROR(COUNTA(WhatToBring[[#All],[Item]]),start_row)","v":16},{"$f":"IFERROR(RANK(E4,DataAnalysis[RANK])+SUMPRODUCT(--(E4=DataAnalysis[RANK]),--(H4<DataAnalysis[NUM])),\"\")","v":8},{"$f":"IFERROR(IF(COUNTIF(DataAnalysis[Assigned To],\"<=\"&DataAnalysis[Assigned To])=0,\"\",COUNTIF(DataAnalysis[Assigned To],\"<=\"&DataAnalysis[Assigned To])),\"\")","v":40},{"$f":"IFERROR(IF(AND(last_entry-start_row=0,ISBLANK(INDEX(WhatToBring[Assigned To],1,1))),\"\",IF(last_entry-start_row=0,INDEX(WhatToBring[Assigned To],1,1),INDEX(WhatToBring[Assigned To],last_entry-start_row-H4+1,1))),\"\")","v":"Person 3"},{"$f":"IFERROR(IF(AND(last_entry-start_row=0,ISBLANK(INDEX(WhatToBring[Item],1,1))),\"\",IF(last_entry-start_row=0,INDEX(WhatToBring[Item],1,1),INDEX(WhatToBring[Item],last_entry-start_row-DataAnalysis[[#This Row],[NUM]]+1,1))),\"\")","v":"Soda"},{"$f":"IFERROR(IF(AND(last_entry-start_row=0,ISBLANK(INDEX(WhatToBring[],1,1))),\"\",IF(last_entry-start_row=0,0,last_entry-start_row)),\"\")","v":13},null,{"$f":"IFERROR(DataAnalysis[[#This Row],[NUM]]+1,\"\")","v":14},{"$f":"IFERROR(VLOOKUP(SortedData[Rank Sorted],DataAnalysis[],3,0),\"\")","v":"Person 1"},{"$f":"IFERROR(VLOOKUP(SortedData[Rank Sorted],DataAnalysis[],4,0),\"\")","v":"Wine"},{"$f":"IF(K4=K3,M3,\"\")&REPT(SortedData[[#This Row],[item]]&\", \",SortedData[[#This Row],[item]]<>\"\")","v":"Wine, "},{"$f":"IF(COUNTIF(K$4:K4,K4)=1,K4,\"\")","v":"Person 1"},{"$f":"IFERROR(IF(LEN(SortedData[assigned to])=0,\"\",COUNTIF(SortedData[assigned to],K4)),\"\")","v":2},{"$f":"IFERROR(IF(LEN($N4)>0,LEFT(INDIRECT(\"DataAnalysis!M\"&ROW(SortedData[[#This Row],[results]])+SortedData[[#This Row],['# of occurences]]-1),LEN(INDIRECT(\"DataAnalysis!M\"&ROW(SortedData[[#This Row],[results]])+SortedData[[#This Row],['# of occurences]]-1))-2),\"\"),\"\")","v":"Wine, Juice boxes"}]
[{"$nulls":3},{"$f":"IFERROR(RANK(E5,DataAnalysis[RANK])+SUMPRODUCT(--(E5=DataAnalysis[RANK]),--(H5<DataAnalysis[NUM])),\"\")","v":13},{"$f":"IFERROR(IF(COUNTIF(DataAnalysis[Assigned To],\"<=\"&DataAnalysis[Assigned To])=0,\"\",COUNTIF(DataAnalysis[Assigned To],\"<=\"&DataAnalysis[Assigned To])),\"\")","v":35},{"$f":"IFERROR(IF(ISBLANK(INDEX(WhatToBring[],last_entry-start_row-DataAnalysis[[#This Row],[NUM]]+1,3)),\"\",INDEX(WhatToBring[],last_entry-start_row-DataAnalysis[[#This Row],[NUM]]+1,3)),\"\")","v":"Person 1"},{"$f":"IFERROR(IF(ISBLANK(INDEX(WhatToBring[#All],last_entry-start_row-DataAnalysis[NUM]+2,1)),\"\",INDEX(WhatToBring[#All],last_entry-start_row-DataAnalysis[NUM]+2,1)),\"\")","v":"Juice boxes"},{"$f":"IFERROR(IF(ISBLANK(INDEX(WhatToBring[#All],ROW(A1)+1,1)),\"\",IF($H4-1<=-1,\"\",$H4-1)),\"\")","v":12},null,{"$f":"IFERROR(DataAnalysis[[#This Row],[NUM]]+1,\"\")","v":13},{"$f":"IFERROR(VLOOKUP(SortedData[Rank Sorted],DataAnalysis[],3,0),\"\")","v":"Person 1"},{"$f":"IFERROR(VLOOKUP(SortedData[Rank Sorted],DataAnalysis[],4,0),\"\")","v":"Juice boxes"},{"$f":"IF(K5=K4,M4,\"\")&REPT(SortedData[[#This Row],[item]]&\", \",SortedData[[#This Row],[item]]<>\"\")","v":"Wine, Juice boxes, "},{"$f":"IF(COUNTIF(K$4:K5,K5)=1,K5,\"\")","v":""},{"$f":"IFERROR(IF(LEN(SortedData[assigned to])=0,\"\",COUNTIF(SortedData[assigned to],K5)),\"\")","v":2},{"$f":"IFERROR(IF(LEN($N5)>0,LEFT(INDIRECT(\"DataAnalysis!M\"&ROW(SortedData[[#This Row],[results]])+SortedData[[#This Row],['# of occurences]]-1),LEN(INDIRECT(\"DataAnalysis!M\"&ROW(SortedData[[#This Row],[results]])+SortedData[[#This Row],['# of occurences]]-1))-2),\"\"),\"\")","v":""}]
[{"$nulls":3},{"$f":"IFERROR(RANK(E6,DataAnalysis[RANK])+SUMPRODUCT(--(E6=DataAnalysis[RANK]),--(H6<DataAnalysis[NUM])),\"\")","v":14},{"$f":"IFERROR(IF(COUNTIF(DataAnalysis[Assigned To],\"<=\"&DataAnalysis[Assigned To])=0,\"\",COUNTIF(DataAnalysis[Assigned To],\"<=\"&DataAnalysis[Assigned To])),\"\")","v":35},{"$f":"IFERROR(IF(ISBLANK(INDEX(WhatToBring[],last_entry-start_row-DataAnalysis[[#This Row],[NUM]]+1,3)),\"\",INDEX(WhatToBring[],last_entry-start_row-DataAnalysis[[#This Row],[NUM]]+1,3)),\"\")","v":"Person 1"},{"$f":"IFERROR(IF(ISBLANK(INDEX(WhatToBring[#All],last_entry-start_row-DataAnalysis[NUM]+2,1)),\"\",INDEX(WhatToBring[#All],last_entry-start_row-DataAnalysis[NUM]+2,1)),\"\")","v":"Wine"},{"$f":"IFERROR(IF(ISBLANK(INDEX(WhatToBring[#All],ROW(A2)+1,1)),\"\",IF($H5-1<=-1,\"\",$H5-1)),\"\")","v":11},null,{"$f":"IFERROR(DataAnalysis[[#This Row],[NUM]]+1,\"\")","v":12},{"$f":"IFERROR(VLOOKUP(SortedData[Rank Sorted],DataAnalysis[],3,0),\"\")","v":"Person 2"},{"$f":"IFERROR(VLOOKUP(SortedData[Rank Sorted],DataAnalysis[],4,0),\"\")","v":"Assorted vegetables"},{"$f":"IF(K6=K5,M5,\"\")&REPT(SortedData[[#This Row],[item]]&\", \",SortedData[[#This Row],[item]]<>\"\")","v":"Assorted vegetables, "},{"$f":"IF(COUNTIF(K$4:K6,K6)=1,K6,\"\")","v":"Person 2"},{"$f":"IFERROR(IF(LEN(SortedData[assigned to])=0,\"\",COUNTIF(SortedData[assigned to],K6)),\"\")","v":3},{"$f":"IFERROR(IF(LEN($N6)>0,LEFT(INDIRECT(\"DataAnalysis!M\"&ROW(SortedData[[#This Row],[results]])+SortedData[[#This Row],['# of occurences]]-1),LEN(INDIRECT(\"DataAnalysis!M\"&ROW(SortedData[[#This Row],[results]])+SortedData[[#This Row],['# of occurences]]-1))-2),\"\"),\"\")","v":"Assorted vegetables, Chicken wings, Cake"}]
[{"$nulls":3},{"$f":"IFERROR(RANK(E7,DataAnalysis[RANK])+SUMPRODUCT(--(E7=DataAnalysis[RANK]),--(H7<DataAnalysis[NUM])),\"\")","v":10},{"$f":"IFERROR(IF(COUNTIF(DataAnalysis[Assigned To],\"<=\"&DataAnalysis[Assigned To])=0,\"\",COUNTIF(DataAnalysis[Assigned To],\"<=\"&DataAnalysis[Assigned To])),\"\")","v":38},{"$f":"IFERROR(IF(ISBLANK(INDEX(WhatToBring[],last_entry-start_row-DataAnalysis[[#This Row],[NUM]]+1,3)),\"\",INDEX(WhatToBring[],last_entry-start_row-DataAnalysis[[#This Row],[NUM]]+1,3)),\"\")","v":"Person 2"},{"$f":"IFERROR(IF(ISBLANK(INDEX(WhatToBring[#All],last_entry-start_row-DataAnalysis[NUM]+2,1)),\"\",INDEX(WhatToBring[#All],last_entry-start_row-DataAnalysis[NUM]+2,1)),\"\")","v":"Cake"},{"$f":"IFERROR(IF(ISBLANK(INDEX(WhatToBring[#All],ROW(A3)+1,1)),\"\",IF($H6-1<=-1,\"\",$H6-1)),\"\")","v":10},null,{"$f":"IFERROR(DataAnalysis[[#This Row],[NUM]]+1,\"\")","v":11},{"$f":"IFERROR(VLOOKUP(SortedData[Rank Sorted],DataAnalysis[],3,0),\"\")","v":"Person 2"},{"$f":"IFERROR(VLOOKUP(SortedData[Rank Sorted],DataAnalysis[],4,0),\"\")","v":"Chicken wings"},{"$f":"IF(K7=K6,M6,\"\")&REPT(SortedData[[#This Row],[item]]&\", \",SortedData[[#This Row],[item]]<>\"\")","v":"Assorted vegetables, Chicken wings, "},{"$f":"IF(COUNTIF(K$4:K7,K7)=1,K7,\"\")","v":""},{"$f":"IFERROR(IF(LEN(SortedData[assigned to])=0,\"\",COUNTIF(SortedData[assigned to],K7)),\"\")","v":3},{"$f":"IFERROR(IF(LEN($N7)>0,LEFT(INDIRECT(\"DataAnalysis!M\"&ROW(SortedData[[#This Row],[results]])+SortedData[[#This Row],['# of occurences]]-1),LEN(INDIRECT(\"DataAnalysis!M\"&ROW(SortedData[[#This Row],[results]])+SortedData[[#This Row],['# of occurences]]-1))-2),\"\"),\"\")","v":""}]
[{"$nulls":3},{"$f":"IFERROR(RANK(E8,DataAnalysis[RANK])+SUMPRODUCT(--(E8=DataAnalysis[RANK]),--(H8<DataAnalysis[NUM])),\"\")","v":9},{"$f":"IFERROR(IF(COUNTIF(DataAnalysis[Assigned To],\"<=\"&DataAnalysis[Assigned To])=0,\"\",COUNTIF(DataAnalysis[Assigned To],\"<=\"&DataAnalysis[Assigned To])),\"\")","v":40},{"$f":"IFERROR(IF(ISBLANK(INDEX(WhatToBring[],last_entry-start_row-DataAnalysis[[#This Row],[NUM]]+1,3)),\"\",INDEX(WhatToBring[],last_entry-start_row-DataAnalysis[[#This Row],[NUM]]+1,3)),\"\")","v":"Person 3"},{"$f":"IFERROR(IF(ISBLANK(INDEX(WhatToBring[#All],last_entry-start_row-DataAnalysis[NUM]+2,1)),\"\",INDEX(WhatToBring[#All],last_entry-start_row-DataAnalysis[NUM]+2,1)),\"\")","v":"Ice cream"},{"$f":"IFERROR(IF(ISBLANK(INDEX(WhatToBring[#All],ROW(A4)+1,1)),\"\",IF($H7-1<=-1,\"\",$H7-1)),\"\")","v":9},null,{"$f":"IFERROR(DataAnalysis[[#This Row],[NUM]]+1,\"\")","v":10},{"$f":"IFERROR(VLOOKUP(SortedData[Rank Sorted],DataAnalysis[],3,0),\"\")","v":"Person 2"},{"$f":"IFERROR(VLOOKUP(SortedData[Rank Sorted],DataAnalysis[],4,0),\"\")","v":"Cake"},{"$f":"IF(K8=K7,M7,\"\")&REPT(SortedData[[#This Row],[item]]&\", \",SortedData[[#This Row],[item]]<>\"\")","v":"Assorted vegetables, Chicken wings, Cake, "},{"$f":"IF(COUNTIF(K$4:K8,K8)=1,K8,\"\")","v":""},{"$f":"IFERROR(IF(LEN(SortedData[assigned to])=0,\"\",COUNTIF(SortedData[assigned to],K8)),\"\")","v":3},{"$f":"IFERROR(IF(LEN($N8)>0,LEFT(INDIRECT(\"DataAnalysis!M\"&ROW(SortedData[[#This Row],[results]])+SortedData[[#This Row],['# of occurences]]-1),LEN(INDIRECT(\"DataAnalysis!M\"&ROW(SortedData[[#This Row],[results]])+SortedData[[#This Row],['# of occurences]]-1))-2),\"\"),\"\")","v":""}]
[{"$nulls":3},{"$f":"IFERROR(RANK(E9,DataAnalysis[RANK])+SUMPRODUCT(--(E9=DataAnalysis[RANK]),--(H9<DataAnalysis[NUM])),\"\")","v":1},{"$f":"IFERROR(IF(COUNTIF(DataAnalysis[Assigned To],\"<=\"&DataAnalysis[Assigned To])=0,\"\",COUNTIF(DataAnalysis[Assigned To],\"<=\"&DataAnalysis[Assigned To])),\"\")","v":47},{"$f":"IFERROR(IF(ISBLANK(INDEX(WhatToBring[],last_entry-start_row-DataAnalysis[[#This Row],[NUM]]+1,3)),\"\",INDEX(WhatToBring[],last_entry-start_row-DataAnalysis[[#This Row],[NUM]]+1,3)),\"\")","v":"Person 7"},{"$f":"IFERROR(IF(ISBLANK(INDEX(WhatToBring[#All],last_entry-start_row-DataAnalysis[NUM]+2,1)),\"\",INDEX(WhatToBring[#All],last_entry-start_row-DataAnalysis[NUM]+2,1)),\"\")","v":"Pudding cups"},{"$f":"IFERROR(IF(ISBLANK(INDEX(WhatToBring[#All],ROW(A5)+1,1)),\"\",IF($H8-1<=-1,\"\",$H8-1)),\"\")","v":8},null,{"$f":"IFERROR(DataAnalysis[[#This Row],[NUM]]+1,\"\")","v":9},{"$f":"IFERROR(VLOOKUP(SortedData[Rank Sorted],DataAnalysis[],3,0),\"\")","v":"Person 3"},{"$f":"IFERROR(VLOOKUP(SortedData[Rank Sorted],DataAnalysis[],4,0),\"\")","v":"Ice cream"},{"$f":"IF(K9=K8,M8,\"\")&REPT(SortedData[[#This Row],[item]]&\", \",SortedData[[#This Row],[item]]<>\"\")","v":"Ice cream, "},{"$f":"IF(COUNTIF(K$4:K9,K9)=1,K9,\"\")","v":"Person 3"},{"$f":"IFERROR(IF(LEN(SortedData[assigned to])=0,\"\",COUNTIF(SortedData[assigned to],K9)),\"\")","v":2},{"$f":"IFERROR(IF(LEN($N9)>0,LEFT(INDIRECT(\"DataAnalysis!M\"&ROW(SortedData[[#This Row],[results]])+SortedData[[#This Row],['# of occurences]]-1),LEN(INDIRECT(\"DataAnalysis!M\"&ROW(SortedData[[#This Row],[results]])+SortedData[[#This Row],['# of occurences]]-1))-2),\"\"),\"\")","v":"Ice cream, Soda"}]
[{"$nulls":3},{"$f":"IFERROR(RANK(E10,DataAnalysis[RANK])+SUMPRODUCT(--(E10=DataAnalysis[RANK]),--(H10<DataAnalysis[NUM])),\"\")","v":3},{"$f":"IFERROR(IF(COUNTIF(DataAnalysis[Assigned To],\"<=\"&DataAnalysis[Assigned To])=0,\"\",COUNTIF(DataAnalysis[Assigned To],\"<=\"&DataAnalysis[Assigned To])),\"\")","v":45},{"$f":"IFERROR(IF(ISBLANK(INDEX(WhatToBring[],last_entry-start_row-DataAnalysis[[#This Row],[NUM]]+1,3)),\"\",INDEX(WhatToBring[],last_entry-start_row-DataAnalysis[[#This Row],[NUM]]+1,3)),\"\")","v":"Person 5"},{"$f":"IFERROR(IF(ISBLANK(INDEX(WhatToBring[#All],last_entry-start_row-DataAnalysis[NUM]+2,1)),\"\",INDEX(WhatToBring[#All],last_entry-start_row-DataAnalysis[NUM]+2,1)),\"\")","v":"Stuffed mushrooms"},{"$f":"IFERROR(IF(ISBLANK(INDEX(WhatToBring[#All],ROW(A6)+1,1)),\"\",IF($H9-1<=-1,\"\",$H9-1)),\"\")","v":7},null,{"$f":"IFERROR(DataAnalysis[[#This Row],[NUM]]+1,\"\")","v":8},{"$f":"IFERROR(VLOOKUP(SortedData[Rank Sorted],DataAnalysis[],3,0),\"\")","v":"Person 3"},{"$f":"IFERROR(VLOOKUP(SortedData[Rank Sorted],DataAnalysis[],4,0),\"\")","v":"Soda"},{"$f":"IF(K10=K9,M9,\"\")&REPT(SortedData[[#This Row],[item]]&\", \",SortedData[[#This Row],[item]]<>\"\")","v":"Ice cream, Soda, "},{"$f":"IF(COUNTIF(K$4:K10,K10)=1,K10,\"\")","v":""},{"$f":"IFERROR(IF(LEN(SortedData[assigned to])=0,\"\",COUNTIF(SortedData[assigned to],K10)),\"\")","v":2},{"$f":"IFERROR(IF(LEN($N10)>0,LEFT(INDIRECT(\"DataAnalysis!M\"&ROW(SortedData[[#This Row],[results]])+SortedData[[#This Row],['# of occurences]]-1),LEN(INDIRECT(\"DataAnalysis!M\"&ROW(SortedData[[#This Row],[results]])+SortedData[[#This Row],['# of occurences]]-1))-2),\"\"),\"\")","v":""}]
{"$rows_left_out":41}
{"sheet":"What to Bring","index":3,"n_rows":17,"n_cols":7,"rows_kept":17}
[null,"What to Bring"]
[null,"Item","Total Cost","Assigned To","Notes","Rank","Missing"]
[null,"Soda",{"v":0,"d":"$0.00"},"Person 3","2 liter bottles",{"$f":"COUNTIF(WhatToBring[Assigned To],\"<=\"&WhatToBring[Assigned To])","v":7},{"$f":"IFERROR(IF(LEN(WhatToBring[Assigned To])>0,IF(VLOOKUP(WhatToBring[[#This Row],[Assigned To]],GuestList[],5,FALSE)=\"No\",1,\"\"),\"\"),\"\")","v":""}]
[null,"Juice boxes",{"v":5,"d":"$5.00"},"Person 1","Apple and white grape",{"$f":"COUNTIF(WhatToBring[Assigned To],\"<=\"&WhatToBring[Assigned To])","v":2},{"$f":"IFERROR(IF(LEN(WhatToBring[Assigned To])>0,IF(VLOOKUP(WhatToBring[[#This Row],[Assigned To]],GuestList[],5,FALSE)=\"No\",1,\"\"),\"\"),\"\")","v":""}]
[null,"Wine",{"v":20,"d":"$20.00"},"Person 1",null,{"$f":"COUNTIF(WhatToBring[Assigned To],\"<=\"&WhatToBring[Assigned To])","v":2},{"$f":"IFERROR(IF(LEN(WhatToBring[Assigned To])>0,IF(VLOOKUP(WhatToBring[[#This Row],[Assigned To]],GuestList[],5,FALSE)=\"No\",1,\"\"),\"\"),\"\")","v":""}]
[null,"Cake",{"v":20,"d":"$20.00"},"Person 2","Order from local bakery",{"$f":"COUNTIF(WhatToBring[Assigned To],\"<=\"&WhatToBring[Assigned To])","v":5},{"$f":"IFERROR(IF(LEN(WhatToBring[Assigned To])>0,IF(VLOOKUP(WhatToBring[[#This Row],[Assigned To]],GuestList[],5,FALSE)=\"No\",1,\"\"),\"\"),\"\")","v":""}]
[null,"Ice cream",{"v":10,"d":"$10.00"},"Person 3",null,{"$f":"COUNTIF(WhatToBring[Assigned To],\"<=\"&WhatToBring[Assigned To])","v":7},{"$f":"IFERROR(IF(LEN(WhatToBring[Assigned To])>0,IF(VLOOKUP(WhatToBring[[#This Row],[Assigned To]],GuestList[],5,FALSE)=\"No\",1,\"\"),\"\"),\"\")","v":""}]
[null,"Pudding cups",{"v":15,"d":"$15.00"},"Person 7","Purchase packaged cups: vanilla and chocolate",{"$f":"COUNTIF(WhatToBring[Assigned To],\"<=\"&WhatToBring[Assigned To])","v":14},{"$f":"IFERROR(IF(LEN(WhatToBring[Assigned To])>0,IF(VLOOKUP(WhatToBring[[#This Row],[Assigned To]],GuestList[],5,FALSE)=\"No\",1,\"\"),\"\"),\"\")","v":1}]
[null,"Stuffed mushrooms",{"v":32,"d":"$32.00"},"Person 5","Button mushrooms stuffed with cream cheese and sausage",{"$f":"COUNTIF(WhatToBring[Assigned To],\"<=\"&WhatToBring[Assigned To])","v":12},{"$f":"IFERROR(IF(LEN(WhatToBring[Assigned To])>0,IF(VLOOKUP(WhatToBring[[#This Row],[Assigned To]],GuestList[],5,FALSE)=\"No\",1,\"\"),\"\"),\"\")","v":""}]
[null,"Bruschetta",{"v":22,"d":"$22.00"},"Person 6","Tomato and basil ",{"$f":"COUNTIF(WhatToBring[Assigned To],\"<=\"&WhatToBring[Assigned To])","v":13},{"$f":"IFERROR(IF(LEN(WhatToBring[Assigned To])>0,IF(VLOOKUP(WhatToBring[[#This Row],[Assigned To]],GuestList[],5,FALSE)=\"No\",1,\"\"),\"\"),\"\")","v":""}]
{"$rows_left_out":7}