{"text_format":"3","workbook":"xlsx","n_sheets":7,"sheets":["Beginner","Intermediate","Expert","Beginner Key","Intermediate Key","Expert Key","Instructions"],"not_rendered":{"defined_names":1},"read":"whole","date_system":"1900"}

{"sheet":"Beginner","index":0,"n_rows":15,"n_cols":31,"rows_kept":15,"merged":[[4,1,4,9],[4,11,4,19],[4,21,4,29]]}
[{"$nulls":30}," "]
[]
[]
[]
[null,"Beginner Puzzle 1",{"$nulls":9},"Beginner Puzzle 2",{"$nulls":9},"Beginner Puzzle 3"]
[]
[null,9,2,6,null,null,7,null,8,null,null,3,null,4,1,{"$nulls":7},6,3,null,null,8]
[null,5,null,null,6,8,9,2,3,{"$nulls":5},5,null,2,6,null,7,{"$nulls":4},5,null,null,8,7]
[null,1,{"$nulls":4},5,9,6,{"$nulls":5},9,null,null,4,{"$nulls":6},1,6,4]
[null,7,5,null,8,null,2,6,{"$nulls":3},9,null,null,4,{"$nulls":3},1,null,null,1,null,2,null,8,{"$nulls":3},5]
[{"$nulls":3},9,7,null,null,8,null,2,null,6,5,null,null,1,null,null,7,4,{"$nulls":3},9,null,2,null,1]
[null,3,8,null,1,{"$nulls":7},3,{"$nulls":3},8,null,null,9,null,3,{"$nulls":3},5,null,6,null,9]
[{"$nulls":3},4,null,3,null,5,7,6,{"$nulls":3},9,null,null,5,{"$nulls":7},6,5,7]
[null,null,7,3,null,6,{"$nulls":3},4,null,5,null,3,2,null,1,{"$nulls":5},2,8,null,null,5]
[null,null,1,5,null,7,{"$nulls":10},4,1,null,3,{"$nulls":4},8,null,null,7,5]

{"sheet":"Intermediate","index":1,"n_rows":15,"n_cols":31,"rows_kept":15,"merged":[[4,1,4,9],[4,11,4,19],[4,21,4,29]]}
[{"$nulls":30}," "]
[]
[]
[]
[null,"Intermediate Puzzle 1",{"$nulls":9},"Intermediate Puzzle 2",{"$nulls":9},"Intermediate Puzzle 3"]
[]
[{"$nulls":3},8,null,null,1,{"$nulls":4},8,null,null,5,null,1,null,null,9,{"$nulls":3},6,{"$nulls":4},5]
[null,null,5,{"$nulls":5},1,{"$nulls":5},6,null,9,7,{"$nulls":3},7,null,null,6,4]
[null,9,null,null,5,null,2,null,7,{"$nulls":4},4,null,7,{"$nulls":3},5,null,null,1,8,null,5,null,null,7]
[{"$nulls":5},3,{"$nulls":5},4,8,{"$nulls":6},6,{"$nulls":5},6,{"$nulls":3},7]
[{"$nulls":4},1,null,5,9,{"$nulls":5},2,{"$nulls":3},4,{"$nulls":3},1,null,null,4,null,8,null,null,2]
[{"$nulls":7},2,3,6,null,9,{"$nulls":6},1,8,null,3,{"$nulls":3},1]
[{"$nulls":4},8,null,null,7,{"$nulls":3},6,{"$nulls":3},8,null,3,{"$nulls":4},3,null,null,2,null,8,4]
[null,2,7,5,null,null,6,null,null,1,{"$nulls":3},3,1,null,6,{"$nulls":8},3,1,null,null,9]
[null,null,3,{"$nulls":5},5,null,null,7,null,null,3,null,5,null,null,2,null,null,2,{"$nulls":4},5]

{"sheet":"Expert","index":2,"n_rows":15,"n_cols":31,"rows_kept":15,"merged":[[4,1,4,9],[4,11,4,19],[4,21,4,29]]}
[{"$nulls":30}," "]
[]
[]
[]
[null,"Expert Puzzle 1",{"$nulls":9},"Expert Puzzle 2",{"$nulls":9},"Expert Puzzle 3"]
[]
[null,null,9,5,null,null,4,2,null,3,{"$nulls":3},7,4,{"$nulls":3},9,null,null,1,null,2,null,4]
[null,null,8,{"$nulls":3},6,9,{"$nulls":4},1,5,{"$nulls":3},6,{"$nulls":5},6,2,3,8,5]
[{"$nulls":18},4,5,{"$nulls":6},6,null,9]
[null,null,4,6,8,null,5,{"$nulls":4},1,{"$nulls":5},2,7,null,null,9,null,7,{"$nulls":4},5,4]
[null,7,{"$nulls":9},9,null,null,3,null,1,null,null,4,{"$nulls":4},9,8,4]
[{"$nulls":3},2,null,7,{"$nulls":6},6,4,{"$nulls":5},1,null,3,8,{"$nulls":4},1,null,9]
[null,2,{"$nulls":4},1,8,{"$nulls":3},3,2,{"$nulls":9},6,null,8]
[null,3,{"$nulls":3},8,{"$nulls":7},6,{"$nulls":3},9,8,{"$nulls":4},1,3,2,5,9]
[{"$nulls":5},3,null,4,null,1,null,null,8,{"$nulls":3},2,7,{"$nulls":7},6,null,7,null,3]

{"sheet":"Beginner Key","index":3,"n_rows":15,"n_cols":31,"rows_kept":15,"merged":[[4,8,4,9],[4,18,4,19],[4,28,4,29]]}
[{"$nulls":30}," "]
[]
[]
[]
[{"$nulls":7},"Show Answers for Puzzle 1","No",{"$nulls":8},"Show Answers for Puzzle 2","No",{"$nulls":8},"Show Answers for Puzzle 3","No"]
[]
[null,9,2,6,3,1,7,4,8,5,null,3,2,4,1,6,7,5,9,8,null,5,6,3,2,7,8,4,9,1]
[null,5,4,7,6,8,9,2,3,1,null,1,9,8,5,4,2,6,3,7,null,2,4,1,5,3,9,8,7,6]
[null,1,3,8,4,2,5,9,6,7,null,7,6,5,9,8,3,4,2,1,null,8,9,7,1,6,4,5,3,2]
[null,7,5,1,8,9,2,6,4,3,null,9,8,7,4,2,6,3,1,5,null,1,7,2,9,8,6,3,4,5]
[null,4,6,9,7,5,3,8,1,2,null,6,5,2,3,1,9,8,7,4,null,6,5,9,4,2,3,1,8,7]
[null,3,8,2,1,4,6,7,5,9,null,4,3,1,7,5,8,2,6,9,null,3,8,4,7,5,1,6,2,9]
[null,8,9,4,2,3,1,5,7,6,null,8,1,9,6,3,5,7,4,2,null,9,3,5,6,4,7,2,1,8]
[null,2,7,3,5,6,8,1,9,4,null,5,4,3,2,7,1,9,8,6,null,7,2,8,3,1,5,9,6,4]
[null,6,1,5,9,7,4,3,2,8,null,2,7,6,8,9,4,1,5,3,null,4,1,6,8,9,2,7,5,3]

{"sheet":"Intermediate Key","index":4,"n_rows":15,"n_cols":31,"rows_kept":15,"merged":[[4,8,4,9],[4,18,4,19],[4,28,4,29]]}
[{"$nulls":30}," "]
[]
[]
[]
[{"$nulls":7},"Show Answers for Puzzle 1","No",{"$nulls":8},"Show Answers for Puzzle 2","No",{"$nulls":8},"Show Answers for Puzzle 3","No"]
[]
[null,3,2,8,4,7,1,5,6,9,null,8,7,6,5,4,1,2,3,9,null,2,9,6,1,8,7,3,5,4]
[null,6,5,7,9,8,3,4,1,2,null,2,5,1,6,3,9,7,8,4,null,7,5,3,6,4,9,2,1,8]
[null,9,1,4,5,6,2,3,7,8,null,3,9,4,8,7,2,1,6,5,null,4,1,8,2,5,3,9,7,6]
[null,7,9,2,6,3,8,1,4,5,null,4,8,5,7,1,3,9,2,6,null,8,4,2,3,6,5,1,9,7]
[null,4,6,3,1,2,5,9,8,7,null,1,6,2,9,5,8,4,7,3,null,1,7,5,4,9,8,6,3,2]
[null,5,8,1,7,9,4,2,3,6,null,9,3,7,2,6,4,5,1,8,null,3,6,9,7,1,2,4,8,5]
[null,1,4,6,8,5,9,7,2,3,null,6,2,9,4,8,7,3,5,1,null,5,3,7,9,2,6,8,4,1]
[null,2,7,5,3,4,6,8,9,1,null,5,4,3,1,2,6,8,9,7,null,6,8,4,5,3,1,7,2,9]
[null,8,3,9,2,1,7,6,5,4,null,7,1,8,3,9,5,6,4,2,null,9,2,1,8,7,4,5,6,3]

{"sheet":"Expert Key","index":5,"n_rows":27,"n_cols":31,"rows_kept":27,"merged":[[4,8,4,9],[4,18,4,19],[4,28,4,29]]}
[{"$nulls":30}," "]
[]
[]
[]
[{"$nulls":7},"Show Answers for Puzzle 1","No",{"$nulls":8},"Show Answers for Puzzle 2","No",{"$nulls":8},"Show Answers for Puzzle 3","No"]
[]
[null,6,9,5,7,1,4,2,8,3,null,6,3,7,4,2,5,1,9,8,null,1,3,2,5,4,9,6,7,8]
[null,1,8,3,2,5,6,9,7,4,null,4,1,5,9,3,8,6,2,7,null,7,9,6,2,3,8,5,4,1]
[null,4,2,7,3,9,8,1,5,6,null,2,9,8,1,7,6,3,4,5,null,5,4,8,1,7,6,3,9,2]
[null,9,4,6,8,2,5,3,1,7,null,1,5,3,8,6,4,2,7,9,null,9,2,7,6,1,3,8,5,4]
[null,7,1,8,6,4,3,5,9,2,null,9,7,2,3,5,1,8,6,4,null,6,1,5,9,8,4,2,3,7]
[null,5,3,2,1,7,9,6,4,8,null,8,6,4,2,9,7,5,3,1,null,3,8,4,7,5,2,1,6,9]
[null,2,7,4,9,6,1,8,3,5,null,3,2,1,7,8,9,4,5,6,null,2,6,3,8,9,7,4,1,5]
[null,3,5,1,4,8,2,7,6,9,null,7,4,6,5,1,3,9,8,2,null,4,7,1,3,2,5,9,8,6]
[null,8,6,9,5,3,7,4,2,1,null,5,8,9,6,4,2,7,1,3,null,8,5,9,4,6,1,7,2,3]
[]
[{"$nulls":29},{"$f":"COUNTIF(V19:AD28,FALSE)","v":51}]
[]
[{"$nulls":21},{"$f":"IF(Expert!V7='Expert Key'!V7,TRUE,FALSE)","v":true},{"$f":"IF(Expert!W7='Expert Key'!W7,TRUE,FALSE)","v":false},{"$f":"IF(Expert!X7='Expert Key'!X7,TRUE,FALSE)","v":true},{"$f":"IF(Expert!Y7='Expert Key'!Y7,TRUE,FALSE)","v":false},{"$f":"IF(Expert!Z7='Expert Key'!Z7,TRUE,FALSE)","v":true},{"$f":"IF(Expert!AA7='Expert Key'!AA7,TRUE,FALSE)","v":false},{"$f":"IF(Expert!AB7='Expert Key'!AB7,TRUE,FALSE)","v":false},{"$f":"IF(Expert!AC7='Expert Key'!AC7,TRUE,FALSE)","v":false},{"$f":"IF(Expert!AD7='Expert Key'!AD7,TRUE,FALSE)","v":false}]
[{"$nulls":21},{"$f":"IF(Expert!V8='Expert Key'!V8,TRUE,FALSE)","v":false},{"$f":"IF(Expert!W8='Expert Key'!W8,TRUE,FALSE)","v":false},{"$f":"IF(Expert!X8='Expert Key'!X8,TRUE,FALSE)","v":true},{"$f":"IF(Expert!Y8='Expert Key'!Y8,TRUE,FALSE)","v":true},{"$f":"IF(Expert!Z8='Expert Key'!Z8,TRUE,FALSE)","v":true},false,{"$f":"IF(Expert!AB8='Expert Key'!AB8,TRUE,FALSE)","v":true},{"$f":"IF(Expert!AC8='Expert Key'!AC8,TRUE,FALSE)","v":false},{"$f":"IF(Expert!AD8='Expert Key'!AD8,TRUE,FALSE)","v":false}]
[{"$nulls":21},{"$f":"IF(Expert!V9='Expert Key'!V9,TRUE,FALSE)","v":false},{"$f":"IF(Expert!W9='Expert Key'!W9,TRUE,FALSE)","v":false},{"$f":"IF(Expert!X9='Expert Key'!X9,TRUE,FALSE)","v":false},{"$f":"IF(Expert!Y9='Expert Key'!Y9,TRUE,FALSE)","v":false},{"$f":"IF(Expert!Z9='Expert Key'!Z9,TRUE,FALSE)","v":false},{"$f":"IF(Expert!AA9='Expert Key'!AA9,TRUE,FALSE)","v":true},{"$f":"IF(Expert!AB9='Expert Key'!AB9,TRUE,FALSE)","v":false},{"$f":"IF(Expert!AC9='Expert Key'!AC9,TRUE,FALSE)","v":true},{"$f":"IF(Expert!AD9='Expert Key'!AD9,TRUE,FALSE)","v":false}]
[{"$nulls":21},{"$f":"IF(Expert!V10='Expert Key'!V10,TRUE,FALSE)","v":true},{"$f":"IF(Expert!W10='Expert Key'!W10,TRUE,FALSE)","v":false},{"$f":"IF(Expert!X10='Expert Key'!X10,TRUE,FALSE)","v":true},{"$f":"IF(Expert!Y10='Expert Key'!Y10,TRUE,FALSE)","v":false},{"$f":"IF(Expert!Z10='Expert Key'!Z10,TRUE,FALSE)","v":false},{"$f":"IF(Expert!AA10='Expert Key'!AA10,TRUE,FALSE)","v":false},{"$f":"IF(Expert!AB10='Expert Key'!AB10,TRUE,FALSE)","v":false},{"$f":"IF(Expert!AC10='Expert Key'!AC10,TRUE,FALSE)","v":true},{"$f":"IF(Expert!AD10='Expert Key'!AD10,TRUE,FALSE)","v":true}]
[{"$nulls":21},{"$f":"IF(Expert!V11='Expert Key'!V11,TRUE,FALSE)","v":false},{"$f":"IF(Expert!W11='Expert Key'!W11,TRUE,FALSE)","v":false},{"$f":"IF(Expert!X11='Expert Key'!X11,TRUE,FALSE)","v":false},{"$f":"IF(Expert!Y11='Expert Key'!Y11,TRUE,FALSE)","v":true},{"$f":"IF(Expert!Z11='Expert Key'!Z11,TRUE,FALSE)","v":true},{"$f":"IF(Expert!AA11='Expert Key'!AA11,TRUE,FALSE)","v":true},{"$f":"IF(Expert!AB11='Expert Key'!AB11,TRUE,FALSE)","v":false},{"$f":"IF(Expert!AC11='Expert Key'!AC11,TRUE,FALSE)","v":false},{"$f":"IF(Expert!AD11='Expert Key'!AD11,TRUE,FALSE)","v":false}]
[{"$nulls":21},{"$f":"IF(Expert!V12='Expert Key'!V12,TRUE,FALSE)","v":true},{"$f":"IF(Expert!W12='Expert Key'!W12,TRUE,FALSE)","v":true},{"$f":"IF(Expert!X12='Expert Key'!X12,TRUE,FALSE)","v":false},{"$f":"IF(Expert!Y12='Expert Key'!Y12,TRUE,FALSE)","v":false},{"$f":"IF(Expert!Z12='Expert Key'!Z12,TRUE,FALSE)","v":false},{"$f":"IF(Expert!AA12='Expert Key'!AA12,TRUE,FALSE)","v":false},{"$f":"IF(Expert!AB12='Expert Key'!AB12,TRUE,FALSE)","v":true},{"$f":"IF(Expert!AC12='Expert Key'!AC12,TRUE,FALSE)","v":false},{"$f":"IF(Expert!AD12='Expert Key'!AD12,TRUE,FALSE)","v":true}]
[{"$nulls":21},{"$f":"IF(Expert!V13='Expert Key'!V13,TRUE,FALSE)","v":false},{"$f":"IF(Expert!W13='Expert Key'!W13,TRUE,FALSE)","v":true},{"$f":"IF(Expert!X13='Expert Key'!X13,TRUE,FALSE)","v":false},{"$f":"IF(Expert!Y13='Expert Key'!Y13,TRUE,FALSE)","v":true},{"$f":"IF(Expert!Z13='Expert Key'!Z13,TRUE,FALSE)","v":false},{"$f":"IF(Expert!AA13='Expert Key'!AA13,TRUE,FALSE)","v":false},{"$f":"IF(Expert!AB13='Expert Key'!AB13,TRUE,FALSE)","v":false},{"$f":"IF(Expert!AC13='Expert Key'!AC13,TRUE,FALSE)","v":false},{"$f":"IF(Expert!AD13='Expert Key'!AD13,TRUE,FALSE)","v":false}]
[{"$nulls":21},{"$f":"IF(Expert!V14='Expert Key'!V14,TRUE,FALSE)","v":false},{"$f":"IF(Expert!W14='Expert Key'!W14,TRUE,FALSE)","v":false},{"$f":"IF(Expert!X14='Expert Key'!X14,TRUE,FALSE)","v":true},{"$f":"IF(Expert!Y14='Expert Key'!Y14,TRUE,FALSE)","v":true},{"$f":"IF(Expert!Z14='Expert Key'!Z14,TRUE,FALSE)","v":true},{"$f":"IF(Expert!AA14='Expert Key'!AA14,TRUE,FALSE)","v":true},{"$f":"IF(Expert!AB14='Expert Key'!AB14,TRUE,FALSE)","v":true},{"$f":"IF(Expert!AC14='Expert Key'!AC14,TRUE,FALSE)","v":false},{"$f":"IF(Expert!AD14='Expert Key'!AD14,TRUE,FALSE)","v":false}]
[{"$nulls":21},{"$f":"IF(Expert!V15='Expert Key'!V15,TRUE,FALSE)","v":false},{"$f":"IF(Expert!W15='Expert Key'!W15,TRUE,FALSE)","v":false},{"$f":"IF(Expert!X15='Expert Key'!X15,TRUE,FALSE)","v":false},{"$f":"IF(Expert!Y15='Expert Key'!Y15,TRUE,FALSE)","v":false},{"$f":"IF(Expert!Z15='Expert Key'!Z15,TRUE,FALSE)","v":true},{"$f":"IF(Expert!AA15='Expert Key'!AA15,TRUE,FALSE)","v":false},{"$f":"IF(Expert!AB15='Expert Key'!AB15,TRUE,FALSE)","v":true},{"$f":"IF(Expert!AC15='Expert Key'!AC15,TRUE,FALSE)","v":false},{"$f":"IF(Expert!AD15='Expert Key'!AD15,TRUE,FALSE)","v":true}]

{"sheet":"Instructions","index":6,"n_rows":1,"n_cols":31,"rows_kept":1}
[{"$nulls":30}," "]