{"text_format":"3","workbook":"xlsx","n_sheets":4,"sheets":["Έναρξη","ΠΑΡΆΜΕΤΡΟΙ ΈΡΓΟΥ","ΛΕΠΤΟΜΕΡΕΙΕΣ ΕΡΓΟΥ","ΣΥΝΟΛΑ ΕΡΓΟΥ"],"not_rendered":{"charts":2,"defined_names":3,"pivot_tables":1},"read":"whole","date_system":"1900"}

{"sheet":"Έναρξη","index":0,"n_rows":8,"n_cols":2,"rows_kept":8}
[null,"ΠΛΗΡΟΦΟΡΙΕΣ ΓΙΑ ΑΥΤΟ ΤΟ ΠΡΟΤΥΠΟ"]
[]
[null,"Χρησιμοποιήστε αυτό το βιβλίο εργασίας για να παρακολουθείτε τις παράμετροι έργου, τις σύνολα έργου και τα σύνολα κατά τον σχεδιασμός έργου για δικηγορικά γραφεία."]
[null,"Συμπληρώστε την επωνυμία εταιρείας στο φύλλο εργασίας \"Παράμετροι έργου\" και θα ενημερωθεί αυτόματα στα άλλα φύλλα εργασίας."]
[null,"Εισαγάγετε πληροφορίες στο φύλλο εργασίας \"Παράμετροι έργου\" για να ενημερώσετε τα γραφήματα στηλών, καθώς και στο φύλλο εργασίας \"Λεπτομέρειες έργου\". Ο Συγκεντρωτικός Πίνακας στο φύλλο εργασίας \"Σύνολα έργου\" ενημερώνεται αυτόματα."]
[null,"Σημείωση:  "]
{"$rows_left_out":3}
{"sheet":"ΠΑΡΆΜΕΤΡΟΙ ΈΡΓΟΥ","index":1,"n_rows":19,"n_cols":9,"rows_kept":19}
["Δημιουργήστε παράμετροι έργου σε αυτό το φύλλο εργασίας. Εισαγάγετε την επωνυμία εταιρείας στο κελί στα δεξιά. Σε κελιά σε αυτή τη στήλη βρίσκονται χρήσιμες οδηγίες.","Επωνυμία εταιρείας"]
["Ο τίτλος αυτού του φύλλου εργασίας βρίσκεται στο κελί στα δεξιά.","Σχεδιασμός έργου για δικηγορικά γραφεία"]
["Το κελί στα δεξιά περιέχει ένα μήνυμα εμπιστευτικότητας.",{"$f":"B1&\" της εταιρείας\"","v":"Επωνυμία εταιρείας της εταιρείας"}]
["Στο κελί στα δεξιά βρίσκεται συμβουλή.","Τα σκιασμένα κελιά υπολογίζονται αυτόματα. Δεν χρειάζεται να εισαγάγετε τίποτα σε αυτά."]
["Εισαγάγετε λεπτομέρειες στον πίνακα \"Παράμετροι\" που ξεκινά από το κελί στα δεξιά. Η επόμενη οδηγία βρίσκεται στο κελί A12.","ΤΥΠΟΣ ΕΡΓΟΥ","ΣΥΝΕΡΓΆΤΗΣ ΓΕΝΙΚΩΝ ΥΠΟΘΕΣΕΩΝ","ΔΙΚΗΓΟΡΟΣ ΕΠΙΧΕΙΡΗΣΕΩΝ","ΣΥΝΗΓΟΡΟΣ ΥΠΕΡΑΣΠΙΣΗΣ","ΔΙΚΗΓΌΡΟΣ ΠΝΕΥΜΑΤΙΚΉΣ ΙΔΙΟΚΤΗΣΊΑΣ","ΔΙΚΗΓΌΡΟΣ ΠΤΏΧΕΥΣΕΩΝ","ΔΙΟΙΚΗΤΙΚΟ ΠΡΟΣΩΠΙΚΟ","ΆΘΡΟΙΣΜΑ"]
[null,"Δημιουργία καταστατικού επιχείρησης",{"v":0.1,"d":"10%"},{"v":0.4,"d":"40%"},{"v":0,"d":"0%"},{"v":0,"d":"0%"},{"v":0,"d":"0%"},{"v":0.5,"d":"50%"},{"$f":"SUM(Παράμετροι[[#This Row],[ΣΥΝΕΡΓΆΤΗΣ ΓΕΝΙΚΩΝ ΥΠΟΘΕΣΕΩΝ]:[ΔΙΟΙΚΗΤΙΚΟ ΠΡΟΣΩΠΙΚΟ]])","v":{"v":1,"d":"100%"}}]
{"$rows_left_out":14}
{"sheet":"ΛΕΠΤΟΜΕΡΕΙΕΣ ΕΡΓΟΥ","index":2,"n_rows":10,"n_cols":25,"rows_kept":10,"merged":[[1,24,8,28]]}
["Δημιουργήστε λεπτομέρειες έργου σε αυτό το φύλλο εργασίας. Η επωνυμία εταιρείας ενημερώνεται αυτόματα στο κελί στα δεξιά. Σε κελιά σε αυτή τη στήλη βρίσκονται χρήσιμες οδηγίες. Πατήστε το κάτω βέλος για να ξεκινήσετε.",{"$f":"'ΠΑΡΆΜΕΤΡΟΙ ΈΡΓΟΥ'!B1","v":"Επωνυμία εταιρείας"}]
["Ο τίτλος αυτού του φύλλου εργασίας βρίσκεται στο κελί στα δεξιά και οι πληροφορίες συμβουλής βρίσκονται στο κελί Y2.",{"$f":"'ΠΑΡΆΜΕΤΡΟΙ ΈΡΓΟΥ'!B2","v":"Σχεδιασμός έργου για δικηγορικά γραφεία"},{"$nulls":22},"ΠΛΗΡΟΦΟΡΙΕΣ:\nΓια να προσθέσετε μια γραμμή, επιλέξτε το πιο κάτω δεξιά κελί στο κύριο σώμα του πίνακα (όχι στη γραμμή συνόλων) και πατήστε το πλήκτρο Tab ή πατήστε τον συνδυασμό πλήκτρων SHIFT+F10 στο σημείο όπου θέλετε να εισαχθεί η γραμμή και επιλέξτε Εισαγωγή | Γραμμές πίνακα επάνω από/κάτω από.\nΒεβαιωθείτε ότι έχουν διαγραφεί όλες οι γραμμές που δεν χρησιμοποιούνται, καθώς ο Συγκεντρωτικός Πίνακας ΣΎΝΟΛΑ ΈΡΓΟΥ θα χρησιμοποιήσει όλα τα κελιά πινάκων και διαφορετικά θα επέστρεφε εσφαλμένα αποτελέσματα."]
["Το κελί στα δεξιά περιέχει ένα μήνυμα εμπιστευτικότητας.",{"$f":"'ΠΑΡΆΜΕΤΡΟΙ ΈΡΓΟΥ'!B3","v":"Επωνυμία εταιρείας της εταιρείας"}]
["Εισαγάγετε πληροφορίες στον πίνακα \"Λεπτομέρειες\", ξεκινώντας από το κελί στα δεξιά. Οι τυποσ εργου στον πίνακα \"Λεπτομέρειες\" στα δεξιά ενημερώνονται αυτόματα από τον πίνακα \"Παράμετροι\" στο φύλλο εργασίας \"Παράμετροι έργου\".","ΟΝΟΜΑ ΕΡΓΟΥ","ΤΥΠΟΣ ΕΡΓΟΥ","ΕΚΤΙΜΩΜΕΝΗ ΕΝΑΡΞΗ","ΕΚΤΙΜΏΜΕΝΗ ΛΉΞΗ","ΠΡΑΓΜΑΤΙΚΗ ΕΝΑΡΞΗ","ΠΡΑΓΜΑΤΙΚΉ ΛΉΞΗ","ΕΚΤΙΜΩΜΕΝΗ ΕΡΓΑΣΙΑ","ΠΡΑΓΜΑΤΙΚΉ ΕΡΓΑΣΊΑ","ΕΚΤΙΜΏΜΕΝΗ ΔΙΆΡΚΕΙΑ","ΠΡΑΓΜΑΤΙΚΗ ΔΙΑΡΚΕΙΑ","ΣΥΝΕΡΓΆΤΗΣ ΓΕΝΙΚΩΝ ΥΠΟΘΕΣΕΩΝ","ΔΙΚΗΓΟΡΟΣ ΕΠΙΧΕΙΡΗΣΕΩΝ","ΣΥΝΗΓΟΡΟΣ ΥΠΕΡΑΣΠΙΣΗΣ","ΔΙΚΗΓΌΡΟΣ ΠΝΕΥΜΑΤΙΚΉΣ ΙΔΙΟΚΤΗΣΊΑΣ","ΔΙΚΗΓΌΡΟΣ ΠΤΏΧΕΥΣΕΩΝ","ΔΙΟΙΚΗΤΙΚΟ ΠΡΟΣΩΠΙΚΟ","ΣΥΝΕΡΓΆΤΗΣ ΓΕΝΙΚΩΝ ΥΠΟΘΕΣΕΩΝ 2","ΔΙΚΗΓΟΡΟΣ ΕΠΙΧΕΙΡΗΣΕΩΝ 2","ΣΥΝΗΓΟΡΟΣ ΥΠΕΡΑΣΠΙΣΗΣ 2","ΔΙΚΗΓΌΡΟΣ ΠΝΕΥΜΑΤΙΚΉΣ ΙΔΙΟΚΤΗΣΊΑΣ 2","ΔΙΚΗΓΌΡΟΣ ΠΤΏΧΕΥΣΕΩΝ 2","ΔΙΟΙΚΗΤΙΚΟ ΠΡΟΣΩΠΙΚΟ 2"]
[null,"Έργο 1","Δημιουργία καταστατικού επιχείρησης",{"$f":"TODAY()","v":"2019-02-15"},{"$f":"TODAY()+60","v":"2019-04-16"},{"$f":"TODAY()+10","v":"2019-02-25"},{"$f":"TODAY()+65","v":"2019-04-21"},200,220,{"$f":"DAYS360(Λεπτομέρειες[[#This Row],[ΕΚΤΙΜΩΜΕΝΗ ΕΝΑΡΞΗ]],Λεπτομέρειες[[#This Row],[ΕΚΤΙΜΏΜΕΝΗ ΛΉΞΗ]],FALSE)","v":61},{"$f":"DAYS360(Λεπτομέρειες[[#This Row],[ΠΡΑΓΜΑΤΙΚΗ ΕΝΑΡΞΗ]],Λεπτομέρειες[[#This Row],[ΠΡΑΓΜΑΤΙΚΉ ΛΉΞΗ]],FALSE)","v":56},{"$f":"INDEX(Παράμετροι[],MATCH(Λεπτομέρειες[[#This Row],[ΤΥΠΟΣ ΕΡΓΟΥ]],Παράμετροι[ΤΥΠΟΣ ΕΡΓΟΥ],0),MATCH(Λεπτομέρειες[[#Headers],[ΣΥΝΕΡΓΆΤΗΣ ΓΕΝΙΚΩΝ ΥΠΟΘΕΣΕΩΝ]],Παράμετροι[#Headers],0))*INDEX('ΠΑΡΆΜΕΤΡΟΙ ΈΡΓΟΥ'!$B$12:$H$12,1,MATCH(Λεπτομέρειες[[#Headers],[ΣΥΝΕΡΓΆΤΗΣ ΓΕΝΙΚΩΝ ΥΠΟΘΕΣΕΩΝ]],Παράμετροι[#Headers],0))*Λεπτομέρειες[[#This Row],[ΕΚΤΙΜΩΜΕΝΗ ΕΡΓΑΣΙΑ]]","v":{"v":7000,"d":"7,000 €"}},{"$f":"INDEX(Παράμετροι[],MATCH(Λεπτομέρειες[[#This Row],[ΤΥΠΟΣ ΕΡΓΟΥ]],Παράμετροι[ΤΥΠΟΣ ΕΡΓΟΥ],0),MATCH(Λεπτομέρειες[[#Headers],[ΔΙΚΗΓΟΡΟΣ ΕΠΙΧΕΙΡΗΣΕΩΝ]],Παράμετροι[#Headers],0))*INDEX('ΠΑΡΆΜΕΤΡΟΙ ΈΡΓΟΥ'!$B$12:$H$12,1,MATCH(Λεπτομέρειες[[#Headers],[ΔΙΚΗΓΟΡΟΣ ΕΠΙΧΕΙΡΗΣΕΩΝ]],Παράμετροι[#Headers],0))*Λεπτομέρειες[[#This Row],[ΕΚΤΙΜΩΜΕΝΗ ΕΡΓΑΣΙΑ]]","v":{"v":20000,"d":"20,000 €"}},{"$f":"INDEX(Παράμετροι[],MATCH(Λεπτομέρειες[[#This Row],[ΤΥΠΟΣ ΕΡΓΟΥ]],Παράμετροι[ΤΥΠΟΣ ΕΡΓΟΥ],0),MATCH(Λεπτομέρειες[[#Headers],[ΣΥΝΗΓΟΡΟΣ ΥΠΕΡΑΣΠΙΣΗΣ]],Παράμετροι[#Headers],0))*INDEX('ΠΑΡΆΜΕΤΡΟΙ ΈΡΓΟΥ'!$B$12:$H$12,1,MATCH(Λεπτομέρειες[[#Headers],[ΣΥΝΗΓΟΡΟΣ ΥΠΕΡΑΣΠΙΣΗΣ]],Παράμετροι[#Headers],0))*Λεπτομέρειες[[#This Row],[ΕΚΤΙΜΩΜΕΝΗ ΕΡΓΑΣΙΑ]]","v":{"v":0,"d":"0 €"}},{"$f":"INDEX(Παράμετροι[],MATCH(Λεπτομέρειες[[#This Row],[ΤΥΠΟΣ ΕΡΓΟΥ]],Παράμετροι[ΤΥΠΟΣ ΕΡΓΟΥ],0),MATCH(Λεπτομέρειες[[#Headers],[ΔΙΚΗΓΌΡΟΣ ΠΝΕΥΜΑΤΙΚΉΣ ΙΔΙΟΚΤΗΣΊΑΣ]],Παράμετροι[#Headers],0))*INDEX('ΠΑΡΆΜΕΤΡΟΙ ΈΡΓΟΥ'!$B$12:$H$12,1,MATCH(Λεπτομέρειες[[#Headers],[ΔΙΚΗΓΌΡΟΣ ΠΝΕΥΜΑΤΙΚΉΣ ΙΔΙΟΚΤΗΣΊΑΣ]],Παράμετροι[#Headers],0))*Λεπτομέρειες[[#This Row],[ΕΚΤΙΜΩΜΕΝΗ ΕΡΓΑΣΙΑ]]","v":{"v":0,"d":"0 €"}},{"$f":"INDEX(Παράμετροι[],MATCH(Λεπτομέρειες[[#This Row],[ΤΥΠΟΣ ΕΡΓΟΥ]],Παράμετροι[ΤΥΠΟΣ ΕΡΓΟΥ],0),MATCH(Λεπτομέρειες[[#Headers],[ΔΙΚΗΓΌΡΟΣ ΠΤΏΧΕΥΣΕΩΝ]],Παράμετροι[#Headers],0))*INDEX('ΠΑΡΆΜΕΤΡΟΙ ΈΡΓΟΥ'!$B$12:$H$12,1,MATCH(Λεπτομέρειες[[#Headers],[ΔΙΚΗΓΌΡΟΣ ΠΤΏΧΕΥΣΕΩΝ]],Παράμετροι[#Headers],0))*Λεπτομέρειες[[#This Row],[ΕΚΤΙΜΩΜΕΝΗ ΕΡΓΑΣΙΑ]]","v":{"v":0,"d":"0 €"}},{"$f":"INDEX(Παράμετροι[],MATCH(Λεπτομέρειες[[#This Row],[ΤΥΠΟΣ ΕΡΓΟΥ]],Παράμετροι[ΤΥΠΟΣ ΕΡΓΟΥ],0),MATCH(Λεπτομέρειες[[#Headers],[ΔΙΟΙΚΗΤΙΚΟ ΠΡΟΣΩΠΙΚΟ]],Παράμετροι[#Headers],0))*INDEX('ΠΑΡΆΜΕΤΡΟΙ ΈΡΓΟΥ'!$B$12:$H$12,1,MATCH(Λεπτομέρειες[[#Headers],[ΔΙΟΙΚΗΤΙΚΟ ΠΡΟΣΩΠΙΚΟ]],Παράμετροι[#Headers],0))*Λεπτομέρειες[[#This Row],[ΕΚΤΙΜΩΜΕΝΗ ΕΡΓΑΣΙΑ]]","v":{"v":12500,"d":"12,500 €"}},{"$f":"INDEX(Παράμετροι[],MATCH(Λεπτομέρειες[[#This Row],[ΤΥΠΟΣ ΕΡΓΟΥ]],Παράμετροι[ΤΥΠΟΣ ΕΡΓΟΥ],0),MATCH(Λεπτομέρειες[[#Headers],[ΣΥΝΕΡΓΆΤΗΣ ΓΕΝΙΚΩΝ ΥΠΟΘΕΣΕΩΝ]],Παράμετροι[#Headers],0))*INDEX('ΠΑΡΆΜΕΤΡΟΙ ΈΡΓΟΥ'!$B$12:$H$12,1,MATCH(Λεπτομέρειες[[#Headers],[ΣΥΝΕΡΓΆΤΗΣ ΓΕΝΙΚΩΝ ΥΠΟΘΕΣΕΩΝ]],Παράμετροι[#Headers],0))*Λεπτομέρειες[[#This Row],[ΠΡΑΓΜΑΤΙΚΉ ΕΡΓΑΣΊΑ]]","v":{"v":7700,"d":"7,700 €"}},{"$f":"INDEX(Παράμετροι[],MATCH(Λεπτομέρειες[[#This Row],[ΤΥΠΟΣ ΕΡΓΟΥ]],Παράμετροι[ΤΥΠΟΣ ΕΡΓΟΥ],0),MATCH(Λεπτομέρειες[[#Headers],[ΔΙΚΗΓΟΡΟΣ ΕΠΙΧΕΙΡΗΣΕΩΝ]],Παράμετροι[#Headers],0))*INDEX('ΠΑΡΆΜΕΤΡΟΙ ΈΡΓΟΥ'!$B$12:$H$12,1,MATCH(Λεπτομέρειες[[#Headers],[ΔΙΚΗΓΟΡΟΣ ΕΠΙΧΕΙΡΗΣΕΩΝ]],Παράμετροι[#Headers],0))*Λεπτομέρειες[[#This Row],[ΠΡΑΓΜΑΤΙΚΉ ΕΡΓΑΣΊΑ]]","v":{"v":22000,"d":"22,000 €"}},{"$f":"INDEX(Παράμετροι[],MATCH(Λεπτομέρειες[[#This Row],[ΤΥΠΟΣ ΕΡΓΟΥ]],Παράμετροι[ΤΥΠΟΣ ΕΡΓΟΥ],0),MATCH(Λεπτομέρειες[[#Headers],[ΣΥΝΗΓΟΡΟΣ ΥΠΕΡΑΣΠΙΣΗΣ]],Παράμετροι[#Headers],0))*INDEX('ΠΑΡΆΜΕΤΡΟΙ ΈΡΓΟΥ'!$B$12:$H$12,1,MATCH(Λεπτομέρειες[[#Headers],[ΣΥΝΗΓΟΡΟΣ ΥΠΕΡΑΣΠΙΣΗΣ]],Παράμετροι[#Headers],0))*Λεπτομέρειες[[#This Row],[ΠΡΑΓΜΑΤΙΚΉ ΕΡΓΑΣΊΑ]]","v":{"v":0,"d":"0 €"}},{"$f":"INDEX(Παράμετροι[],MATCH(Λεπτομέρειες[[#This Row],[ΤΥΠΟΣ ΕΡΓΟΥ]],Παράμετροι[ΤΥΠΟΣ ΕΡΓΟΥ],0),MATCH(Λεπτομέρειες[[#Headers],[ΔΙΚΗΓΌΡΟΣ ΠΝΕΥΜΑΤΙΚΉΣ ΙΔΙΟΚΤΗΣΊΑΣ]],Παράμετροι[#Headers],0))*INDEX('ΠΑΡΆΜΕΤΡΟΙ ΈΡΓΟΥ'!$B$12:$H$12,1,MATCH(Λεπτομέρειες[[#Headers],[ΔΙΚΗΓΌΡΟΣ ΠΝΕΥΜΑΤΙΚΉΣ ΙΔΙΟΚΤΗΣΊΑΣ]],Παράμετροι[#Headers],0))*Λεπτομέρειες[[#This Row],[ΠΡΑΓΜΑΤΙΚΉ ΕΡΓΑΣΊΑ]]","v":{"v":0,"d":"0 €"}},{"$f":"INDEX(Παράμετροι[],MATCH(Λεπτομέρειες[[#This Row],[ΤΥΠΟΣ ΕΡΓΟΥ]],Παράμετροι[ΤΥΠΟΣ ΕΡΓΟΥ],0),MATCH(Λεπτομέρειες[[#Headers],[ΔΙΚΗΓΌΡΟΣ ΠΤΏΧΕΥΣΕΩΝ]],Παράμετροι[#Headers],0))*INDEX('ΠΑΡΆΜΕΤΡΟΙ ΈΡΓΟΥ'!$B$12:$H$12,1,MATCH(Λεπτομέρειες[[#Headers],[ΔΙΚΗΓΌΡΟΣ ΠΤΏΧΕΥΣΕΩΝ]],Παράμετροι[#Headers],0))*Λεπτομέρειες[[#This Row],[ΠΡΑΓΜΑΤΙΚΉ ΕΡΓΑΣΊΑ]]","v":{"v":0,"d":"0 €"}},{"$f":"INDEX(Παράμετροι[],MATCH(Λεπτομέρειες[[#This Row],[ΤΥΠΟΣ ΕΡΓΟΥ]],Παράμετροι[ΤΥΠΟΣ ΕΡΓΟΥ],0),MATCH(Λεπτομέρειες[[#Headers],[ΔΙΟΙΚΗΤΙΚΟ ΠΡΟΣΩΠΙΚΟ]],Παράμετροι[#Headers],0))*INDEX('ΠΑΡΆΜΕΤΡΟΙ ΈΡΓΟΥ'!$B$12:$H$12,1,MATCH(Λεπτομέρειες[[#Headers],[ΔΙΟΙΚΗΤΙΚΟ ΠΡΟΣΩΠΙΚΟ]],Παράμετροι[#Headers],0))*Λεπτομέρειες[[#This Row],[ΠΡΑΓΜΑΤΙΚΉ ΕΡΓΑΣΊΑ]]","v":{"v":13750,"d":"13,750 €"}}]
[null,"Έργο 2","Εξαγορά επιχείρησης",{"$f":"TODAY()+30","v":"2019-03-17"},{"$f":"TODAY()+100","v":"2019-05-26"},{"$f":"TODAY()+40","v":"2019-03-27"},{"$f":"TODAY()+110","v":"2019-06-05"},400,390,{"$f":"DAYS360(Λεπτομέρειες[[#This Row],[ΕΚΤΙΜΩΜΕΝΗ ΕΝΑΡΞΗ]],Λεπτομέρειες[[#This Row],[ΕΚΤΙΜΏΜΕΝΗ ΛΉΞΗ]],FALSE)","v":69},{"$f":"DAYS360(Λεπτομέρειες[[#This Row],[ΠΡΑΓΜΑΤΙΚΗ ΕΝΑΡΞΗ]],Λεπτομέρειες[[#This Row],[ΠΡΑΓΜΑΤΙΚΉ ΛΉΞΗ]],FALSE)","v":68},{"$f":"INDEX(Παράμετροι[],MATCH(Λεπτομέρειες[[#This Row],[ΤΥΠΟΣ ΕΡΓΟΥ]],Παράμετροι[ΤΥΠΟΣ ΕΡΓΟΥ],0),MATCH(Λεπτομέρειες[[#Headers],[ΣΥΝΕΡΓΆΤΗΣ ΓΕΝΙΚΩΝ ΥΠΟΘΕΣΕΩΝ]],Παράμετροι[#Headers],0))*INDEX('ΠΑΡΆΜΕΤΡΟΙ ΈΡΓΟΥ'!$B$12:$H$12,1,MATCH(Λεπτομέρειες[[#Headers],[ΣΥΝΕΡΓΆΤΗΣ ΓΕΝΙΚΩΝ ΥΠΟΘΕΣΕΩΝ]],Παράμετροι[#Headers],0))*Λεπτομέρειες[[#This Row],[ΕΚΤΙΜΩΜΕΝΗ ΕΡΓΑΣΙΑ]]","v":{"v":14000,"d":"14,000 €"}},{"$f":"INDEX(Παράμετροι[],MATCH(Λεπτομέρειες[[#This Row],[ΤΥΠΟΣ ΕΡΓΟΥ]],Παράμετροι[ΤΥΠΟΣ ΕΡΓΟΥ],0),MATCH(Λεπτομέρειες[[#Headers],[ΔΙΚΗΓΟΡΟΣ ΕΠΙΧΕΙΡΗΣΕΩΝ]],Παράμετροι[#Headers],0))*INDEX('ΠΑΡΆΜΕΤΡΟΙ ΈΡΓΟΥ'!$B$12:$H$12,1,MATCH(Λεπτομέρειες[[#Headers],[ΔΙΚΗΓΟΡΟΣ ΕΠΙΧΕΙΡΗΣΕΩΝ]],Παράμετροι[#Headers],0))*Λεπτομέρειες[[#This Row],[ΕΚΤΙΜΩΜΕΝΗ ΕΡΓΑΣΙΑ]]","v":{"v":40000,"d":"40,000 €"}},{"$f":"INDEX(Παράμετροι[],MATCH(Λεπτομέρειες[[#This Row],[ΤΥΠΟΣ ΕΡΓΟΥ]],Παράμετροι[ΤΥΠΟΣ ΕΡΓΟΥ],0),MATCH(Λεπτομέρειες[[#Headers],[ΣΥΝΗΓΟΡΟΣ ΥΠΕΡΑΣΠΙΣΗΣ]],Παράμετροι[#Headers],0))*INDEX('ΠΑΡΆΜΕΤΡΟΙ ΈΡΓΟΥ'!$B$12:$H$12,1,MATCH(Λεπτομέρειες[[#Headers],[ΣΥΝΗΓΟΡΟΣ ΥΠΕΡΑΣΠΙΣΗΣ]],Παράμετροι[#Headers],0))*Λεπτομέρειες[[#This Row],[ΕΚΤΙΜΩΜΕΝΗ ΕΡΓΑΣΙΑ]]","v":{"v":0,"d":"0 €"}},{"$f":"INDEX(Παράμετροι[],MATCH(Λεπτομέρειες[[#This Row],[ΤΥΠΟΣ ΕΡΓΟΥ]],Παράμετροι[ΤΥΠΟΣ ΕΡΓΟΥ],0),MATCH(Λεπτομέρειες[[#Headers],[ΔΙΚΗΓΌΡΟΣ ΠΝΕΥΜΑΤΙΚΉΣ ΙΔΙΟΚΤΗΣΊΑΣ]],Παράμετροι[#Headers],0))*INDEX('ΠΑΡΆΜΕΤΡΟΙ ΈΡΓΟΥ'!$B$12:$H$12,1,MATCH(Λεπτομέρειες[[#Headers],[ΔΙΚΗΓΌΡΟΣ ΠΝΕΥΜΑΤΙΚΉΣ ΙΔΙΟΚΤΗΣΊΑΣ]],Παράμετροι[#Headers],0))*Λεπτομέρειες[[#This Row],[ΕΚΤΙΜΩΜΕΝΗ ΕΡΓΑΣΙΑ]]","v":{"v":11000,"d":"11,000 €"}},{"$f":"INDEX(Παράμετροι[],MATCH(Λεπτομέρειες[[#This Row],[ΤΥΠΟΣ ΕΡΓΟΥ]],Παράμετροι[ΤΥΠΟΣ ΕΡΓΟΥ],0),MATCH(Λεπτομέρειες[[#Headers],[ΔΙΚΗΓΌΡΟΣ ΠΤΏΧΕΥΣΕΩΝ]],Παράμετροι[#Headers],0))*INDEX('ΠΑΡΆΜΕΤΡΟΙ ΈΡΓΟΥ'!$B$12:$H$12,1,MATCH(Λεπτομέρειες[[#Headers],[ΔΙΚΗΓΌΡΟΣ ΠΤΏΧΕΥΣΕΩΝ]],Παράμετροι[#Headers],0))*Λεπτομέρειες[[#This Row],[ΕΚΤΙΜΩΜΕΝΗ ΕΡΓΑΣΙΑ]]","v":{"v":0,"d":"0 €"}},{"$f":"INDEX(Παράμετροι[],MATCH(Λεπτομέρειες[[#This Row],[ΤΥΠΟΣ ΕΡΓΟΥ]],Παράμετροι[ΤΥΠΟΣ ΕΡΓΟΥ],0),MATCH(Λεπτομέρειες[[#Headers],[ΔΙΟΙΚΗΤΙΚΟ ΠΡΟΣΩΠΙΚΟ]],Παράμετροι[#Headers],0))*INDEX('ΠΑΡΆΜΕΤΡΟΙ ΈΡΓΟΥ'!$B$12:$H$12,1,MATCH(Λεπτομέρειες[[#Headers],[ΔΙΟΙΚΗΤΙΚΟ ΠΡΟΣΩΠΙΚΟ]],Παράμετροι[#Headers],0))*Λεπτομέρειες[[#This Row],[ΕΚΤΙΜΩΜΕΝΗ ΕΡΓΑΣΙΑ]]","v":{"v":20000,"d":"20,000 €"}},{"$f":"INDEX(Παράμετροι[],MATCH(Λεπτομέρειες[[#This Row],[ΤΥΠΟΣ ΕΡΓΟΥ]],Παράμετροι[ΤΥΠΟΣ ΕΡΓΟΥ],0),MATCH(Λεπτομέρειες[[#Headers],[ΣΥΝΕΡΓΆΤΗΣ ΓΕΝΙΚΩΝ ΥΠΟΘΕΣΕΩΝ]],Παράμετροι[#Headers],0))*INDEX('ΠΑΡΆΜΕΤΡΟΙ ΈΡΓΟΥ'!$B$12:$H$12,1,MATCH(Λεπτομέρειες[[#Headers],[ΣΥΝΕΡΓΆΤΗΣ ΓΕΝΙΚΩΝ ΥΠΟΘΕΣΕΩΝ]],Παράμετροι[#Headers],0))*Λεπτομέρειες[[#This Row],[ΠΡΑΓΜΑΤΙΚΉ ΕΡΓΑΣΊΑ]]","v":{"v":13650,"d":"13,650 €"}},{"$f":"INDEX(Παράμετροι[],MATCH(Λεπτομέρειες[[#This Row],[ΤΥΠΟΣ ΕΡΓΟΥ]],Παράμετροι[ΤΥΠΟΣ ΕΡΓΟΥ],0),MATCH(Λεπτομέρειες[[#Headers],[ΔΙΚΗΓΟΡΟΣ ΕΠΙΧΕΙΡΗΣΕΩΝ]],Παράμετροι[#Headers],0))*INDEX('ΠΑΡΆΜΕΤΡΟΙ ΈΡΓΟΥ'!$B$12:$H$12,1,MATCH(Λεπτομέρειες[[#Headers],[ΔΙΚΗΓΟΡΟΣ ΕΠΙΧΕΙΡΗΣΕΩΝ]],Παράμετροι[#Headers],0))*Λεπτομέρειες[[#This Row],[ΠΡΑΓΜΑΤΙΚΉ ΕΡΓΑΣΊΑ]]","v":{"v":39000,"d":"39,000 €"}},{"$f":"INDEX(Παράμετροι[],MATCH(Λεπτομέρειες[[#This Row],[ΤΥΠΟΣ ΕΡΓΟΥ]],Παράμετροι[ΤΥΠΟΣ ΕΡΓΟΥ],0),MATCH(Λεπτομέρειες[[#Headers],[ΣΥΝΗΓΟΡΟΣ ΥΠΕΡΑΣΠΙΣΗΣ]],Παράμετροι[#Headers],0))*INDEX('ΠΑΡΆΜΕΤΡΟΙ ΈΡΓΟΥ'!$B$12:$H$12,1,MATCH(Λεπτομέρειες[[#Headers],[ΣΥΝΗΓΟΡΟΣ ΥΠΕΡΑΣΠΙΣΗΣ]],Παράμετροι[#Headers],0))*Λεπτομέρειες[[#This Row],[ΠΡΑΓΜΑΤΙΚΉ ΕΡΓΑΣΊΑ]]","v":{"v":0,"d":"0 €"}},{"$f":"INDEX(Παράμετροι[],MATCH(Λεπτομέρειες[[#This Row],[ΤΥΠΟΣ ΕΡΓΟΥ]],Παράμετροι[ΤΥΠΟΣ ΕΡΓΟΥ],0),MATCH(Λεπτομέρειες[[#Headers],[ΔΙΚΗΓΌΡΟΣ ΠΝΕΥΜΑΤΙΚΉΣ ΙΔΙΟΚΤΗΣΊΑΣ]],Παράμετροι[#Headers],0))*INDEX('ΠΑΡΆΜΕΤΡΟΙ ΈΡΓΟΥ'!$B$12:$H$12,1,MATCH(Λεπτομέρειες[[#Headers],[ΔΙΚΗΓΌΡΟΣ ΠΝΕΥΜΑΤΙΚΉΣ ΙΔΙΟΚΤΗΣΊΑΣ]],Παράμετροι[#Headers],0))*Λεπτομέρειες[[#This Row],[ΠΡΑΓΜΑΤΙΚΉ ΕΡΓΑΣΊΑ]]","v":{"v":10725,"d":"10,725 €"}},{"$f":"INDEX(Παράμετροι[],MATCH(Λεπτομέρειες[[#This Row],[ΤΥΠΟΣ ΕΡΓΟΥ]],Παράμετροι[ΤΥΠΟΣ ΕΡΓΟΥ],0),MATCH(Λεπτομέρειες[[#Headers],[ΔΙΚΗΓΌΡΟΣ ΠΤΏΧΕΥΣΕΩΝ]],Παράμετροι[#Headers],0))*INDEX('ΠΑΡΆΜΕΤΡΟΙ ΈΡΓΟΥ'!$B$12:$H$12,1,MATCH(Λεπτομέρειες[[#Headers],[ΔΙΚΗΓΌΡΟΣ ΠΤΏΧΕΥΣΕΩΝ]],Παράμετροι[#Headers],0))*Λεπτομέρειες[[#This Row],[ΠΡΑΓΜΑΤΙΚΉ ΕΡΓΑΣΊΑ]]","v":{"v":0,"d":"0 €"}},{"$f":"INDEX(Παράμετροι[],MATCH(Λεπτομέρειες[[#This Row],[ΤΥΠΟΣ ΕΡΓΟΥ]],Παράμετροι[ΤΥΠΟΣ ΕΡΓΟΥ],0),MATCH(Λεπτομέρειες[[#Headers],[ΔΙΟΙΚΗΤΙΚΟ ΠΡΟΣΩΠΙΚΟ]],Παράμετροι[#Headers],0))*INDEX('ΠΑΡΆΜΕΤΡΟΙ ΈΡΓΟΥ'!$B$12:$H$12,1,MATCH(Λεπτομέρειες[[#Headers],[ΔΙΟΙΚΗΤΙΚΟ ΠΡΟΣΩΠΙΚΟ]],Παράμετροι[#Headers],0))*Λεπτομέρειες[[#This Row],[ΠΡΑΓΜΑΤΙΚΉ ΕΡΓΑΣΊΑ]]","v":{"v":19500,"d":"19,500 €"}}]
{"$rows_left_out":5}
{"sheet":"ΣΥΝΟΛΑ ΕΡΓΟΥ","index":3,"n_rows":11,"n_cols":16,"rows_kept":11,"merged":[[3,2,3,7],[3,8,3,13],[3,15,14,19]]}
["Δείτε τα σύνολα έργου σε αυτό το φύλλο εργασίας. Η επωνυμία εταιρείας ενημερώνεται αυτόματα στο κελί στα δεξιά. Σε κελιά σε αυτή τη στήλη βρίσκονται χρήσιμες οδηγίες. Πατήστε το κάτω βέλος για να ξεκινήσετε.",{"$f":"'ΠΑΡΆΜΕΤΡΟΙ ΈΡΓΟΥ'!B1","v":"Επωνυμία εταιρείας"}]
["Ο τίτλος αυτού του φύλλου εργασίας βρίσκεται στο κελί στα δεξιά.",{"$f":"'ΠΑΡΆΜΕΤΡΟΙ ΈΡΓΟΥ'!B2","v":"Σχεδιασμός έργου για δικηγορικά γραφεία"}]
["Το κελί στα δεξιά περιέχει ένα μήνυμα εμπιστευτικότητας.",{"$f":"'ΠΑΡΆΜΕΤΡΟΙ ΈΡΓΟΥ'!B3","v":"Επωνυμία εταιρείας της εταιρείας"}]
["Η ετικέτα εκτιμωμενα είναι στο κελί C4, η ετικέτα πραγματικα στο κελί I4 και οι πληροφορίες συμβουλής στο κελί P4.",null,"ΕΚΤΙΜΩΜΕΝΑ",{"$nulls":5},"ΠΡΑΓΜΑΤΙΚΑ",{"$nulls":6},"ΠΛΗΡΟΦΟΡΙΕΣ: \nΑυτός ο Συγκεντρωτικός Πίνακας δεν ανανεώνεται αυτόματα.  Για να τον ανανεώσετε, επιλέξτε τον (οποιοδήποτε κελί μέσα στον Συγκεντρωτικό Πίνακα) και στην καρτέλα ΕΡΓΑΛΕΊΑ ΣΥΓΚΕΝΤΡΩΤΙΚΟΥ ΠΊΝΑΚΑ | ΑΝΑΛΥΣΗ της κορδέλας επιλέξτε \"Ανανέωση\".  Εναλλακτικά, πατήστε τον συνδυασμό πλήκτρων SHIFT + F10, επιλέγοντας τον Συγκεντρωτικό Πίνακα και επιλέξτε \"Ανανέωση\"."]
["Ο Συγκεντρωτικός Πίνακας που ξεκινάει στο κελί στα δεξιά ενημερώνεται αυτόματα","ΟΝΟΜΑ ΕΡΓΟΥ","ΣΥΝΕΡΓΆΤΗΣ ΓΕΝΙΚΩΝ ΥΠΟΘΕΣΕΩΝ ","ΕΠΙΧΕΙΡΗΣΕΙΣ ","ΣΥΝΗΓΟΡΟΣ ΥΠΕΡΑΣΠΙΣΗΣ ","ΠΝΕΥΜΑΤΙΚΉ ΙΔΙΟΚΤΗΣΙΑ ","ΠΤΩΧΕΥΣΗ ","ΔΙΟΙΚΗΤΙΚΟ ΠΡΟΣΩΠΙΚΟ ","ΣΥΝΕΡΓΆΤΗΣ ΓΕΝΙΚΩΝ ΥΠΟΘΕΣΕΩΝ  ","ΕΠΙΧΕΙΡΗΣΕΙΣ  ","ΣΥΝΗΓΟΡΟΣ ΥΠΕΡΑΣΠΙΣΗΣ  ","ΠΤΩΧΕΥΣΗ  ","ΠΝΕΥΜΑΤΙΚΉ ΙΔΙΟΚΤΗΣΙΑ  ","ΔΙΟΙΚΗΤΙΚΟ ΠΡΟΣΩΠΙΚΟ  "]
[null,"Έργο 1",{"v":7000,"d":"7,000.00 €"},{"v":20000,"d":"20,000.00 €"},{"v":0,"d":"0.00 €"},{"v":0,"d":"0.00 €"},{"v":0,"d":"0.00 €"},{"v":12500,"d":"12,500.00 €"},{"v":7700,"d":"7,700.00 €"},{"v":22000,"d":"22,000.00 €"},{"v":0,"d":"0.00 €"},{"v":0,"d":"0.00 €"},{"v":0,"d":"0.00 €"},{"v":13750,"d":"13,750.00 €"}]
{"$rows_left_out":5}