{"text_format":"3","workbook":"xlsx","n_sheets":4,"sheets":["ΕΚΔΗΛΩΣΕΙΣ","ΗΜΕΡΟΛΟΓΙΟ","ΕΚΔΟΣΗ ΕΚΤΥΠΩΣΗΣ","ΔΙΑΧΕΙΡΙΣΤΗΣ"],"not_rendered":{"defined_names":18},"read":"whole","date_system":"1900"}

{"sheet":"ΕΚΔΗΛΩΣΕΙΣ","index":0,"n_rows":38,"n_cols":5,"rows_kept":38}
[]
[null,"ΜΗΝΙΑΙΟΣ ΠΡΟΓΡΑΜΜΑΤΙΣΜΟΣ"]
[null,"ΕΚΔΗΛΩΣΕΩΝ ΚΟΙΝΟΤΗΤΑΣ"]
[]
[]
[]
[]
[null,"ΗΜΕΡΟΜΗΝΙΑ","ΗΜΕΡΑ","ΜΗΝΑΣ","ΟΝΟΜΑ ΕΚΔΗΛΩΣΗΣ"]
[null,"2016-07-01",{"$f":"IF(ISBLANK(tblEvents[[#This Row],[ΗΜΕΡΟΜΗΝΙΑ]]),\"\",UPPER(TEXT(tblEvents[[#This Row],[ΗΜΕΡΟΜΗΝΙΑ]],\"ηηη\")))","v":"ΠΑΡ"},{"$f":"IF(ISBLANK(tblEvents[[#This Row],[ΗΜΕΡΟΜΗΝΙΑ]]),\"\",UPPER(TEXT(tblEvents[[#This Row],[ΗΜΕΡΟΜΗΝΙΑ]],\"μμμ\")))","v":"ΙΟΥΛ"},"Φροντίδα δημοτικού κήπου"]
[null,"2016-07-01",{"$f":"IF(ISBLANK(tblEvents[[#This Row],[ΗΜΕΡΟΜΗΝΙΑ]]),\"\",UPPER(TEXT(tblEvents[[#This Row],[ΗΜΕΡΟΜΗΝΙΑ]],\"ηηη\")))","v":"ΠΑΡ"},{"$f":"IF(ISBLANK(tblEvents[[#This Row],[ΗΜΕΡΟΜΗΝΙΑ]]),\"\",UPPER(TEXT(tblEvents[[#This Row],[ΗΜΕΡΟΜΗΝΙΑ]],\"μμμ\")))","v":"ΙΟΥΛ"},"Δημοτικό συμβούλιο"]
[null,"2016-07-02",{"$f":"IF(ISBLANK(tblEvents[[#This Row],[ΗΜΕΡΟΜΗΝΙΑ]]),\"\",UPPER(TEXT(tblEvents[[#This Row],[ΗΜΕΡΟΜΗΝΙΑ]],\"ηηη\")))","v":"ΣΑΒ"},{"$f":"IF(ISBLANK(tblEvents[[#This Row],[ΗΜΕΡΟΜΗΝΙΑ]]),\"\",UPPER(TEXT(tblEvents[[#This Row],[ΗΜΕΡΟΜΗΝΙΑ]],\"μμμ\")))","v":"ΙΟΥΛ"},"Φροντίδα δημοτικού κήπου"]
[null,"2016-07-03",{"$f":"IF(ISBLANK(tblEvents[[#This Row],[ΗΜΕΡΟΜΗΝΙΑ]]),\"\",UPPER(TEXT(tblEvents[[#This Row],[ΗΜΕΡΟΜΗΝΙΑ]],\"ηηη\")))","v":"ΚΥΡ"},{"$f":"IF(ISBLANK(tblEvents[[#This Row],[ΗΜΕΡΟΜΗΝΙΑ]]),\"\",UPPER(TEXT(tblEvents[[#This Row],[ΗΜΕΡΟΜΗΝΙΑ]],\"μμμ\")))","v":"ΙΟΥΛ"},"Κινηματογραφική βραδιά στο πάρκο"]
[null,"2016-07-08",{"$f":"IF(ISBLANK(tblEvents[[#This Row],[ΗΜΕΡΟΜΗΝΙΑ]]),\"\",UPPER(TEXT(tblEvents[[#This Row],[ΗΜΕΡΟΜΗΝΙΑ]],\"ηηη\")))","v":"ΠΑΡ"},{"$f":"IF(ISBLANK(tblEvents[[#This Row],[ΗΜΕΡΟΜΗΝΙΑ]]),\"\",UPPER(TEXT(tblEvents[[#This Row],[ΗΜΕΡΟΜΗΝΙΑ]],\"μμμ\")))","v":"ΙΟΥΛ"},"Δημοτικό συμβούλιο"]
[null,"2016-07-11",{"$f":"IF(ISBLANK(tblEvents[[#This Row],[ΗΜΕΡΟΜΗΝΙΑ]]),\"\",UPPER(TEXT(tblEvents[[#This Row],[ΗΜΕΡΟΜΗΝΙΑ]],\"ηηη\")))","v":"ΔΕΥ"},{"$f":"IF(ISBLANK(tblEvents[[#This Row],[ΗΜΕΡΟΜΗΝΙΑ]]),\"\",UPPER(TEXT(tblEvents[[#This Row],[ΗΜΕΡΟΜΗΝΙΑ]],\"μμμ\")))","v":"ΙΟΥΛ"},"Γεύμα εμπορικού επιμελητηρίου"]
[null,"2016-07-12",{"$f":"IF(ISBLANK(tblEvents[[#This Row],[ΗΜΕΡΟΜΗΝΙΑ]]),\"\",UPPER(TEXT(tblEvents[[#This Row],[ΗΜΕΡΟΜΗΝΙΑ]],\"ηηη\")))","v":"ΤΡΙ"},{"$f":"IF(ISBLANK(tblEvents[[#This Row],[ΗΜΕΡΟΜΗΝΙΑ]]),\"\",UPPER(TEXT(tblEvents[[#This Row],[ΗΜΕΡΟΜΗΝΙΑ]],\"μμμ\")))","v":"ΙΟΥΛ"},"Έκθεση με αντίκες"]
{"$rows_left_out":24}
{"sheet":"ΗΜΕΡΟΛΟΓΙΟ","index":1,"n_rows":35,"n_cols":21,"rows_kept":35,"merged":[[1,5,1,11],[30,8,34,20]]}
[]
[null,null,2016,null,null,{"$f":"LOOKUP(MonthNum,tblMonths[ΑΡΙΘΜΟΣ],tblMonths[ΜΗΝΑΣ])","v":"ΙΟΥΛΙΟΣ"}]
[null,null,7,null,null,{"$f":"DATE(ViewYear,MonthNum,1)","v":"2016-07-01"},null,null,{"$f":"WEEKDAY(StartDate)","v":6}]
[null,null,"ΔΕΥ",null,null,"ΤΡΙ",null,null,"ΤΕΤ",null,null,"ΠΕΜ",null,null,"ΠΑΡ",null,null,"ΣΑΒ",null,null,"ΚΥΡ"]
[]
[null,null,{"$f":"StartDate-(WEEKDAY(StartDate,2))+{0;1;2;3;4;5}*7 +{2,3,4,5,6,7,1}-3+COLUMN(B1)","v":"2016-06-27"},null,null,{"$f":"StartDate-(WEEKDAY(StartDate,2))+{0;1;2;3;4;5}*7 +{2,3,4,5,6,7,1}-3+COLUMN(C1)","v":"2016-06-28"},null,null,{"$f":"StartDate-(WEEKDAY(StartDate,2))+{0;1;2;3;4;5}*7 +{2,3,4,5,6,7,1}-3+COLUMN(D1)","v":"2016-06-29"},null,null,{"$f":"StartDate-(WEEKDAY(StartDate,2))+{0;1;2;3;4;5}*7 +{2,3,4,5,6,7,1}-3+COLUMN(E1)","v":"2016-06-30"},null,null,{"$f":"StartDate-(WEEKDAY(StartDate,2))+{0;1;2;3;4;5}*7 +{2,3,4,5,6,7,1}-3+COLUMN(F1)","v":"2016-07-01"},null,null,{"$f":"StartDate-(WEEKDAY(StartDate,2))+{0;1;2;3;4;5}*7 +{2,3,4,5,6,7,1}-3+COLUMN(G1)","v":"2016-07-02"},null,null,{"$f":"StartDate-(WEEKDAY(StartDate,2))+{0;1;2;3;4;5}*7 +{2,3,4,5,6,7,1}-3+COLUMN(H1)","v":"2016-07-03"}]
[null,null,{"$f":"IFERROR(INDEX(tblEvents[],SMALL(IF(Dates=C$6,ROW(Dates)),ROW(1:1))-TableRowStart,4),\"\")","v":""},null,null,{"$f":"IFERROR(INDEX(tblEvents[],SMALL(IF(Dates=F$6,ROW(Dates)),ROW(1:1))-TableRowStart,4),\"\")","v":""},null,null,{"$f":"IFERROR(INDEX(tblEvents[],SMALL(IF(Dates=I$6,ROW(Dates)),ROW(1:1))-TableRowStart,4),\"\")","v":""},null,null,{"$f":"IFERROR(INDEX(tblEvents[],SMALL(IF(Dates=L$6,ROW(Dates)),ROW(1:1))-TableRowStart,4),\"\")","v":""},null,null,{"$f":"IFERROR(INDEX(tblEvents[],SMALL(IF(Dates=O$6,ROW(Dates)),ROW(1:1))-TableRowStart,4),\"\")","v":"Φροντίδα δημοτικού κήπου"},null,null,{"$f":"IFERROR(INDEX(tblEvents[],SMALL(IF(Dates=R$6,ROW(Dates)),ROW(1:1))-TableRowStart,4),\"\")","v":"Φροντίδα δημοτικού κήπου"},null,null,{"$f":"IFERROR(INDEX(tblEvents[],SMALL(IF(Dates=U$6,ROW(Dates)),ROW(1:1))-TableRowStart,4),\"\")","v":"Κινηματογραφική βραδιά στο πάρκο"}]
[null,null,{"$f":"IFERROR(INDEX(tblEvents[],SMALL(IF(Dates=C$6,ROW(Dates)),ROW(2:2))-TableRowStart,4),\"\")","v":""},null,null,{"$f":"IFERROR(INDEX(tblEvents[],SMALL(IF(Dates=F$6,ROW(Dates)),ROW(2:2))-TableRowStart,4),\"\")","v":""},null,null,{"$f":"IFERROR(INDEX(tblEvents[],SMALL(IF(Dates=I$6,ROW(Dates)),ROW(2:2))-TableRowStart,4),\"\")","v":""},null,null,{"$f":"IFERROR(INDEX(tblEvents[],SMALL(IF(Dates=L$6,ROW(Dates)),ROW(2:2))-TableRowStart,4),\"\")","v":""},null,null,{"$f":"IFERROR(INDEX(tblEvents[],SMALL(IF(Dates=O$6,ROW(Dates)),ROW(2:2))-TableRowStart,4),\"\")","v":"Δημοτικό συμβούλιο"},null,null,{"$f":"IFERROR(INDEX(tblEvents[],SMALL(IF(Dates=R$6,ROW(Dates)),ROW(2:2))-TableRowStart,4),\"\")","v":""},null,null,{"$f":"IFERROR(INDEX(tblEvents[],SMALL(IF(Dates=U$6,ROW(Dates)),ROW(2:2))-TableRowStart,4),\"\")","v":""}]
[null,null,{"$f":"IFERROR(INDEX(tblEvents[],SMALL(IF(Dates=C$6,ROW(Dates)),ROW(3:3))-TableRowStart,4),\"\")","v":""},null,null,{"$f":"IFERROR(INDEX(tblEvents[],SMALL(IF(Dates=F$6,ROW(Dates)),ROW(3:3))-TableRowStart,4),\"\")","v":""},null,null,{"$f":"IFERROR(INDEX(tblEvents[],SMALL(IF(Dates=I$6,ROW(Dates)),ROW(3:3))-TableRowStart,4),\"\")","v":""},null,null,{"$f":"IFERROR(INDEX(tblEvents[],SMALL(IF(Dates=L$6,ROW(Dates)),ROW(3:3))-TableRowStart,4),\"\")","v":""},null,null,{"$f":"IFERROR(INDEX(tblEvents[],SMALL(IF(Dates=O$6,ROW(Dates)),ROW(3:3))-TableRowStart,4),\"\")","v":""},null,null,{"$f":"IFERROR(INDEX(tblEvents[],SMALL(IF(Dates=R$6,ROW(Dates)),ROW(3:3))-TableRowStart,4),\"\")","v":""},null,null,{"$f":"IFERROR(INDEX(tblEvents[],SMALL(IF(Dates=U$6,ROW(Dates)),ROW(3:3))-TableRowStart,4),\"\")","v":""}]
[null,null,{"$f":"IFERROR(INDEX(tblEvents[],SMALL(IF(Dates=C$6,ROW(Dates)),ROW(#REF!))-TableRowStart,4),\"\")","v":""},null,null,{"$f":"IFERROR(INDEX(tblEvents[],SMALL(IF(Dates=F$6,ROW(Dates)),ROW(#REF!))-TableRowStart,4),\"\")","v":""},null,null,{"$f":"IFERROR(INDEX(tblEvents[],SMALL(IF(Dates=I$6,ROW(Dates)),ROW(#REF!))-TableRowStart,4),\"\")","v":""},null,null,{"$f":"IFERROR(INDEX(tblEvents[],SMALL(IF(Dates=L$6,ROW(Dates)),ROW(#REF!))-TableRowStart,4),\"\")","v":""},null,null,{"$f":"IFERROR(INDEX(tblEvents[],SMALL(IF(Dates=O$6,ROW(Dates)),ROW(#REF!))-TableRowStart,4),\"\")","v":""},null,null,{"$f":"IFERROR(INDEX(tblEvents[],SMALL(IF(Dates=R$6,ROW(Dates)),ROW(#REF!))-TableRowStart,4),\"\")","v":""},null,null,{"$f":"IFERROR(INDEX(tblEvents[],SMALL(IF(Dates=U$6,ROW(Dates)),ROW(#REF!))-TableRowStart,4),\"\")","v":""}]
[null,null,{"$f":"U6+1","v":"2016-07-04"},null,null,{"$f":"C11+1","v":"2016-07-05"},null,null,{"$f":"F11+1","v":"2016-07-06"},null,null,{"$f":"I11+1","v":"2016-07-07"},null,null,{"$f":"L11+1","v":"2016-07-08"},null,null,{"$f":"O11+1","v":"2016-07-09"},null,null,{"$f":"R11+1","v":"2016-07-10"}]
[null,null,{"$f":"IFERROR(INDEX(tblEvents[],SMALL(IF(Dates=C$11,ROW(Dates)),ROW(1:1))-TableRowStart,4),\"\")","v":""},null,null,{"$f":"IFERROR(INDEX(tblEvents[],SMALL(IF(Dates=F$11,ROW(Dates)),ROW(1:1))-TableRowStart,4),\"\")","v":""},null,null,{"$f":"IFERROR(INDEX(tblEvents[],SMALL(IF(Dates=I$11,ROW(Dates)),ROW(1:1))-TableRowStart,4),\"\")","v":""},null,null,{"$f":"IFERROR(INDEX(tblEvents[],SMALL(IF(Dates=L$11,ROW(Dates)),ROW(1:1))-TableRowStart,4),\"\")","v":""},null,null,{"$f":"IFERROR(INDEX(tblEvents[],SMALL(IF(Dates=O$11,ROW(Dates)),ROW(1:1))-TableRowStart,4),\"\")","v":"Δημοτικό συμβούλιο"},null,null,{"$f":"IFERROR(INDEX(tblEvents[],SMALL(IF(Dates=R$11,ROW(Dates)),ROW(1:1))-TableRowStart,4),\"\")","v":""},null,null,{"$f":"IFERROR(INDEX(tblEvents[],SMALL(IF(Dates=U$11,ROW(Dates)),ROW(1:1))-TableRowStart,4),\"\")","v":""}]
[null,null,{"$f":"IFERROR(INDEX(tblEvents[],SMALL(IF(Dates=C$11,ROW(Dates)),ROW(2:2))-TableRowStart,4),\"\")","v":""},null,null,{"$f":"IFERROR(INDEX(tblEvents[],SMALL(IF(Dates=F$11,ROW(Dates)),ROW(2:2))-TableRowStart,4),\"\")","v":""},null,null,{"$f":"IFERROR(INDEX(tblEvents[],SMALL(IF(Dates=I$11,ROW(Dates)),ROW(2:2))-TableRowStart,4),\"\")","v":""},null,null,{"$f":"IFERROR(INDEX(tblEvents[],SMALL(IF(Dates=L$11,ROW(Dates)),ROW(2:2))-TableRowStart,4),\"\")","v":""},null,null,{"$f":"IFERROR(INDEX(tblEvents[],SMALL(IF(Dates=O$11,ROW(Dates)),ROW(2:2))-TableRowStart,4),\"\")","v":""},null,null,{"$f":"IFERROR(INDEX(tblEvents[],SMALL(IF(Dates=R$11,ROW(Dates)),ROW(2:2))-TableRowStart,4),\"\")","v":""},null,null,{"$f":"IFERROR(INDEX(tblEvents[],SMALL(IF(Dates=U$11,ROW(Dates)),ROW(2:2))-TableRowStart,4),\"\")","v":""}]
[null,null,{"$f":"IFERROR(INDEX(tblEvents[],SMALL(IF(Dates=C$11,ROW(Dates)),ROW(3:3))-TableRowStart,4),\"\")","v":""},null,null,{"$f":"IFERROR(INDEX(tblEvents[],SMALL(IF(Dates=F$11,ROW(Dates)),ROW(3:3))-TableRowStart,4),\"\")","v":""},null,null,{"$f":"IFERROR(INDEX(tblEvents[],SMALL(IF(Dates=I$11,ROW(Dates)),ROW(3:3))-TableRowStart,4),\"\")","v":""},null,null,{"$f":"IFERROR(INDEX(tblEvents[],SMALL(IF(Dates=L$11,ROW(Dates)),ROW(3:3))-TableRowStart,4),\"\")","v":""},null,null,{"$f":"IFERROR(INDEX(tblEvents[],SMALL(IF(Dates=O$11,ROW(Dates)),ROW(3:3))-TableRowStart,4),\"\")","v":""},null,null,{"$f":"IFERROR(INDEX(tblEvents[],SMALL(IF(Dates=R$11,ROW(Dates)),ROW(3:3))-TableRowStart,4),\"\")","v":""},null,null,{"$f":"IFERROR(INDEX(tblEvents[],SMALL(IF(Dates=U$11,ROW(Dates)),ROW(3:3))-TableRowStart,4),\"\")","v":""}]
[null,null,{"$f":"IFERROR(INDEX(tblEvents[],SMALL(IF(Dates=C$11,ROW(Dates)),ROW(#REF!))-TableRowStart,4),\"\")","v":""},null,null,{"$f":"IFERROR(INDEX(tblEvents[],SMALL(IF(Dates=F$11,ROW(Dates)),ROW(#REF!))-TableRowStart,4),\"\")","v":""},null,null,{"$f":"IFERROR(INDEX(tblEvents[],SMALL(IF(Dates=I$11,ROW(Dates)),ROW(#REF!))-TableRowStart,4),\"\")","v":""},null,null,{"$f":"IFERROR(INDEX(tblEvents[],SMALL(IF(Dates=L$11,ROW(Dates)),ROW(#REF!))-TableRowStart,4),\"\")","v":""},null,null,{"$f":"IFERROR(INDEX(tblEvents[],SMALL(IF(Dates=O$11,ROW(Dates)),ROW(#REF!))-TableRowStart,4),\"\")","v":""},null,null,{"$f":"IFERROR(INDEX(tblEvents[],SMALL(IF(Dates=R$11,ROW(Dates)),ROW(#REF!))-TableRowStart,4),\"\")","v":""},null,null,{"$f":"IFERROR(INDEX(tblEvents[],SMALL(IF(Dates=U$11,ROW(Dates)),ROW(#REF!))-TableRowStart,4),\"\")","v":""}]
{"$rows_left_out":21}
{"sheet":"ΕΚΔΟΣΗ ΕΚΤΥΠΩΣΗΣ","index":2,"n_rows":35,"n_cols":21,"rows_kept":35,"merged":[[1,5,1,11],[30,8,34,20]]}
[]
[null,null,{"$f":"ViewYear","v":2016},null,null,{"$f":"ViewMonth","v":"ΙΟΥΛΙΟΣ"},{"$f":"ΗΜΕΡΟΛΟΓΙΟ!G2","v":0},{"$f":"ΗΜΕΡΟΛΟΓΙΟ!H2","v":0},{"$f":"ΗΜΕΡΟΛΟΓΙΟ!I2","v":0},{"$f":"ΗΜΕΡΟΛΟΓΙΟ!J2","v":0},{"$f":"ΗΜΕΡΟΛΟΓΙΟ!K2","v":0},{"$f":"ΗΜΕΡΟΛΟΓΙΟ!L2","v":0}]
[]
[null,null,"ΔΕΥ",null,null,"ΤΡΙ",null,null,"ΤΕΤ",null,null,"ΠΕΜ",null,null,"ΠΑΡ",null,null,"ΣΑΒ",null,null,"ΚΥΡ"]
[]
[null,null,{"$f":"ΗΜΕΡΟΛΟΓΙΟ!C6","v":"2016-06-27"},{"$f":"ΗΜΕΡΟΛΟΓΙΟ!D6","v":0},{"$f":"ΗΜΕΡΟΛΟΓΙΟ!E6","v":0},{"$f":"ΗΜΕΡΟΛΟΓΙΟ!F6","v":"2016-06-28"},{"$f":"ΗΜΕΡΟΛΟΓΙΟ!G6","v":0},{"$f":"ΗΜΕΡΟΛΟΓΙΟ!H6","v":0},{"$f":"ΗΜΕΡΟΛΟΓΙΟ!I6","v":"2016-06-29"},{"$f":"ΗΜΕΡΟΛΟΓΙΟ!J6","v":0},{"$f":"ΗΜΕΡΟΛΟΓΙΟ!K6","v":0},{"$f":"ΗΜΕΡΟΛΟΓΙΟ!L6","v":"2016-06-30"},{"$f":"ΗΜΕΡΟΛΟΓΙΟ!M6","v":0},{"$f":"ΗΜΕΡΟΛΟΓΙΟ!N6","v":0},{"$f":"ΗΜΕΡΟΛΟΓΙΟ!O6","v":"2016-07-01"},{"$f":"ΗΜΕΡΟΛΟΓΙΟ!P6","v":0},{"$f":"ΗΜΕΡΟΛΟΓΙΟ!Q6","v":0},{"$f":"ΗΜΕΡΟΛΟΓΙΟ!R6","v":"2016-07-02"},{"$f":"ΗΜΕΡΟΛΟΓΙΟ!S6","v":0},{"$f":"ΗΜΕΡΟΛΟΓΙΟ!T6","v":0},{"$f":"ΗΜΕΡΟΛΟΓΙΟ!U6","v":"2016-07-03"}]
[null,null,{"$f":"ΗΜΕΡΟΛΟΓΙΟ!C7","v":""},{"$f":"ΗΜΕΡΟΛΟΓΙΟ!D7","v":0},{"$f":"ΗΜΕΡΟΛΟΓΙΟ!E7","v":0},{"$f":"ΗΜΕΡΟΛΟΓΙΟ!F7","v":""},{"$f":"ΗΜΕΡΟΛΟΓΙΟ!G7","v":0},{"$f":"ΗΜΕΡΟΛΟΓΙΟ!H7","v":0},{"$f":"ΗΜΕΡΟΛΟΓΙΟ!I7","v":""},{"$f":"ΗΜΕΡΟΛΟΓΙΟ!J7","v":0},{"$f":"ΗΜΕΡΟΛΟΓΙΟ!K7","v":0},{"$f":"ΗΜΕΡΟΛΟΓΙΟ!L7","v":""},{"$f":"ΗΜΕΡΟΛΟΓΙΟ!M7","v":0},{"$f":"ΗΜΕΡΟΛΟΓΙΟ!N7","v":0},{"$f":"ΗΜΕΡΟΛΟΓΙΟ!O7","v":"Φροντίδα δημοτικού κήπου"},{"$f":"ΗΜΕΡΟΛΟΓΙΟ!P7","v":0},{"$f":"ΗΜΕΡΟΛΟΓΙΟ!Q7","v":0},{"$f":"ΗΜΕΡΟΛΟΓΙΟ!R7","v":"Φροντίδα δημοτικού κήπου"},{"$f":"ΗΜΕΡΟΛΟΓΙΟ!S7","v":0},{"$f":"ΗΜΕΡΟΛΟΓΙΟ!T7","v":0},{"$f":"ΗΜΕΡΟΛΟΓΙΟ!U7","v":"Κινηματογραφική βραδιά στο πάρκο"}]
[null,null,{"$f":"ΗΜΕΡΟΛΟΓΙΟ!C8","v":""},{"$f":"ΗΜΕΡΟΛΟΓΙΟ!D8","v":"00:00:00"},{"$f":"ΗΜΕΡΟΛΟΓΙΟ!E8","v":"00:00:00"},{"$f":"ΗΜΕΡΟΛΟΓΙΟ!F8","v":""},{"$f":"ΗΜΕΡΟΛΟΓΙΟ!G8","v":"00:00:00"},{"$f":"ΗΜΕΡΟΛΟΓΙΟ!H8","v":"00:00:00"},{"$f":"ΗΜΕΡΟΛΟΓΙΟ!I8","v":""},{"$f":"ΗΜΕΡΟΛΟΓΙΟ!J8","v":"00:00:00"},{"$f":"ΗΜΕΡΟΛΟΓΙΟ!K8","v":"00:00:00"},{"$f":"ΗΜΕΡΟΛΟΓΙΟ!L8","v":""},{"$f":"ΗΜΕΡΟΛΟΓΙΟ!M8","v":"00:00:00"},{"$f":"ΗΜΕΡΟΛΟΓΙΟ!N8","v":"00:00:00"},{"$f":"ΗΜΕΡΟΛΟΓΙΟ!O8","v":"Δημοτικό συμβούλιο"},{"$f":"ΗΜΕΡΟΛΟΓΙΟ!P8","v":"00:00:00"},{"$f":"ΗΜΕΡΟΛΟΓΙΟ!Q8","v":"00:00:00"},{"$f":"ΗΜΕΡΟΛΟΓΙΟ!R8","v":""},{"$f":"ΗΜΕΡΟΛΟΓΙΟ!S8","v":"00:00:00"},{"$f":"ΗΜΕΡΟΛΟΓΙΟ!T8","v":"00:00:00"},{"$f":"ΗΜΕΡΟΛΟΓΙΟ!U8","v":""}]
[null,null,{"$f":"ΗΜΕΡΟΛΟΓΙΟ!C9","v":""},{"$f":"ΗΜΕΡΟΛΟΓΙΟ!D9","v":0},{"$f":"ΗΜΕΡΟΛΟΓΙΟ!E9","v":0},{"$f":"ΗΜΕΡΟΛΟΓΙΟ!F9","v":""},{"$f":"ΗΜΕΡΟΛΟΓΙΟ!G9","v":0},{"$f":"ΗΜΕΡΟΛΟΓΙΟ!H9","v":0},{"$f":"ΗΜΕΡΟΛΟΓΙΟ!I9","v":""},{"$f":"ΗΜΕΡΟΛΟΓΙΟ!J9","v":0},{"$f":"ΗΜΕΡΟΛΟΓΙΟ!K9","v":0},{"$f":"ΗΜΕΡΟΛΟΓΙΟ!L9","v":""},{"$f":"ΗΜΕΡΟΛΟΓΙΟ!M9","v":0},{"$f":"ΗΜΕΡΟΛΟΓΙΟ!N9","v":0},{"$f":"ΗΜΕΡΟΛΟΓΙΟ!O9","v":""},{"$f":"ΗΜΕΡΟΛΟΓΙΟ!P9","v":0},{"$f":"ΗΜΕΡΟΛΟΓΙΟ!Q9","v":0},{"$f":"ΗΜΕΡΟΛΟΓΙΟ!R9","v":""},{"$f":"ΗΜΕΡΟΛΟΓΙΟ!S9","v":0},{"$f":"ΗΜΕΡΟΛΟΓΙΟ!T9","v":0},{"$f":"ΗΜΕΡΟΛΟΓΙΟ!U9","v":""}]
[null,null,{"$f":"ΗΜΕΡΟΛΟΓΙΟ!C10","v":""},{"$f":"ΗΜΕΡΟΛΟΓΙΟ!D10","v":0},{"$f":"ΗΜΕΡΟΛΟΓΙΟ!E10","v":0},{"$f":"ΗΜΕΡΟΛΟΓΙΟ!F10","v":""},{"$f":"ΗΜΕΡΟΛΟΓΙΟ!G10","v":0},{"$f":"ΗΜΕΡΟΛΟΓΙΟ!H10","v":0},{"$f":"ΗΜΕΡΟΛΟΓΙΟ!I10","v":""},{"$f":"ΗΜΕΡΟΛΟΓΙΟ!J10","v":0},{"$f":"ΗΜΕΡΟΛΟΓΙΟ!K10","v":0},{"$f":"ΗΜΕΡΟΛΟΓΙΟ!L10","v":""},{"$f":"ΗΜΕΡΟΛΟΓΙΟ!M10","v":0},{"$f":"ΗΜΕΡΟΛΟΓΙΟ!N10","v":0},{"$f":"ΗΜΕΡΟΛΟΓΙΟ!O10","v":""},{"$f":"ΗΜΕΡΟΛΟΓΙΟ!P10","v":0},{"$f":"ΗΜΕΡΟΛΟΓΙΟ!Q10","v":0},{"$f":"ΗΜΕΡΟΛΟΓΙΟ!R10","v":""},{"$f":"ΗΜΕΡΟΛΟΓΙΟ!S10","v":0},{"$f":"ΗΜΕΡΟΛΟΓΙΟ!T10","v":0},{"$f":"ΗΜΕΡΟΛΟΓΙΟ!U10","v":""}]
[null,null,{"$f":"ΗΜΕΡΟΛΟΓΙΟ!C11","v":"2016-07-04"},{"$f":"ΗΜΕΡΟΛΟΓΙΟ!D11","v":0},{"$f":"ΗΜΕΡΟΛΟΓΙΟ!E11","v":0},{"$f":"ΗΜΕΡΟΛΟΓΙΟ!F11","v":"2016-07-05"},{"$f":"ΗΜΕΡΟΛΟΓΙΟ!G11","v":0},{"$f":"ΗΜΕΡΟΛΟΓΙΟ!H11","v":0},{"$f":"ΗΜΕΡΟΛΟΓΙΟ!I11","v":"2016-07-06"},{"$f":"ΗΜΕΡΟΛΟΓΙΟ!J11","v":0},{"$f":"ΗΜΕΡΟΛΟΓΙΟ!K11","v":0},{"$f":"ΗΜΕΡΟΛΟΓΙΟ!L11","v":"2016-07-07"},{"$f":"ΗΜΕΡΟΛΟΓΙΟ!M11","v":0},{"$f":"ΗΜΕΡΟΛΟΓΙΟ!N11","v":0},{"$f":"ΗΜΕΡΟΛΟΓΙΟ!O11","v":"2016-07-08"},{"$f":"ΗΜΕΡΟΛΟΓΙΟ!P11","v":0},{"$f":"ΗΜΕΡΟΛΟΓΙΟ!Q11","v":0},{"$f":"ΗΜΕΡΟΛΟΓΙΟ!R11","v":"2016-07-09"},{"$f":"ΗΜΕΡΟΛΟΓΙΟ!S11","v":0},{"$f":"ΗΜΕΡΟΛΟΓΙΟ!T11","v":0},{"$f":"ΗΜΕΡΟΛΟΓΙΟ!U11","v":"2016-07-10"}]
[null,null,{"$f":"ΗΜΕΡΟΛΟΓΙΟ!C12","v":""},{"$f":"ΗΜΕΡΟΛΟΓΙΟ!D12","v":0},{"$f":"ΗΜΕΡΟΛΟΓΙΟ!E12","v":0},{"$f":"ΗΜΕΡΟΛΟΓΙΟ!F12","v":""},{"$f":"ΗΜΕΡΟΛΟΓΙΟ!G12","v":0},{"$f":"ΗΜΕΡΟΛΟΓΙΟ!H12","v":0},{"$f":"ΗΜΕΡΟΛΟΓΙΟ!I12","v":""},{"$f":"ΗΜΕΡΟΛΟΓΙΟ!J12","v":0},{"$f":"ΗΜΕΡΟΛΟΓΙΟ!K12","v":0},{"$f":"ΗΜΕΡΟΛΟΓΙΟ!L12","v":""},{"$f":"ΗΜΕΡΟΛΟΓΙΟ!M12","v":0},{"$f":"ΗΜΕΡΟΛΟΓΙΟ!N12","v":0},{"$f":"ΗΜΕΡΟΛΟΓΙΟ!O12","v":"Δημοτικό συμβούλιο"},{"$f":"ΗΜΕΡΟΛΟΓΙΟ!P12","v":0},{"$f":"ΗΜΕΡΟΛΟΓΙΟ!Q12","v":0},{"$f":"ΗΜΕΡΟΛΟΓΙΟ!R12","v":""},{"$f":"ΗΜΕΡΟΛΟΓΙΟ!S12","v":0},{"$f":"ΗΜΕΡΟΛΟΓΙΟ!T12","v":0},{"$f":"ΗΜΕΡΟΛΟΓΙΟ!U12","v":""}]
[null,null,{"$f":"ΗΜΕΡΟΛΟΓΙΟ!C13","v":""},{"$f":"ΗΜΕΡΟΛΟΓΙΟ!D13","v":0},{"$f":"ΗΜΕΡΟΛΟΓΙΟ!E13","v":0},{"$f":"ΗΜΕΡΟΛΟΓΙΟ!F13","v":""},{"$f":"ΗΜΕΡΟΛΟΓΙΟ!G13","v":0},{"$f":"ΗΜΕΡΟΛΟΓΙΟ!H13","v":0},{"$f":"ΗΜΕΡΟΛΟΓΙΟ!I13","v":""},{"$f":"ΗΜΕΡΟΛΟΓΙΟ!J13","v":0},{"$f":"ΗΜΕΡΟΛΟΓΙΟ!K13","v":0},{"$f":"ΗΜΕΡΟΛΟΓΙΟ!L13","v":""},{"$f":"ΗΜΕΡΟΛΟΓΙΟ!M13","v":0},{"$f":"ΗΜΕΡΟΛΟΓΙΟ!N13","v":0},{"$f":"ΗΜΕΡΟΛΟΓΙΟ!O13","v":""},{"$f":"ΗΜΕΡΟΛΟΓΙΟ!P13","v":0},{"$f":"ΗΜΕΡΟΛΟΓΙΟ!Q13","v":0},{"$f":"ΗΜΕΡΟΛΟΓΙΟ!R13","v":""},{"$f":"ΗΜΕΡΟΛΟΓΙΟ!S13","v":0},{"$f":"ΗΜΕΡΟΛΟΓΙΟ!T13","v":0},{"$f":"ΗΜΕΡΟΛΟΓΙΟ!U13","v":""}]
[null,null,{"$f":"ΗΜΕΡΟΛΟΓΙΟ!C14","v":""},{"$f":"ΗΜΕΡΟΛΟΓΙΟ!D14","v":0},{"$f":"ΗΜΕΡΟΛΟΓΙΟ!E14","v":0},{"$f":"ΗΜΕΡΟΛΟΓΙΟ!F14","v":""},{"$f":"ΗΜΕΡΟΛΟΓΙΟ!G14","v":0},{"$f":"ΗΜΕΡΟΛΟΓΙΟ!H14","v":0},{"$f":"ΗΜΕΡΟΛΟΓΙΟ!I14","v":""},{"$f":"ΗΜΕΡΟΛΟΓΙΟ!J14","v":0},{"$f":"ΗΜΕΡΟΛΟΓΙΟ!K14","v":0},{"$f":"ΗΜΕΡΟΛΟΓΙΟ!L14","v":""},{"$f":"ΗΜΕΡΟΛΟΓΙΟ!M14","v":0},{"$f":"ΗΜΕΡΟΛΟΓΙΟ!N14","v":0},{"$f":"ΗΜΕΡΟΛΟΓΙΟ!O14","v":""},{"$f":"ΗΜΕΡΟΛΟΓΙΟ!P14","v":0},{"$f":"ΗΜΕΡΟΛΟΓΙΟ!Q14","v":0},{"$f":"ΗΜΕΡΟΛΟΓΙΟ!R14","v":""},{"$f":"ΗΜΕΡΟΛΟΓΙΟ!S14","v":0},{"$f":"ΗΜΕΡΟΛΟΓΙΟ!T14","v":0},{"$f":"ΗΜΕΡΟΛΟΓΙΟ!U14","v":""}]
[null,null,{"$f":"ΗΜΕΡΟΛΟΓΙΟ!C15","v":""},{"$f":"ΗΜΕΡΟΛΟΓΙΟ!D15","v":0},{"$f":"ΗΜΕΡΟΛΟΓΙΟ!E15","v":0},{"$f":"ΗΜΕΡΟΛΟΓΙΟ!F15","v":""},{"$f":"ΗΜΕΡΟΛΟΓΙΟ!G15","v":0},{"$f":"ΗΜΕΡΟΛΟΓΙΟ!H15","v":0},{"$f":"ΗΜΕΡΟΛΟΓΙΟ!I15","v":""},{"$f":"ΗΜΕΡΟΛΟΓΙΟ!J15","v":0},{"$f":"ΗΜΕΡΟΛΟΓΙΟ!K15","v":0},{"$f":"ΗΜΕΡΟΛΟΓΙΟ!L15","v":""},{"$f":"ΗΜΕΡΟΛΟΓΙΟ!M15","v":0},{"$f":"ΗΜΕΡΟΛΟΓΙΟ!N15","v":0},{"$f":"ΗΜΕΡΟΛΟΓΙΟ!O15","v":""},{"$f":"ΗΜΕΡΟΛΟΓΙΟ!P15","v":0},{"$f":"ΗΜΕΡΟΛΟΓΙΟ!Q15","v":0},{"$f":"ΗΜΕΡΟΛΟΓΙΟ!R15","v":""},{"$f":"ΗΜΕΡΟΛΟΓΙΟ!S15","v":0},{"$f":"ΗΜΕΡΟΛΟΓΙΟ!T15","v":0},{"$f":"ΗΜΕΡΟΛΟΓΙΟ!U15","v":""}]
{"$rows_left_out":21}
{"sheet":"ΔΙΑΧΕΙΡΙΣΤΗΣ","index":3,"n_rows":14,"n_cols":3,"rows_kept":14,"hidden":true}
[]
[null,"ΜΗΝΑΣ","ΑΡΙΘΜΟΣ"]
[null,"ΙΑΝΟΥΑΡΙΟΣ",1]
[null,"ΦΕΒΡΟΥΑΡΙΟΣ",2]
[null,"ΜΑΡΤΙΟΣ",3]
[null,"ΑΠΡΙΛΙΟΣ",4]
[null,"ΜΑΪΟΣ",5]
[null,"ΙΟΥΝΙΟΣ",6]
[null,"ΙΟΥΛΙΟΣ",7]
[null,"ΑΥΓΟΥΣΤΟΣ",8]
[null,"ΣΕΠΤΕΜΒΡΙΟΣ",9]
[null,"ΟΚΤΩΒΡΙΟΣ",10]
[null,"ΝΟΕΜΒΡΙΟΣ",11]
[null,"ΔΕΚΕΜΒΡΙΟΣ",12]