{"text_format":"3","workbook":"xlsx","n_sheets":3,"sheets":["Umsatzdaten","Umsatzbericht","Bestand"],"not_rendered":{"defined_names":10,"pivot_tables":1},"read":"whole","date_system":"1900"}

{"sheet":"Umsatzdaten","index":0,"n_rows":13,"n_cols":11,"rows_kept":13}
[]
[null,"TÄGLICHE BARVERKÄUFE"]
[]
[]
[]
[{"$nulls":10}," "]
[{"$nulls":10}," "]
[null,"DATUM","UHRZEIT","BUCHUNGSNUMMER","SKU/PRODUKTNUMMER","BESCHREIBUNG","UMSATZBETRAG","STEUER %","UMSATZSTEUER","SUMME"]
[null,"2012-02-01","10:30:00",1001,90001,{"$f":"IFERROR(IF(ISNA(VLOOKUP(tblUmsatzDaten[[#This Row],[SKU/PRODUKTNUMMER]],tblBestand[],2,0)),\"\",VLOOKUP(tblUmsatzDaten[[#This Row],[SKU/PRODUKTNUMMER]],tblBestand[],2,0)),\"Keine Beschreibung gefunden\")","v":"Decke"},{"v":74.95,"d":"74.95 €"},{"v":0.05,"d":"5.00%"},{"$f":"tblUmsatzDaten[[#This Row],[UMSATZBETRAG]]*tblUmsatzDaten[[#This Row],[STEUER %]]","v":{"v":3.7475000000000005,"d":"3.75 €"}},{"$f":"tblUmsatzDaten[[#This Row],[UMSATZBETRAG]]+tblUmsatzDaten[[#This Row],[UMSATZSTEUER]]","v":{"v":78.6975,"d":"78.70 €"}}]
[null,"2012-02-01","10:33:00",1002,90023,{"$f":"IFERROR(IF(ISNA(VLOOKUP(tblUmsatzDaten[[#This Row],[SKU/PRODUKTNUMMER]],tblBestand[],2,0)),\"\",VLOOKUP(tblUmsatzDaten[[#This Row],[SKU/PRODUKTNUMMER]],tblBestand[],2,0)),\"Keine Beschreibung gefunden\")","v":"Tischtuch, rund, Durchmesser 15,24 cm"},{"v":34.99,"d":"34.99 €"},{"v":0.05,"d":"5.00%"},{"$f":"tblUmsatzDaten[[#This Row],[UMSATZBETRAG]]*tblUmsatzDaten[[#This Row],[STEUER %]]","v":{"v":1.7495000000000003,"d":"1.75 €"}},{"$f":"tblUmsatzDaten[[#This Row],[UMSATZBETRAG]]+tblUmsatzDaten[[#This Row],[UMSATZSTEUER]]","v":{"v":36.7395,"d":"36.74 €"}}]
[null,"2012-02-01","10:45:00",1003,90005,{"$f":"IFERROR(IF(ISNA(VLOOKUP(tblUmsatzDaten[[#This Row],[SKU/PRODUKTNUMMER]],tblBestand[],2,0)),\"\",VLOOKUP(tblUmsatzDaten[[#This Row],[SKU/PRODUKTNUMMER]],tblBestand[],2,0)),\"Keine Beschreibung gefunden\")","v":"Runder Teller"},{"v":55.95,"d":"55.95 €"},{"v":0.05,"d":"5.00%"},{"$f":"tblUmsatzDaten[[#This Row],[UMSATZBETRAG]]*tblUmsatzDaten[[#This Row],[STEUER %]]","v":{"v":2.7975000000000003,"d":"2.80 €"}},{"$f":"tblUmsatzDaten[[#This Row],[UMSATZBETRAG]]+tblUmsatzDaten[[#This Row],[UMSATZSTEUER]]","v":{"v":58.7475,"d":"58.75 €"}}]
[null,"2012-02-01","10:55:00",1004,90004,{"$f":"IFERROR(IF(ISNA(VLOOKUP(tblUmsatzDaten[[#This Row],[SKU/PRODUKTNUMMER]],tblBestand[],2,0)),\"\",VLOOKUP(tblUmsatzDaten[[#This Row],[SKU/PRODUKTNUMMER]],tblBestand[],2,0)),\"Keine Beschreibung gefunden\")","v":"Quadratischer Teller"},{"v":2.95,"d":"2.95 €"},{"v":0.05,"d":"5.00%"},{"$f":"tblUmsatzDaten[[#This Row],[UMSATZBETRAG]]*tblUmsatzDaten[[#This Row],[STEUER %]]","v":{"v":0.14750000000000002,"d":"0.15 €"}},{"$f":"tblUmsatzDaten[[#This Row],[UMSATZBETRAG]]+tblUmsatzDaten[[#This Row],[UMSATZSTEUER]]","v":{"v":3.0975,"d":"3.10 €"}}]
[null,"2012-02-01","11:45:00",1005,90002,{"$f":"IFERROR(IF(ISNA(VLOOKUP(tblUmsatzDaten[[#This Row],[SKU/PRODUKTNUMMER]],tblBestand[],2,0)),\"\",VLOOKUP(tblUmsatzDaten[[#This Row],[SKU/PRODUKTNUMMER]],tblBestand[],2,0)),\"Keine Beschreibung gefunden\")","v":"Kissen"},{"v":14.98,"d":"14.98 €"},{"v":0.05,"d":"5.00%"},{"$f":"tblUmsatzDaten[[#This Row],[UMSATZBETRAG]]*tblUmsatzDaten[[#This Row],[STEUER %]]","v":{"v":0.7490000000000001,"d":"0.75 €"}},{"$f":"tblUmsatzDaten[[#This Row],[UMSATZBETRAG]]+tblUmsatzDaten[[#This Row],[UMSATZSTEUER]]","v":{"v":15.729000000000001,"d":"15.73 €"}}]

{"sheet":"Umsatzbericht","index":1,"n_rows":14,"n_cols":7,"rows_kept":14}
[]
[null,"TÄGLICHE BARVERKÄUFE"]
[]
[]
[]
[]
[]
[null,"SKU/PRODUKTNUMMER","BESCHREIBUNG","DATUM","Umsatzbetrag ","Umsatzsteuer ","Summe "]
[null,90001,"Decke","2012-02-01",{"v":74.95,"d":"74.95 €"},{"v":3.7475000000000005,"d":"3.75 €"},{"v":78.6975,"d":"78.70 €"}]
[null,90002,"Kissen","2012-02-01",{"v":14.98,"d":"14.98 €"},{"v":0.7490000000000001,"d":"0.75 €"},{"v":15.729000000000001,"d":"15.73 €"}]
[null,90004,"Quadratischer Teller","2012-02-01",{"v":2.95,"d":"2.95 €"},{"v":0.14750000000000002,"d":"0.15 €"},{"v":3.0975,"d":"3.10 €"}]
[null,90005,"Runder Teller","2012-02-01",{"v":55.95,"d":"55.95 €"},{"v":2.7975000000000003,"d":"2.80 €"},{"v":58.7475,"d":"58.75 €"}]
[null,90023,"Tischtuch, rund, Durchmesser 15,24 cm","2012-02-01",{"v":34.99,"d":"34.99 €"},{"v":1.7495000000000003,"d":"1.75 €"},{"v":36.7395,"d":"36.74 €"}]
[null,"Gesamtsumme",null,null,{"v":183.82000000000002,"d":"183.82 €"},{"v":9.191000000000003,"d":"9.19 €"},{"v":193.011,"d":"193.01 €"}]

{"sheet":"Bestand","index":2,"n_rows":31,"n_cols":3,"rows_kept":31}
[]
[null,"TÄGLICHE BARVERKÄUFE"]
[]
[]
[]
[]
[]
[null,"SKU/PRODUKTNUMMER","BESCHREIBUNG"]
[null,90001,"Decke"]
[null,90002,"Kissen"]
[null,90003,"Laken"]
[null,90004,"Quadratischer Teller"]
[null,90005,"Runder Teller"]
[null,90006,"Schüssel, groß"]
[null,90007,"Schüssel, klein"]
[null,90008,"Runder Teller, klein"]
[null,90009,"Gabel, klein"]
[null,90010,"Gabel, groß"]
[null,90011,"Löffel, klein"]
[null,90012,"Löffel, groß"]
[null,90013,"Buttermesser, klein"]
[null,90014,"Buttermesser, groß"]
[null,90015,"Tischtuch, 25,4 x 12,7 cm"]
[null,90016,"Tischtuch, 20,32 x 12,7 cm"]
[null,90017,"Tischtuch, 20,32 x 20,32 cm"]
[null,90018,"Tischtuch, 15,24 x 15,24 cm"]
[null,90019,"Tischtuch, 15,24 x 10,16 cm"]
[null,90020,"Tischtuch, 10,16 x 10,16 cm"]
[null,90021,"Tischtuch, rund, Durchmesser 25,4 cm"]
[null,90022,"Tischtuch, rund, Durchmesser 20,32 cm"]
[null,90023,"Tischtuch, rund, Durchmesser 15,24 cm"]