{"text_format":"3","workbook":"xlsx","n_sheets":4,"sheets":["START","PROJEKTPARAMETRE","PROJEKTOPLYSNINGER","PROJEKTTOTALER"],"not_rendered":{"charts":2,"defined_names":3,"pivot_tables":1},"read":"whole","date_system":"1900"}

{"sheet":"START","index":0,"n_rows":7,"n_cols":2,"rows_kept":7}
[null,"OM DENNE SKABELON"]
[null,"Spor projektparametre, projektoplysninger og projekttotaler i denne projektmappe til planlægning af begivenhed."]
[null,"Angiv oplysninger i regnearket Projektparametre for at opdatere kolonnediagrammer samt i regnearket Projektoplysninger. Pivottabellen i regnearket Projekttotaler opdateres automatisk."]
[null,"Udfyld Firmanavn i regnearket Parametre, så opdateres det automatisk i andre regneark."]
[null,"Bemærk!  "]
[null,"Der er yderligere vejledning at finde i kolonne A i hvert regneark i projektmappen BEGIVENHEDSPLANLÆGNING. Denne tekst er skjult med vilje. Du kan fjerne tekst ved at markere kolonne A og derefter vælge Slet. For ikke længere at skjule tekst skal du markere kolonne A og derefter ændre skriftfarven."]
{"$rows_left_out":2}
{"sheet":"PROJEKTPARAMETRE","index":1,"n_rows":19,"n_cols":9,"rows_kept":19,"merged":[[23,1,42,3]]}
[null,"Firmanavn"]
[null,"Projektsporing af begivenhedsadministration"]
[null,{"$f":"B1&\" Fortroligt\"","v":"Firmanavn Fortroligt"}]
[null,"De nedtonede celler beregnes for dig. Du behøver ikke at angive noget i dem."]
[null,"PROJEKTTYPE","KONTOADMINISTRATOR","PROJEKTLEDER","STRATEGILEDER","DESIGNSPECIALIST","PERSONALE VED BEGIVENHED","ADMINISTRATIONSMEDARBEJDERE","Total"]
[null,"Udvikling af begivenhedsstrategi",{"v":0.2,"d":"20%"},{"v":0.1,"d":"10%"},{"v":0.6,"d":"60%"},{"v":0,"d":"0%"},{"v":0,"d":"0%"},{"v":0.1,"d":"10%"},{"$f":"SUM(Parametre[[#This Row],[KONTOADMINISTRATOR]:[ADMINISTRATIONSMEDARBEJDERE]])","v":{"v":1,"d":"100%"}}]
{"$rows_left_out":14}
{"sheet":"PROJEKTOPLYSNINGER","index":2,"n_rows":10,"n_cols":23,"rows_kept":10}
[null,{"$f":"PROJEKTPARAMETRE!B1","v":"Firmanavn"}]
[null,"Projektsporing af begivenhedsadministration"]
[null,{"$f":"PROJEKTPARAMETRE!B3","v":"Firmanavn Fortroligt"}]
["Angiv oplysninger i tabellen Projektoplysninger, der starter i cellen til højre.\nINFO\nHvis du vil tilføje en række i en tabel, skal du markere cellen nederst til højre i tabellens brødtekst (ikke rækken med totaler) og trykke på Tab, eller du kan trykke på Skift+F10 der, hvor rækken skal indsættes, og vælge Indsæt | Tabelrækker ovenfor/nedenfor.\nSørg for, at alle ubrugte rækker slettes, da pivottabellen PROJEKTTOTALER bruger alle tabelcellerne, og det vil i modsat fald kunne give forkerte resultater.","PROJEKTNAVN","PROJEKTTYPE","ANSLÅET START","ANSLÅET AFSLUTNING","FAKTISK START","FAKTISK AFSLUTNING","ANSLÅET ARBEJDE","FAKTISK ARBEJDE","ANSLÅET VARIGHED","FAKTISK VARIGHED","KONTOADMINISTRATOR","PROJEKTLEDER","STRATEGILEDER","DESIGNSPECIALIST","PERSONALE VED BEGIVENHED","ADMINISTRATIONSMEDARBEJDERE","KONTOADMINISTRATOR ","PROJEKTLEDER ","STRATEGILEDER ","DESIGNSPECIALIST ","PERSONALE VED BEGIVENHED ","ADMINISTRATIONSMEDARBEJDERE "]
[null,"Projekt 1","Udvikling af begivenhedsstrategi",{"$f":"DATE(YEAR(TODAY()),6,9)","v":"2022-06-09"},{"$f":" DATE(YEAR(TODAY()),8,7)","v":"2022-08-07"},{"$f":"DATE(YEAR(TODAY()),6,29)","v":"2022-06-29"},{"$f":"DATE(YEAR(TODAY()),9,3)","v":"2022-09-03"},200,220,{"$f":"DAYS360(Projektoplysninger[[#This Row],[ANSLÅET START]],Projektoplysninger[[#This Row],[ANSLÅET AFSLUTNING]],FALSE)","v":58},{"$f":"DAYS360(Projektoplysninger[[#This Row],[FAKTISK START]],Projektoplysninger[[#This Row],[FAKTISK AFSLUTNING]],FALSE)","v":64},{"$f":"INDEX(Parametre[],MATCH(Projektoplysninger[[#This Row],[PROJEKTTYPE]],Parametre[PROJEKTTYPE],0),MATCH(Projektoplysninger[[#Headers],[KONTOADMINISTRATOR]],Parametre[#Headers],0))*INDEX(PROJEKTPARAMETRE!$B$12:$H$12,1,MATCH(Projektoplysninger[[#Headers],[KONTOADMINISTRATOR]],Parametre[#Headers],0))*Projektoplysninger[[#This Row],[ANSLÅET ARBEJDE]]","v":{"v":7200,"d":"kr. 7,200"}},{"$f":"INDEX(Parametre[],MATCH(Projektoplysninger[[#This Row],[PROJEKTTYPE]],Parametre[PROJEKTTYPE],0),MATCH(Projektoplysninger[[#Headers],[PROJEKTLEDER]],Parametre[#Headers],0))*INDEX(PROJEKTPARAMETRE!$B$12:$H$12,1,MATCH(Projektoplysninger[[#Headers],[PROJEKTLEDER]],Parametre[#Headers],0))*Projektoplysninger[[#This Row],[ANSLÅET ARBEJDE]]","v":{"v":2400,"d":"kr. 2,400"}},{"$f":"INDEX(Parametre[],MATCH(Projektoplysninger[[#This Row],[PROJEKTTYPE]],Parametre[PROJEKTTYPE],0),MATCH(Projektoplysninger[[#Headers],[STRATEGILEDER]],Parametre[#Headers],0))*INDEX(PROJEKTPARAMETRE!$B$12:$H$12,1,MATCH(Projektoplysninger[[#Headers],[STRATEGILEDER]],Parametre[#Headers],0))*Projektoplysninger[[#This Row],[ANSLÅET ARBEJDE]]","v":{"v":18000,"d":"kr. 18,000"}},{"$f":"INDEX(Parametre[],MATCH(Projektoplysninger[[#This Row],[PROJEKTTYPE]],Parametre[PROJEKTTYPE],0),MATCH(Projektoplysninger[[#Headers],[DESIGNSPECIALIST]],Parametre[#Headers],0))*INDEX(PROJEKTPARAMETRE!$B$12:$H$12,1,MATCH(Projektoplysninger[[#Headers],[DESIGNSPECIALIST]],Parametre[#Headers],0))*Projektoplysninger[[#This Row],[ANSLÅET ARBEJDE]]","v":{"v":0,"d":"kr. 0"}},{"$f":"INDEX(Parametre[],MATCH(Projektoplysninger[[#This Row],[PROJEKTTYPE]],Parametre[PROJEKTTYPE],0),MATCH(Projektoplysninger[[#Headers],[PERSONALE VED BEGIVENHED]],Parametre[#Headers],0))*INDEX(PROJEKTPARAMETRE!$B$12:$H$12,1,MATCH(Projektoplysninger[[#Headers],[PERSONALE VED BEGIVENHED]],Parametre[#Headers],0))*Projektoplysninger[[#This Row],[ANSLÅET ARBEJDE]]","v":{"v":0,"d":"kr. 0"}},{"$f":"INDEX(Parametre[],MATCH(Projektoplysninger[[#This Row],[PROJEKTTYPE]],Parametre[PROJEKTTYPE],0),MATCH(Projektoplysninger[[#Headers],[ADMINISTRATIONSMEDARBEJDERE]],Parametre[#Headers],0))*INDEX(PROJEKTPARAMETRE!$B$12:$H$12,1,MATCH(Projektoplysninger[[#Headers],[ADMINISTRATIONSMEDARBEJDERE]],Parametre[#Headers],0))*Projektoplysninger[[#This Row],[ANSLÅET ARBEJDE]]","v":{"v":1200,"d":"kr. 1,200"}},{"$f":"INDEX(Parametre[],MATCH(Projektoplysninger[[#This Row],[PROJEKTTYPE]],Parametre[PROJEKTTYPE],0),MATCH(Projektoplysninger[[#Headers],[KONTOADMINISTRATOR]],Parametre[#Headers],0))*INDEX(PROJEKTPARAMETRE!$B$12:$H$12,1,MATCH(Projektoplysninger[[#Headers],[KONTOADMINISTRATOR]],Parametre[#Headers],0))*Projektoplysninger[[#This Row],[FAKTISK ARBEJDE]]","v":{"v":7920,"d":"kr. 7,920"}},{"$f":"INDEX(Parametre[],MATCH(Projektoplysninger[[#This Row],[PROJEKTTYPE]],Parametre[PROJEKTTYPE],0),MATCH(Projektoplysninger[[#Headers],[PROJEKTLEDER]],Parametre[#Headers],0))*INDEX(PROJEKTPARAMETRE!$B$12:$H$12,1,MATCH(Projektoplysninger[[#Headers],[PROJEKTLEDER]],Parametre[#Headers],0))*Projektoplysninger[[#This Row],[FAKTISK ARBEJDE]]","v":{"v":2640,"d":"kr. 2,640"}},{"$f":"INDEX(Parametre[],MATCH(Projektoplysninger[[#This Row],[PROJEKTTYPE]],Parametre[PROJEKTTYPE],0),MATCH(Projektoplysninger[[#Headers],[STRATEGILEDER]],Parametre[#Headers],0))*INDEX(PROJEKTPARAMETRE!$B$12:$H$12,1,MATCH(Projektoplysninger[[#Headers],[STRATEGILEDER]],Parametre[#Headers],0))*Projektoplysninger[[#This Row],[FAKTISK ARBEJDE]]","v":{"v":19800,"d":"kr. 19,800"}},{"$f":"INDEX(Parametre[],MATCH(Projektoplysninger[[#This Row],[PROJEKTTYPE]],Parametre[PROJEKTTYPE],0),MATCH(Projektoplysninger[[#Headers],[DESIGNSPECIALIST]],Parametre[#Headers],0))*INDEX(PROJEKTPARAMETRE!$B$12:$H$12,1,MATCH(Projektoplysninger[[#Headers],[DESIGNSPECIALIST]],Parametre[#Headers],0))*Projektoplysninger[[#This Row],[FAKTISK ARBEJDE]]","v":{"v":0,"d":"kr. 0"}},{"$f":"INDEX(Parametre[],MATCH(Projektoplysninger[[#This Row],[PROJEKTTYPE]],Parametre[PROJEKTTYPE],0),MATCH(Projektoplysninger[[#Headers],[PERSONALE VED BEGIVENHED]],Parametre[#Headers],0))*INDEX(PROJEKTPARAMETRE!$B$12:$H$12,1,MATCH(Projektoplysninger[[#Headers],[PERSONALE VED BEGIVENHED]],Parametre[#Headers],0))*Projektoplysninger[[#This Row],[FAKTISK ARBEJDE]]","v":{"v":0,"d":"kr. 0"}},{"$f":"INDEX(Parametre[],MATCH(Projektoplysninger[[#This Row],[PROJEKTTYPE]],Parametre[PROJEKTTYPE],0),MATCH(Projektoplysninger[[#Headers],[ADMINISTRATIONSMEDARBEJDERE]],Parametre[#Headers],0))*INDEX(PROJEKTPARAMETRE!$B$12:$H$12,1,MATCH(Projektoplysninger[[#Headers],[ADMINISTRATIONSMEDARBEJDERE]],Parametre[#Headers],0))*Projektoplysninger[[#This Row],[FAKTISK ARBEJDE]]","v":{"v":1320,"d":"kr. 1,320"}}]
[null,"Projekt 2","Begivenhedsplanlægning",{"$f":"DATE(YEAR(TODAY())+1,6,25)","v":"2023-06-25"},{"$f":"DATE(YEAR(TODAY())+1,7,27)","v":"2023-07-27"},{"$f":"DATE(YEAR(TODAY()),7,15)","v":"2022-07-15"},{"$f":"DATE(YEAR(TODAY())+1,8,25)","v":"2023-08-25"},400,390,{"$f":"DAYS360(Projektoplysninger[[#This Row],[ANSLÅET START]],Projektoplysninger[[#This Row],[ANSLÅET AFSLUTNING]],FALSE)","v":32},{"$f":"DAYS360(Projektoplysninger[[#This Row],[FAKTISK START]],Projektoplysninger[[#This Row],[FAKTISK AFSLUTNING]],FALSE)","v":400},{"$f":"INDEX(Parametre[],MATCH(Projektoplysninger[[#This Row],[PROJEKTTYPE]],Parametre[PROJEKTTYPE],0),MATCH(Projektoplysninger[[#Headers],[KONTOADMINISTRATOR]],Parametre[#Headers],0))*INDEX(PROJEKTPARAMETRE!$B$12:$H$12,1,MATCH(Projektoplysninger[[#Headers],[KONTOADMINISTRATOR]],Parametre[#Headers],0))*Projektoplysninger[[#This Row],[ANSLÅET ARBEJDE]]","v":{"v":14400,"d":"kr. 14,400"}},{"$f":"INDEX(Parametre[],MATCH(Projektoplysninger[[#This Row],[PROJEKTTYPE]],Parametre[PROJEKTTYPE],0),MATCH(Projektoplysninger[[#Headers],[PROJEKTLEDER]],Parametre[#Headers],0))*INDEX(PROJEKTPARAMETRE!$B$12:$H$12,1,MATCH(Projektoplysninger[[#Headers],[PROJEKTLEDER]],Parametre[#Headers],0))*Projektoplysninger[[#This Row],[ANSLÅET ARBEJDE]]","v":{"v":24000,"d":"kr. 24,000"}},{"$f":"INDEX(Parametre[],MATCH(Projektoplysninger[[#This Row],[PROJEKTTYPE]],Parametre[PROJEKTTYPE],0),MATCH(Projektoplysninger[[#Headers],[STRATEGILEDER]],Parametre[#Headers],0))*INDEX(PROJEKTPARAMETRE!$B$12:$H$12,1,MATCH(Projektoplysninger[[#Headers],[STRATEGILEDER]],Parametre[#Headers],0))*Projektoplysninger[[#This Row],[ANSLÅET ARBEJDE]]","v":{"v":6000,"d":"kr. 6,000"}},{"$f":"INDEX(Parametre[],MATCH(Projektoplysninger[[#This Row],[PROJEKTTYPE]],Parametre[PROJEKTTYPE],0),MATCH(Projektoplysninger[[#Headers],[DESIGNSPECIALIST]],Parametre[#Headers],0))*INDEX(PROJEKTPARAMETRE!$B$12:$H$12,1,MATCH(Projektoplysninger[[#Headers],[DESIGNSPECIALIST]],Parametre[#Headers],0))*Projektoplysninger[[#This Row],[ANSLÅET ARBEJDE]]","v":{"v":4000,"d":"kr. 4,000"}},{"$f":"INDEX(Parametre[],MATCH(Projektoplysninger[[#This Row],[PROJEKTTYPE]],Parametre[PROJEKTTYPE],0),MATCH(Projektoplysninger[[#Headers],[PERSONALE VED BEGIVENHED]],Parametre[#Headers],0))*INDEX(PROJEKTPARAMETRE!$B$12:$H$12,1,MATCH(Projektoplysninger[[#Headers],[PERSONALE VED BEGIVENHED]],Parametre[#Headers],0))*Projektoplysninger[[#This Row],[ANSLÅET ARBEJDE]]","v":{"v":0,"d":"kr. 0"}},{"$f":"INDEX(Parametre[],MATCH(Projektoplysninger[[#This Row],[PROJEKTTYPE]],Parametre[PROJEKTTYPE],0),MATCH(Projektoplysninger[[#Headers],[ADMINISTRATIONSMEDARBEJDERE]],Parametre[#Headers],0))*INDEX(PROJEKTPARAMETRE!$B$12:$H$12,1,MATCH(Projektoplysninger[[#Headers],[ADMINISTRATIONSMEDARBEJDERE]],Parametre[#Headers],0))*Projektoplysninger[[#This Row],[ANSLÅET ARBEJDE]]","v":{"v":2400,"d":"kr. 2,400"}},{"$f":"INDEX(Parametre[],MATCH(Projektoplysninger[[#This Row],[PROJEKTTYPE]],Parametre[PROJEKTTYPE],0),MATCH(Projektoplysninger[[#Headers],[KONTOADMINISTRATOR]],Parametre[#Headers],0))*INDEX(PROJEKTPARAMETRE!$B$12:$H$12,1,MATCH(Projektoplysninger[[#Headers],[KONTOADMINISTRATOR]],Parametre[#Headers],0))*Projektoplysninger[[#This Row],[FAKTISK ARBEJDE]]","v":{"v":14040,"d":"kr. 14,040"}},{"$f":"INDEX(Parametre[],MATCH(Projektoplysninger[[#This Row],[PROJEKTTYPE]],Parametre[PROJEKTTYPE],0),MATCH(Projektoplysninger[[#Headers],[PROJEKTLEDER]],Parametre[#Headers],0))*INDEX(PROJEKTPARAMETRE!$B$12:$H$12,1,MATCH(Projektoplysninger[[#Headers],[PROJEKTLEDER]],Parametre[#Headers],0))*Projektoplysninger[[#This Row],[FAKTISK ARBEJDE]]","v":{"v":23400,"d":"kr. 23,400"}},{"$f":"INDEX(Parametre[],MATCH(Projektoplysninger[[#This Row],[PROJEKTTYPE]],Parametre[PROJEKTTYPE],0),MATCH(Projektoplysninger[[#Headers],[STRATEGILEDER]],Parametre[#Headers],0))*INDEX(PROJEKTPARAMETRE!$B$12:$H$12,1,MATCH(Projektoplysninger[[#Headers],[STRATEGILEDER]],Parametre[#Headers],0))*Projektoplysninger[[#This Row],[FAKTISK ARBEJDE]]","v":{"v":5850,"d":"kr. 5,850"}},{"$f":"INDEX(Parametre[],MATCH(Projektoplysninger[[#This Row],[PROJEKTTYPE]],Parametre[PROJEKTTYPE],0),MATCH(Projektoplysninger[[#Headers],[DESIGNSPECIALIST]],Parametre[#Headers],0))*INDEX(PROJEKTPARAMETRE!$B$12:$H$12,1,MATCH(Projektoplysninger[[#Headers],[DESIGNSPECIALIST]],Parametre[#Headers],0))*Projektoplysninger[[#This Row],[FAKTISK ARBEJDE]]","v":{"v":3900,"d":"kr. 3,900"}},{"$f":"INDEX(Parametre[],MATCH(Projektoplysninger[[#This Row],[PROJEKTTYPE]],Parametre[PROJEKTTYPE],0),MATCH(Projektoplysninger[[#Headers],[PERSONALE VED BEGIVENHED]],Parametre[#Headers],0))*INDEX(PROJEKTPARAMETRE!$B$12:$H$12,1,MATCH(Projektoplysninger[[#Headers],[PERSONALE VED BEGIVENHED]],Parametre[#Headers],0))*Projektoplysninger[[#This Row],[FAKTISK ARBEJDE]]","v":{"v":0,"d":"kr. 0"}},{"$f":"INDEX(Parametre[],MATCH(Projektoplysninger[[#This Row],[PROJEKTTYPE]],Parametre[PROJEKTTYPE],0),MATCH(Projektoplysninger[[#Headers],[ADMINISTRATIONSMEDARBEJDERE]],Parametre[#Headers],0))*INDEX(PROJEKTPARAMETRE!$B$12:$H$12,1,MATCH(Projektoplysninger[[#Headers],[ADMINISTRATIONSMEDARBEJDERE]],Parametre[#Headers],0))*Projektoplysninger[[#This Row],[FAKTISK ARBEJDE]]","v":{"v":2340,"d":"kr. 2,340"}}]
{"$rows_left_out":5}
{"sheet":"PROJEKTTOTALER","index":3,"n_rows":10,"n_cols":14,"rows_kept":10}
[null,{"$f":"PROJEKTPARAMETRE!B1","v":"Firmanavn"}]
[null,"Projektsporing af begivenhedsadministration"]
[null,{"$f":"PROJEKTPARAMETRE!B3","v":"Firmanavn Fortroligt"}]
["Pivottabellen, der begynder i cellen til højre, opdateres automatisk.\nINFO\nHvis du vil opdatere pivottabellen til højre, skal du markere den (en vilkårlig celle i pivottabellen), og på båndfanen PIVOTTABELVÆRKTØJER | ANALYSÉR skal du vælge Opdater, eller du kan trykke på Skift+F10 i en vilkårlig celle i pivottabellen og derefter vælge Opdater.","PROJEKTNAVN","ANSLÅET KONTOADMINISTRATOR","ANSLÅET PROJEKTLEDER","ANSLÅET STRATEGILEDER","ANSLÅET DESIGNSPECIALIST","ANSLÅET PERSONALE VED BEGIVENHED","ANSLÅET ADMINISTRATIONSMEDARBEJDERE","FAKTISK KONTOADMINISTRATOR","FAKTISK PROJEKTLEDER","FAKTISK STRATEGILEDER","FAKTISK DESIGNSPECIALIST","FAKTISK PERSONALE VED BEGIVENHED","FAKTISK ADMINISTRATIONSMEDARBEJDERE"]
[null,"Projekt 1",{"v":7200,"d":"kr. 7,200.00"},{"v":2400,"d":"kr. 2,400.00"},{"v":18000,"d":"kr. 18,000.00"},{"v":0,"d":"kr. 0.00"},{"v":0,"d":"kr. 0.00"},{"v":1200,"d":"kr. 1,200.00"},{"v":7920,"d":"kr. 7,920.00"},{"v":2640,"d":"kr. 2,640.00"},{"v":19800,"d":"kr. 19,800.00"},{"v":0,"d":"kr. 0.00"},{"v":0,"d":"kr. 0.00"},{"v":1320,"d":"kr. 1,320.00"}]
[null,"Projekt 2",{"v":14400,"d":"kr. 14,400.00"},{"v":24000,"d":"kr. 24,000.00"},{"v":6000,"d":"kr. 6,000.00"},{"v":4000,"d":"kr. 4,000.00"},{"v":0,"d":"kr. 0.00"},{"v":2400,"d":"kr. 2,400.00"},{"v":14040,"d":"kr. 14,040.00"},{"v":23400,"d":"kr. 23,400.00"},{"v":5850,"d":"kr. 5,850.00"},{"v":3900,"d":"kr. 3,900.00"},{"v":0,"d":"kr. 0.00"},{"v":2340,"d":"kr. 2,340.00"}]
{"$rows_left_out":4}