{"text_format":"3","workbook":"xlsx","n_sheets":3,"sheets":["Start","Månedligt Universitetsbudget","chart_calcs"],"not_rendered":{"charts":4,"defined_names":19},"read":"whole","date_system":"1900"}

{"sheet":"Start","index":0,"n_rows":8,"n_cols":2,"rows_kept":8}
[null,"OM DENNE SKABELON"]
[null,"Brug regnearket Månedligt Universitetsbudget til at spore indtægter, udgifter, og penge strøm."]
[null,"Angiv Månedlige Indtægter og Udgifter for at beregne Samlede Indtægter og Udgifter."]
[null,"Pengestrøm beregnes automatisk, og diagrammet Pengestrøm opdateres til dig."]
[null,"Vælg skyderen for at få indtægter-, udgifter- og penge strøm-diagrammer for en måned og år."]
[null,"Note: "]
[null,"Der er yderligere vejledning at finde i kolonne A i regnearket. Denne sms-besked er skjult med vilje. Du kan fjerne tekst ved at markere kolonne A og derefter vælge Slet. For ikke længere at skjule tekst skal du markere kolonne A og derefter ændre skriftfarven."]
[null," "]

{"sheet":"Månedligt Universitetsbudget","index":1,"n_rows":72,"n_cols":17,"rows_kept":72}
[null,"Månedligt Universitetsbudget",{"$nulls":14},{"$f":"\"\"","v":""}]
[{"$nulls":16},""]
[{"$nulls":16},""]
[null,{"$f":"chart_calcs!$D$6","v":"januar indtægt:"},null,null,{"$f":"chart_calcs!$D$7","v":"januar udgifter:"},{"$nulls":7},{"$f":"chart_calcs!$D$8","v":"januar likviditet:"},{"$nulls":3},""]
[null,{"$f":"\" \"&chart_calcs!$F$6","v":" kr. 1.225"},null,null,{"$f":"\" \"&chart_calcs!$F$7","v":" kr. 1.056"},{"$nulls":7},{"$f":"\" \"&chart_calcs!$F$8","v":" kr. 169"},{"$nulls":3},""]
[{"$nulls":16},""]
[{"$nulls":16},""]
[{"$nulls":16},""]
[{"$nulls":16},""]
[{"$nulls":16},""]
[{"$nulls":16},""]
[{"$nulls":16},""]
[{"$nulls":16},""]
[{"$nulls":16},""]
[{"$nulls":16},""]
[{"$nulls":16},""]
[{"$nulls":16},""]
[{"$nulls":16},""]
[{"$nulls":16},""]
[{"$nulls":16},""]
[]
[]
[]
[]
[]
[null,"JAN",{"$nulls":13},{"$f":"SelectedPeriod","v":"JAN "}]
[null,"Månedlig Pengebeholdning Efter Udgifter",{"$f":"FørsteMåned","v":"JAN "},{"$f":"NæsteMåned","v":"FEB "},"MAR ","APR ","MAJ ","JUN ","JUL ","AUG ","SEP ","OKT ","NOV ","DEC ","ÅR  ","% INC "]
[null,"Pengestrøm",{"$f":"C37-C72","v":169},69,192,199,204,{"v":-771,"d":"-771 "},124,154,{"v":-721,"d":"-721 "},109,34,{"v":-61,"d":"-61 "},{"$f":"SUM(C28:N28)","v":{"v":-299,"d":"-299 "}},{"$f":"INDEX($C28:$O28,,SelectedPeriodColumn)/INDEX($C$37:$O$37,,SelectedPeriodColumn)","v":{"v":0.13795918367346938,"d":"13.8%"}}]
[null,"Samlet Pengestrøm",{"$f":"SUM($C$28:C$28)","v":169},{"$f":"SUM($C$28:D$28)","v":238},{"$f":"SUM($C$28:E$28)","v":430},{"$f":"SUM($C$28:F$28)","v":629},{"$f":"SUM($C$28:G$28)","v":833},{"$f":"SUM($C$28:H$28)","v":62},{"$f":"SUM($C$28:I$28)","v":186},{"$f":"SUM($C$28:J$28)","v":340},{"$f":"SUM($C$28:K$28)","v":{"v":-381,"d":"-381 "}},{"$f":"SUM($C$28:L$28)","v":{"v":-272,"d":"-272 "}},{"$f":"SUM($C$28:M$28)","v":{"v":-238,"d":"-238 "}},{"$f":"SUM($C$28:N$28)","v":{"v":-299,"d":"-299 "}}]
[]
[null,"MÅNEDLIG INDTÆGT",{"$f":"FørsteMåned","v":"JAN "},{"$f":"NæsteMåned","v":"FEB "},"MAR ","APR ","MAJ ","JUN ","JUL ","AUG ","SEP ","OKT ","NOV ","DEC ","ÅR  ","% INC "]
[null,"Økonomisk bistand (gaver, stipendier, lån) udbetalt til dig",0,0,750,750,750,750,750,750,750,750,750,750,{"$f":"SUM(C32:N32)","v":{"v":7500,"d":"7,500"}},{"$f":"INDEX($C32:$O32,,SelectedPeriodColumn)/INDEX($C$37:$O$37,,SelectedPeriodColumn)","v":{"v":0,"d":"0.0%"}}]
[null,"Løn fra et arbejde efter skat",450,450,450,450,450,450,450,450,550,350,350,350,{"v":5200,"d":"5,200"},{"$f":"INDEX($C33:$O33,,SelectedPeriodColumn)/INDEX($C$37:$O$37,,SelectedPeriodColumn)","v":{"v":0.3673469387755102,"d":"36.7%"}}]
[null,"Finansiel hjælp fra familie",200,200,{"v":1000,"d":"1,000"},350,350,350,350,350,350,350,350,350,{"v":4550,"d":"4,550"},{"$f":"INDEX($C34:$O34,,SelectedPeriodColumn)/INDEX($C$37:$O$37,,SelectedPeriodColumn)","v":{"v":0.16326530612244897,"d":"16.3%"}}]
[null,"Hævede beløb fra opsparing",500,350,150,0,0,0,0,0,0,0,0,0,{"v":1000,"d":"1,000"},{"$f":"INDEX($C35:$O35,,SelectedPeriodColumn)/INDEX($C$37:$O$37,,SelectedPeriodColumn)","v":{"v":0.40816326530612246,"d":"40.8%"}}]
[null,"Andre (børne kundeservice, offentlig understøttelse, gaver, osv.)",75,75,75,75,75,75,75,75,75,75,75,75,900,{"$f":"INDEX($C36:$O36,,SelectedPeriodColumn)/INDEX($C$37:$O$37,,SelectedPeriodColumn)","v":{"v":0.061224489795918366,"d":"6.1%"}}]
[null,"INDTÆGTER I ALT",{"$f":"SUM(C32:C36)","v":{"v":1225,"d":"1,225"}},{"v":1075,"d":"1,075"},{"v":2425,"d":"2,425"},{"v":1625,"d":"1,625"},{"v":1625,"d":"1,625"},{"v":1625,"d":"1,625"},{"v":1625,"d":"1,625"},{"v":1625,"d":"1,625"},{"v":1725,"d":"1,725"},{"v":1525,"d":"1,525"},{"v":1525,"d":"1,525"},{"v":1525,"d":"1,525"},{"v":19150,"d":"19,150"},{"$f":"INDEX($C37:$O37,,SelectedPeriodColumn)/INDEX($C$37:$O$37,,SelectedPeriodColumn)","v":{"v":1,"d":"100.0%"}}]
[]
[null,"MÅNEDLIG UDGIFT",{"$f":"FørsteMåned","v":"JAN "},{"$f":"NæsteMåned","v":"FEB "},"MAR ","APR ","MAJ ","JUN ","JUL ","AUG ","SEP ","OKT ","NOV ","DEC ","ÅR  ","% INC "]
[null,"Rum og Tavle",{"$f":"SUM(C41:C43)","v":565},565,565,565,565,565,565,565,565,565,565,565,{"$f":"SUM(C40:N40)","v":{"v":6780,"d":"6,780"}},{"$f":"INDEX($C40:$O40,,SelectedPeriodColumn)/INDEX($C$72:$O$72,,SelectedPeriodColumn)","v":{"v":0.5350378787878788,"d":"53.5%"}}]
[null,null,315,315,315,315,315,315,315,315,315,315,315,315,{"$f":"SUM(C41:N41)","v":{"v":3780,"d":"3,780"}},{"$f":"INDEX($C41:$O41,,SelectedPeriodColumn)/INDEX($C$72:$O$72,,SelectedPeriodColumn)","v":{"v":0.29829545454545453,"d":"29.8%"}}]
[null,null,200,200,200,200,200,200,200,200,200,200,200,200,{"$f":"SUM(C42:N42)","v":{"v":2400,"d":"2,400"}},{"$f":"INDEX($C42:$O42,,SelectedPeriodColumn)/INDEX($C$72:$O$72,,SelectedPeriodColumn)","v":{"v":0.1893939393939394,"d":"18.9%"}}]
[null,null,50,50,50,50,50,50,50,50,50,50,50,50,{"$f":"SUM(C43:N43)","v":600},{"$f":"INDEX($C43:$O43,,SelectedPeriodColumn)/INDEX($C$72:$O$72,,SelectedPeriodColumn)","v":{"v":0.04734848484848485,"d":"4.7%"}}]
[]
[null,"Undervisning og Afgifter",{"$f":"SUM(C46:C47)","v":0},0,750,0,0,650,0,0,650,0,0,0,{"$f":"SUM(C45:N45)","v":{"v":2050,"d":"2,050"}},{"$f":"INDEX($C45:$O45,,SelectedPeriodColumn)/INDEX($C$72:$O$72,,SelectedPeriodColumn)","v":{"v":0,"d":"0.0%"}}]
[null,null,0,0,500,0,0,500,0,0,500,0,0,0,{"$f":"SUM(C46:N46)","v":{"v":1500,"d":"1,500"}},{"$f":"INDEX($C46:$O46,,SelectedPeriodColumn)/INDEX($C$72:$O$72,,SelectedPeriodColumn)","v":{"v":0,"d":"0.0%"}}]
[null,null,0,0,250,0,0,150,0,0,150,0,0,0,{"$f":"SUM(C47:N47)","v":550},{"$f":"INDEX($C47:$O47,,SelectedPeriodColumn)/INDEX($C$72:$O$72,,SelectedPeriodColumn)","v":{"v":0,"d":"0.0%"}}]
[]
[null,"Bøger og Forsyninger",{"$f":"SUM(C50:C51)","v":0},0,325,20,20,325,10,10,400,15,15,15,{"$f":"SUM(C49:N49)","v":{"v":1155,"d":"1,155"}},{"$f":"INDEX($C49:$O49,,SelectedPeriodColumn)/INDEX($C$72:$O$72,,SelectedPeriodColumn)","v":{"v":0,"d":"0.0%"}}]
[null,null,0,0,225,0,0,275,0,0,325,0,0,0,{"$f":"SUM(C50:N50)","v":825},{"$f":"INDEX($C50:$O50,,SelectedPeriodColumn)/INDEX($C$72:$O$72,,SelectedPeriodColumn)","v":{"v":0,"d":"0.0%"}}]
[null,null,0,0,100,20,20,50,10,10,75,15,15,15,{"$f":"SUM(C51:N51)","v":330},{"$f":"INDEX($C51:$O51,,SelectedPeriodColumn)/INDEX($C$72:$O$72,,SelectedPeriodColumn)","v":{"v":0,"d":"0.0%"}}]
[]
[null,"Transport",{"$f":"SUM(C54:C57)","v":224},174,174,219,174,174,274,219,174,174,224,269,{"$f":"SUM(C53:N53)","v":{"v":2473,"d":"2,473"}},{"$f":"INDEX($C53:$O53,,SelectedPeriodColumn)/INDEX($C$72:$O$72,,SelectedPeriodColumn)","v":{"v":0.21212121212121213,"d":"21.2%"}}]
[null,null,30,30,30,75,30,30,30,75,30,30,30,75,{"$f":"SUM(C54:N54)","v":495},{"$f":"INDEX($C54:$O54,,SelectedPeriodColumn)/INDEX($C$72:$O$72,,SelectedPeriodColumn)","v":{"v":0.028409090909090908,"d":"2.8%"}}]
[null,null,129,129,129,129,129,129,129,129,129,129,129,129,{"$f":"SUM(C55:N55)","v":{"v":1548,"d":"1,548"}},{"$f":"INDEX($C55:$O55,,SelectedPeriodColumn)/INDEX($C$72:$O$72,,SelectedPeriodColumn)","v":{"v":0.12215909090909091,"d":"12.2%"}}]
[null,null,15,15,15,15,15,15,15,15,15,15,15,15,{"$f":"SUM(C56:N56)","v":180},{"$f":"INDEX($C56:$O56,,SelectedPeriodColumn)/INDEX($C$72:$O$72,,SelectedPeriodColumn)","v":{"v":0.014204545454545454,"d":"1.4%"}}]
[null,null,50,0,0,0,0,0,100,0,0,0,50,50,{"$f":"SUM(C57:N57)","v":250},{"$f":"INDEX($C57:$O57,,SelectedPeriodColumn)/INDEX($C$72:$O$72,,SelectedPeriodColumn)","v":{"v":0.04734848484848485,"d":"4.7%"}}]
[]
[null,"Selvforvaltet",{"$f":"SUM(C60:C65)","v":69},69,169,369,419,444,419,419,394,394,419,469,{"$f":"SUM(C59:N59)","v":{"v":4053,"d":"4,053"}},{"$f":"INDEX($C59:$O59,,SelectedPeriodColumn)/INDEX($C$72:$O$72,,SelectedPeriodColumn)","v":{"v":0.06534090909090909,"d":"6.5%"}}]
[null,null,0,0,0,50,100,100,100,100,75,75,100,100,800,{"$f":"INDEX($C60:$O60,,SelectedPeriodColumn)/INDEX($C$72:$O$72,,SelectedPeriodColumn)","v":{"v":0,"d":"0.0%"}}]
[null,null,69,69,69,69,69,69,69,69,69,69,69,69,828,{"$f":"INDEX($C61:$O61,,SelectedPeriodColumn)/INDEX($C$72:$O$72,,SelectedPeriodColumn)","v":{"v":0.06534090909090909,"d":"6.5%"}}]
[null,null,0,0,0,0,0,25,0,0,0,0,0,50,75,{"$f":"INDEX($C62:$O62,,SelectedPeriodColumn)/INDEX($C$72:$O$72,,SelectedPeriodColumn)","v":{"v":0,"d":"0.0%"}}]
[null,null,0,0,100,100,100,100,100,100,100,100,100,100,{"v":1000,"d":"1,000"},{"$f":"INDEX($C63:$O63,,SelectedPeriodColumn)/INDEX($C$72:$O$72,,SelectedPeriodColumn)","v":{"v":0,"d":"0.0%"}}]
[null,null,0,0,0,50,50,50,50,50,50,50,50,50,450,{"$f":"INDEX($C64:$O64,,SelectedPeriodColumn)/INDEX($C$72:$O$72,,SelectedPeriodColumn)","v":{"v":0,"d":"0.0%"}}]
[null,null,0,0,0,100,100,100,100,100,100,100,100,100,900,{"$f":"INDEX($C65:$O65,,SelectedPeriodColumn)/INDEX($C$72:$O$72,,SelectedPeriodColumn)","v":{"v":0,"d":"0.0%"}}]
[]
[null,"Andre Udgifter",{"$f":"SUM(C68:C70)","v":198},{"$f":"SUM(D68:D70)","v":198},250,253,243,238,233,258,263,268,268,268,{"$f":"SUM(C67:N67)","v":{"v":2938,"d":"2,938"}},{"$f":"INDEX($C67:$O67,,SelectedPeriodColumn)/INDEX($C$72:$O$72,,SelectedPeriodColumn)","v":{"v":0.1875,"d":"18.8%"}}]
[null,null,123,123,123,123,123,123,123,123,123,123,123,123,{"$f":"SUM(C68:N68)","v":{"v":1476,"d":"1,476"}},{"$f":"INDEX($C68:$O68,,SelectedPeriodColumn)/INDEX($C$72:$O$72,,SelectedPeriodColumn)","v":{"v":0.11647727272727272,"d":"11.6%"}}]
[null,null,0,0,52,55,45,40,35,60,65,70,70,70,{"$f":"SUM(C69:N69)","v":562},{"$f":"INDEX($C69:$O69,,SelectedPeriodColumn)/INDEX($C$72:$O$72,,SelectedPeriodColumn)","v":{"v":0,"d":"0.0%"}}]
[null,null,75,75,75,75,75,75,75,75,75,75,75,75,{"$f":"SUM(C70:N70)","v":900},{"$f":"INDEX($C70:$O70,,SelectedPeriodColumn)/INDEX($C$72:$O$72,,SelectedPeriodColumn)","v":{"v":0.07102272727272728,"d":"7.1%"}}]
[]
[null,"UDGIFTER I ALT",{"$f":"SUM(C40,C45,C49,C53,C59,C67)","v":{"v":1056,"d":"1,056"}},{"v":1006,"d":"1,006"},{"v":2233,"d":"2,233"},{"v":1426,"d":"1,426"},{"v":1421,"d":"1,421"},{"v":2396,"d":"2,396"},{"v":1501,"d":"1,501"},{"v":1471,"d":"1,471"},{"v":2446,"d":"2,446"},{"v":1416,"d":"1,416"},{"v":1491,"d":"1,491"},{"v":1586,"d":"1,586"},{"$f":"SUM(C72:N72)","v":{"v":19449,"d":"19,449"}},{"$f":"INDEX($C72:$O72,,SelectedPeriodColumn)/INDEX($C$72:$O$72,,SelectedPeriodColumn)","v":{"v":1,"d":"100.0%"}}]

{"sheet":"chart_calcs","index":2,"n_rows":23,"n_cols":16,"rows_kept":23,"hidden":true}
["*** Dette ark skal være skjult ***"]
[]
[{"$nulls":3},{"$f":"IFERROR(LOWER(TEXT(VALUE(SelectedPeriod&\" 1\"),\"mmmm\")),\"år\")","v":"januar"}]
[]
[{"$nulls":3},"Dynamiske Diagramtitler"]
[{"$nulls":3},{"$f":"D3&\" indtægt:\"","v":"januar indtægt:"},null,{"$f":"TEXT(INDEX('Månedligt Universitetsbudget'!$C$37:$O$37,,SelectedPeriodColumn),\"kr. #.##0\")","v":"kr. 1.225"}]
[{"$nulls":3},{"$f":"D3&\" udgifter:\"","v":"januar udgifter:"},null,{"$f":"TEXT(INDEX('Månedligt Universitetsbudget'!$C$72:$O$72,,SelectedPeriodColumn),\"kr. #.##0\")","v":"kr. 1.056"}]
[{"$nulls":3},{"$f":"D3&\" likviditet:\"","v":"januar likviditet:"},{"$f":"INDEX('Månedligt Universitetsbudget'!C28:O28,ScrollBarValue)","v":169},{"$f":"TEXT(E8,\"kr. #.##0\")","v":"kr. 169"}]
[]
[]
[]
[{"$nulls":3},{"$f":"LOWER('Månedligt Universitetsbudget'!C27)","v":"jan "},{"$f":"LOWER('Månedligt Universitetsbudget'!D27)","v":"feb "},{"$f":"LOWER('Månedligt Universitetsbudget'!E27)","v":"mar "},{"$f":"LOWER('Månedligt Universitetsbudget'!F27)","v":"apr "},{"$f":"LOWER('Månedligt Universitetsbudget'!G27)","v":"maj "},{"$f":"LOWER('Månedligt Universitetsbudget'!H27)","v":"jun "},{"$f":"LOWER('Månedligt Universitetsbudget'!I27)","v":"jul "},{"$f":"LOWER('Månedligt Universitetsbudget'!J27)","v":"aug "},{"$f":"LOWER('Månedligt Universitetsbudget'!K27)","v":"sep "},{"$f":"LOWER('Månedligt Universitetsbudget'!L27)","v":"okt "},{"$f":"LOWER('Månedligt Universitetsbudget'!M27)","v":"nov "},{"$f":"LOWER('Månedligt Universitetsbudget'!N27)","v":"dec "},{"$f":"LOWER('Månedligt Universitetsbudget'!O27)","v":"år  "}]
[null,null,"Rullepanel Værdi: ",1]
[null,null,"Pengestrøms-ark: ",{"$f":"IF(_xlfn.SINGLE(SelectedPeriod)='Månedligt Universitetsbudget'!C$31,IF(_xlfn.SINGLE('Månedligt Universitetsbudget'!$C$28:$O$28)>=0,_xlfn.SINGLE('Månedligt Universitetsbudget'!$C$28:$O$28),NA()),NA())","v":69},{"$f":"IF(_xlfn.SINGLE(SelectedPeriod)='Månedligt Universitetsbudget'!D$31,IF(_xlfn.SINGLE('Månedligt Universitetsbudget'!$C$28:$O$28)>=0,_xlfn.SINGLE('Månedligt Universitetsbudget'!$C$28:$O$28),NA()),NA())","v":{"$error":"#N/A"}},{"$f":"IF(_xlfn.SINGLE(SelectedPeriod)='Månedligt Universitetsbudget'!E$31,IF(_xlfn.SINGLE('Månedligt Universitetsbudget'!$C$28:$O$28)>=0,_xlfn.SINGLE('Månedligt Universitetsbudget'!$C$28:$O$28),NA()),NA())","v":{"$error":"#N/A"}},{"$f":"IF(_xlfn.SINGLE(SelectedPeriod)='Månedligt Universitetsbudget'!F$31,IF(_xlfn.SINGLE('Månedligt Universitetsbudget'!$C$28:$O$28)>=0,_xlfn.SINGLE('Månedligt Universitetsbudget'!$C$28:$O$28),NA()),NA())","v":{"$error":"#N/A"}},{"$f":"IF(_xlfn.SINGLE(SelectedPeriod)='Månedligt Universitetsbudget'!G$31,IF(_xlfn.SINGLE('Månedligt Universitetsbudget'!$C$28:$O$28)>=0,_xlfn.SINGLE('Månedligt Universitetsbudget'!$C$28:$O$28),NA()),NA())","v":{"$error":"#N/A"}},{"$f":"IF(_xlfn.SINGLE(SelectedPeriod)='Månedligt Universitetsbudget'!H$31,IF(_xlfn.SINGLE('Månedligt Universitetsbudget'!$C$28:$O$28)>=0,_xlfn.SINGLE('Månedligt Universitetsbudget'!$C$28:$O$28),NA()),NA())","v":{"$error":"#N/A"}},{"$f":"IF(_xlfn.SINGLE(SelectedPeriod)='Månedligt Universitetsbudget'!I$31,IF(_xlfn.SINGLE('Månedligt Universitetsbudget'!$C$28:$O$28)>=0,_xlfn.SINGLE('Månedligt Universitetsbudget'!$C$28:$O$28),NA()),NA())","v":{"$error":"#N/A"}},{"$f":"IF(_xlfn.SINGLE(SelectedPeriod)='Månedligt Universitetsbudget'!J$31,IF(_xlfn.SINGLE('Månedligt Universitetsbudget'!$C$28:$O$28)>=0,_xlfn.SINGLE('Månedligt Universitetsbudget'!$C$28:$O$28),NA()),NA())","v":{"$error":"#N/A"}},{"$f":"IF(_xlfn.SINGLE(SelectedPeriod)='Månedligt Universitetsbudget'!K$31,IF(_xlfn.SINGLE('Månedligt Universitetsbudget'!$C$28:$O$28)>=0,_xlfn.SINGLE('Månedligt Universitetsbudget'!$C$28:$O$28),NA()),NA())","v":{"$error":"#N/A"}},{"$f":"IF(_xlfn.SINGLE(SelectedPeriod)='Månedligt Universitetsbudget'!L$31,IF(_xlfn.SINGLE('Månedligt Universitetsbudget'!$C$28:$O$28)>=0,_xlfn.SINGLE('Månedligt Universitetsbudget'!$C$28:$O$28),NA()),NA())","v":{"$error":"#N/A"}},{"$f":"IF(_xlfn.SINGLE(SelectedPeriod)='Månedligt Universitetsbudget'!M$31,IF(_xlfn.SINGLE('Månedligt Universitetsbudget'!$C$28:$O$28)>=0,_xlfn.SINGLE('Månedligt Universitetsbudget'!$C$28:$O$28),NA()),NA())","v":{"$error":"#N/A"}},{"$f":"IF(_xlfn.SINGLE(SelectedPeriod)='Månedligt Universitetsbudget'!N$31,IF(_xlfn.SINGLE('Månedligt Universitetsbudget'!$C$28:$O$28)>=0,_xlfn.SINGLE('Månedligt Universitetsbudget'!$C$28:$O$28),NA()),NA())","v":{"$error":"#N/A"}},{"$f":"IF(_xlfn.SINGLE(SelectedPeriod)='Månedligt Universitetsbudget'!O$31,IF(_xlfn.SINGLE('Månedligt Universitetsbudget'!$C$28:$O$28)>=0,_xlfn.SINGLE('Månedligt Universitetsbudget'!$C$28:$O$28),NA()),NA())","v":{"$error":"#N/A"}}]
[null,null,"AKKUMULERET: ",{"$f":"IF(SelectedPeriod='Månedligt Universitetsbudget'!C$31,IF('Månedligt Universitetsbudget'!$C$28:$O$28<0,'Månedligt Universitetsbudget'!$C$28:$O$28,NA()),NA())","v":{"$error":"#N/A"}},{"$f":"IF(SelectedPeriod='Månedligt Universitetsbudget'!D$31,IF('Månedligt Universitetsbudget'!$C$28:$O$28<0,'Månedligt Universitetsbudget'!$C$28:$O$28,NA()),NA())","v":{"$error":"#N/A"}},{"$f":"IF(SelectedPeriod='Månedligt Universitetsbudget'!E$31,IF('Månedligt Universitetsbudget'!$C$28:$O$28<0,'Månedligt Universitetsbudget'!$C$28:$O$28,NA()),NA())","v":{"$error":"#N/A"}},{"$f":"IF(SelectedPeriod='Månedligt Universitetsbudget'!F$31,IF('Månedligt Universitetsbudget'!$C$28:$O$28<0,'Månedligt Universitetsbudget'!$C$28:$O$28,NA()),NA())","v":{"$error":"#N/A"}},{"$f":"IF(SelectedPeriod='Månedligt Universitetsbudget'!G$31,IF('Månedligt Universitetsbudget'!$C$28:$O$28<0,'Månedligt Universitetsbudget'!$C$28:$O$28,NA()),NA())","v":{"$error":"#N/A"}},{"$f":"IF(SelectedPeriod='Månedligt Universitetsbudget'!H$31,IF('Månedligt Universitetsbudget'!$C$28:$O$28<0,'Månedligt Universitetsbudget'!$C$28:$O$28,NA()),NA())","v":{"$error":"#N/A"}},{"$f":"IF(SelectedPeriod='Månedligt Universitetsbudget'!I$31,IF('Månedligt Universitetsbudget'!$C$28:$O$28<0,'Månedligt Universitetsbudget'!$C$28:$O$28,NA()),NA())","v":{"$error":"#N/A"}},{"$f":"IF(SelectedPeriod='Månedligt Universitetsbudget'!J$31,IF('Månedligt Universitetsbudget'!$C$28:$O$28<0,'Månedligt Universitetsbudget'!$C$28:$O$28,NA()),NA())","v":{"$error":"#N/A"}},{"$f":"IF(SelectedPeriod='Månedligt Universitetsbudget'!K$31,IF('Månedligt Universitetsbudget'!$C$28:$O$28<0,'Månedligt Universitetsbudget'!$C$28:$O$28,NA()),NA())","v":{"$error":"#N/A"}},{"$f":"IF(SelectedPeriod='Månedligt Universitetsbudget'!L$31,IF('Månedligt Universitetsbudget'!$C$28:$O$28<0,'Månedligt Universitetsbudget'!$C$28:$O$28,NA()),NA())","v":{"$error":"#N/A"}},{"$f":"IF(SelectedPeriod='Månedligt Universitetsbudget'!M$31,IF('Månedligt Universitetsbudget'!$C$28:$O$28<0,'Månedligt Universitetsbudget'!$C$28:$O$28,NA()),NA())","v":{"$error":"#N/A"}},{"$f":"IF(SelectedPeriod='Månedligt Universitetsbudget'!N$31,IF('Månedligt Universitetsbudget'!$C$28:$O$28<0,'Månedligt Universitetsbudget'!$C$28:$O$28,NA()),NA())","v":{"$error":"#N/A"}},{"$f":"IF(SelectedPeriod='Månedligt Universitetsbudget'!O$31,IF('Månedligt Universitetsbudget'!$C$28:$O$28<0,'Månedligt Universitetsbudget'!$C$28:$O$28,NA()),NA())","v":{"$error":"#N/A"}}]
[]
[]
[null,null,"INDTÆGTSDIAGRAMDATA"]
[null,null,"Økonomisk bistand (gaver, stipendier, lån) udbetalt til dig",{"$f":"'Månedligt Universitetsbudget'!P32","v":{"v":0,"d":"0.0%"}}]
[null,null,"Løn fra et arbejde efter-skat",{"$f":"'Månedligt Universitetsbudget'!P33","v":{"v":0.3673469387755102,"d":"36.7%"}}]
[null,null,"Finansiel hjælp fra familie",{"$f":"'Månedligt Universitetsbudget'!P34","v":{"v":0.16326530612244897,"d":"16.3%"}}]
[null,null,"Hævede beløb fra opsparing",{"$f":"'Månedligt Universitetsbudget'!P35","v":{"v":0.40816326530612246,"d":"40.8%"}}]
[null,null,"Andre (børne kundeservice, offentlig understøttelse, gaver, osv.)",{"$f":"'Månedligt Universitetsbudget'!P36","v":{"v":0.061224489795918366,"d":"6.1%"}}]