{"text_format":"3","workbook":"xlsx","n_sheets":3,"sheets":["Dagsplan","Begivenhedsplanlægger","Tidsintervaller"],"not_rendered":{"defined_names":21},"read":"whole","date_system":"1900"}

{"sheet":"Dagsplan","index":0,"n_rows":76,"n_cols":13,"rows_kept":76,"merged":[[0,1,0,2],[1,1,5,2],[2,12,4,12],[3,7,4,7],[5,12,7,12],[6,1,8,2],[8,12,10,12],[9,7,10,7],[10,1,10,2],[11,12,13,12],[14,12,16,12],[15,7,16,7],[17,12,19,12],[18,1,18,2],[20,12,22,12],[21,7,22,7],[23,12,25,12],[24,1,24,2],[25,1,25,2],[26,7,27,7],[26,12,28,12],[29,12,31,12],[31,7,32,7],[32,12,34,12]]}
[null,"Dagsplan"]
[null,{"$f":"IFERROR(DAY(DatoVær),\"\")","v":""},null,null,"Tidspunkt",{"$f":"IFERROR(UPPER(TEXT(DATE(Årsrapport,Månedsnummer,Dagsrapport),\"d mmmm åååå\")),\"\")","v":"20 JUNE MONDAY"},null,"OVERBLIK OVER UGEN",{"$nulls":3},"NOTER/OPGAVELISTE:"]
[{"$nulls":4},"Tidspunkt","Beskrivelse",null,{"$f":"IFERROR(TEXT(DATEVALUE(DatoVær)+1,\"dddd\"),\"\")","v":""},{"$f":"IFERROR(INDEX(Begivenhedsplanlægger[],MATCH($H$6&\"|\"&ROW(A1),Begivenhedsplanlægger[ENTYDIGE VÆRDIER (BEREGNET)],0),2),\"\")","v":""},{"$f":"IFERROR(INDEX(Begivenhedsplanlægger[],MATCH($H$6&\"|\"&ROW(A1),Begivenhedsplanlægger[ENTYDIGE VÆRDIER (BEREGNET)],0),3),\"\")","v":""},null,null,"Hent tøj til rensning"]
[{"$nulls":4},{"$f":"Tidsintervaller!E3","v":"06:00:00"},{"$f":"IFERROR(INDEX(Begivenhedsplanlægger[],MATCH(DATEVALUE(DatoVær)&Dagsplan[[#This Row],[Tidspunkt]],SlåTidOgDatoOp,0),3),\"\")","v":""},null,{"$f":"IFERROR(TEXT(DATEVALUE(DatoVær)+1,\"d\"),\"\")","v":""},{"$f":"IFERROR(INDEX(Begivenhedsplanlægger[],MATCH($H$6&\"|\"&ROW(A2),Begivenhedsplanlægger[ENTYDIGE VÆRDIER (BEREGNET)],0),2),\"\")","v":""},{"$f":"IFERROR(INDEX(Begivenhedsplanlægger[],MATCH($H$6&\"|\"&ROW(A2),Begivenhedsplanlægger[ENTYDIGE VÆRDIER (BEREGNET)],0),3),\"\")","v":""}]
[{"$nulls":4},{"$f":"Tidsintervaller!E4","v":"06:15:00"},{"$f":"IFERROR(INDEX(Begivenhedsplanlægger[],MATCH(DATEVALUE(DatoVær)&Dagsplan[[#This Row],[Tidspunkt]],SlåTidOgDatoOp,0),3),\"\")","v":""},null,null,{"$f":"IFERROR(INDEX(Begivenhedsplanlægger[],MATCH($H$6&\"|\"&ROW(A3),Begivenhedsplanlægger[ENTYDIGE VÆRDIER (BEREGNET)],0),2),\"\")","v":""},{"$f":"IFERROR(INDEX(Begivenhedsplanlægger[],MATCH($H$6&\"|\"&ROW(A3),Begivenhedsplanlægger[ENTYDIGE VÆRDIER (BEREGNET)],0),3),\"\")","v":""}]
[{"$nulls":4},{"$f":"Tidsintervaller!E5","v":"06:30:00"},{"$f":"IFERROR(INDEX(Begivenhedsplanlægger[],MATCH(DATEVALUE(DatoVær)&Dagsplan[[#This Row],[Tidspunkt]],SlåTidOgDatoOp,0),3),\"\")","v":""},null,{"$f":"IFERROR(DatoVær+1,\"\")","v":""},{"$f":"IFERROR(INDEX(Begivenhedsplanlægger[],MATCH($H$6&\"|\"&ROW(A4),Begivenhedsplanlægger[ENTYDIGE VÆRDIER (BEREGNET)],0),2),\"\")","v":""},{"$f":"IFERROR(INDEX(Begivenhedsplanlægger[],MATCH($H$6&\"|\"&ROW(A4),Begivenhedsplanlægger[ENTYDIGE VÆRDIER (BEREGNET)],0),3),\"\")","v":""},null,null,"Kontakt kabel-tv-udbyderen"]
[null,{"$f":"IFERROR(TEXT(DatoVær,\"dddd\"),\"\")","v":"20 JUNE MONDAY"},null,null,{"$f":"Tidsintervaller!E6","v":"06:45:00"},{"$f":"IFERROR(INDEX(Begivenhedsplanlægger[],MATCH(DATEVALUE(DatoVær)&Dagsplan[[#This Row],[Tidspunkt]],SlåTidOgDatoOp,0),3),\"\")","v":""},null,null,{"$f":"IFERROR(INDEX(Begivenhedsplanlægger[],MATCH($H$6&\"|\"&ROW(A5),Begivenhedsplanlægger[ENTYDIGE VÆRDIER (BEREGNET)],0),2),\"\")","v":""},{"$f":"IFERROR(INDEX(Begivenhedsplanlægger[],MATCH($H$6&\"|\"&ROW(A5),Begivenhedsplanlægger[ENTYDIGE VÆRDIER (BEREGNET)],0),3),\"\")","v":""}]
[{"$nulls":4},{"$f":"Tidsintervaller!E7","v":"07:00:00"},{"$f":"IFERROR(INDEX(Begivenhedsplanlægger[],MATCH(DATEVALUE(DatoVær)&Dagsplan[[#This Row],[Tidspunkt]],SlåTidOgDatoOp,0),3),\"\")","v":""},null,null,{"$f":"IFERROR(INDEX(Begivenhedsplanlægger[],MATCH($H$6&\"|\"&ROW(A6),Begivenhedsplanlægger[ENTYDIGE VÆRDIER (BEREGNET)],0),2),\"\")","v":""},{"$f":"IFERROR(INDEX(Begivenhedsplanlægger[],MATCH($H$6&\"|\"&ROW(A6),Begivenhedsplanlægger[ENTYDIGE VÆRDIER (BEREGNET)],0),3),\"\")","v":""}]
[{"$nulls":4},{"$f":"Tidsintervaller!E8","v":"07:15:00"},{"$f":"IFERROR(INDEX(Begivenhedsplanlægger[],MATCH(DATEVALUE(DatoVær)&Dagsplan[[#This Row],[Tidspunkt]],SlåTidOgDatoOp,0),3),\"\")","v":""},null,{"$f":"IFERROR(TEXT(DATEVALUE(DatoVær)+2,\"dddd\"),\"\")","v":""},{"$f":"IFERROR(INDEX(Begivenhedsplanlægger[],MATCH($H$12&\"|\"&ROW(A1),Begivenhedsplanlægger[ENTYDIGE VÆRDIER (BEREGNET)],0),2),\"\")","v":""},{"$f":"IFERROR(INDEX(Begivenhedsplanlægger[],MATCH($H$12&\"|\"&ROW(A1),Begivenhedsplanlægger[ENTYDIGE VÆRDIER (BEREGNET)],0),3),\"\")","v":""}]
[{"$nulls":4},{"$f":"Tidsintervaller!E9","v":"07:30:00"},{"$f":"IFERROR(INDEX(Begivenhedsplanlægger[],MATCH(DATEVALUE(DatoVær)&Dagsplan[[#This Row],[Tidspunkt]],SlåTidOgDatoOp,0),3),\"\")","v":""},null,{"$f":"IFERROR(TEXT(DATEVALUE(DatoVær)+2,\"d\"),\"\")","v":""},{"$f":"IFERROR(INDEX(Begivenhedsplanlægger[],MATCH($H$12&\"|\"&ROW(A2),Begivenhedsplanlægger[ENTYDIGE VÆRDIER (BEREGNET)],0),2),\"\")","v":""},{"$f":"IFERROR(INDEX(Begivenhedsplanlægger[],MATCH($H$12&\"|\"&ROW(A2),Begivenhedsplanlægger[ENTYDIGE VÆRDIER (BEREGNET)],0),3),\"\")","v":""}]
[null,"SE TIDSPLAN",null,null,{"$f":"Tidsintervaller!E10","v":"07:45:00"},{"$f":"IFERROR(INDEX(Begivenhedsplanlægger[],MATCH(DATEVALUE(DatoVær)&Dagsplan[[#This Row],[Tidspunkt]],SlåTidOgDatoOp,0),3),\"\")","v":""},null,null,{"$f":"IFERROR(INDEX(Begivenhedsplanlægger[],MATCH($H$12&\"|\"&ROW(A3),Begivenhedsplanlægger[ENTYDIGE VÆRDIER (BEREGNET)],0),2),\"\")","v":""},{"$f":"IFERROR(INDEX(Begivenhedsplanlægger[],MATCH($H$12&\"|\"&ROW(A3),Begivenhedsplanlægger[ENTYDIGE VÆRDIER (BEREGNET)],0),3),\"\")","v":""}]
[{"$nulls":4},{"$f":"Tidsintervaller!E11","v":"08:00:00"},{"$f":"IFERROR(INDEX(Begivenhedsplanlægger[],MATCH(DATEVALUE(DatoVær)&Dagsplan[[#This Row],[Tidspunkt]],SlåTidOgDatoOp,0),3),\"\")","v":""},null,{"$f":"IFERROR(DatoVær+2,\"\")","v":""},{"$f":"IFERROR(INDEX(Begivenhedsplanlægger[],MATCH($H$12&\"|\"&ROW(A4),Begivenhedsplanlægger[ENTYDIGE VÆRDIER (BEREGNET)],0),2),\"\")","v":""},{"$f":"IFERROR(INDEX(Begivenhedsplanlægger[],MATCH($H$12&\"|\"&ROW(A4),Begivenhedsplanlægger[ENTYDIGE VÆRDIER (BEREGNET)],0),3),\"\")","v":""}]
[null,"År",null,null,{"$f":"Tidsintervaller!E12","v":"08:15:00"},{"$f":"IFERROR(INDEX(Begivenhedsplanlægger[],MATCH(DATEVALUE(DatoVær)&Dagsplan[[#This Row],[Tidspunkt]],SlåTidOgDatoOp,0),3),\"\")","v":""},null,null,{"$f":"IFERROR(INDEX(Begivenhedsplanlægger[],MATCH($H$12&\"|\"&ROW(A5),Begivenhedsplanlægger[ENTYDIGE VÆRDIER (BEREGNET)],0),2),\"\")","v":""},{"$f":"IFERROR(INDEX(Begivenhedsplanlægger[],MATCH($H$12&\"|\"&ROW(A5),Begivenhedsplanlægger[ENTYDIGE VÆRDIER (BEREGNET)],0),3),\"\")","v":""}]
[{"$nulls":4},{"$f":"Tidsintervaller!E13","v":"08:30:00"},{"$f":"IFERROR(INDEX(Begivenhedsplanlægger[],MATCH(DATEVALUE(DatoVær)&Dagsplan[[#This Row],[Tidspunkt]],SlåTidOgDatoOp,0),3),\"\")","v":""},null,null,{"$f":"IFERROR(INDEX(Begivenhedsplanlægger[],MATCH($H$12&\"|\"&ROW(A6),Begivenhedsplanlægger[ENTYDIGE VÆRDIER (BEREGNET)],0),2),\"\")","v":""},{"$f":"IFERROR(INDEX(Begivenhedsplanlægger[],MATCH($H$12&\"|\"&ROW(A6),Begivenhedsplanlægger[ENTYDIGE VÆRDIER (BEREGNET)],0),3),\"\")","v":""}]
[null,"Måned",null,null,{"$f":"Tidsintervaller!E14","v":"08:45:00"},{"$f":"IFERROR(INDEX(Begivenhedsplanlægger[],MATCH(DATEVALUE(DatoVær)&Dagsplan[[#This Row],[Tidspunkt]],SlåTidOgDatoOp,0),3),\"\")","v":""},null,{"$f":"IFERROR(TEXT(DATEVALUE(DatoVær)+3,\"dddd\"),\"\")","v":""},{"$f":"IFERROR(INDEX(Begivenhedsplanlægger[],MATCH($H$18&\"|\"&ROW(A1),Begivenhedsplanlægger[ENTYDIGE VÆRDIER (BEREGNET)],0),2),\"\")","v":""},{"$f":"IFERROR(INDEX(Begivenhedsplanlægger[],MATCH($H$18&\"|\"&ROW(A1),Begivenhedsplanlægger[ENTYDIGE VÆRDIER (BEREGNET)],0),3),\"\")","v":""}]
[{"$nulls":4},{"$f":"Tidsintervaller!E15","v":"09:00:00"},{"$f":"IFERROR(INDEX(Begivenhedsplanlægger[],MATCH(DATEVALUE(DatoVær)&Dagsplan[[#This Row],[Tidspunkt]],SlåTidOgDatoOp,0),3),\"\")","v":""},null,{"$f":"IFERROR(TEXT(DATEVALUE(DatoVær)+3,\"d\"),\"\")","v":""},{"$f":"IFERROR(INDEX(Begivenhedsplanlægger[],MATCH($H$18&\"|\"&ROW(A2),Begivenhedsplanlægger[ENTYDIGE VÆRDIER (BEREGNET)],0),2),\"\")","v":""},{"$f":"IFERROR(INDEX(Begivenhedsplanlægger[],MATCH($H$18&\"|\"&ROW(A2),Begivenhedsplanlægger[ENTYDIGE VÆRDIER (BEREGNET)],0),3),\"\")","v":""}]
[null,"Dag",null,null,{"$f":"Tidsintervaller!E16","v":"09:15:00"},{"$f":"IFERROR(INDEX(Begivenhedsplanlægger[],MATCH(DATEVALUE(DatoVær)&Dagsplan[[#This Row],[Tidspunkt]],SlåTidOgDatoOp,0),3),\"\")","v":""},null,null,{"$f":"IFERROR(INDEX(Begivenhedsplanlægger[],MATCH($H$18&\"|\"&ROW(A3),Begivenhedsplanlægger[ENTYDIGE VÆRDIER (BEREGNET)],0),2),\"\")","v":""},{"$f":"IFERROR(INDEX(Begivenhedsplanlægger[],MATCH($H$18&\"|\"&ROW(A3),Begivenhedsplanlægger[ENTYDIGE VÆRDIER (BEREGNET)],0),3),\"\")","v":""}]
[{"$nulls":4},{"$f":"Tidsintervaller!E17","v":"09:30:00"},{"$f":"IFERROR(INDEX(Begivenhedsplanlægger[],MATCH(DATEVALUE(DatoVær)&Dagsplan[[#This Row],[Tidspunkt]],SlåTidOgDatoOp,0),3),\"\")","v":""},null,{"$f":"IFERROR(DatoVær+3,\"\")","v":""},{"$f":"IFERROR(INDEX(Begivenhedsplanlægger[],MATCH($H$18&\"|\"&ROW(A4),Begivenhedsplanlægger[ENTYDIGE VÆRDIER (BEREGNET)],0),2),\"\")","v":""},{"$f":"IFERROR(INDEX(Begivenhedsplanlægger[],MATCH($H$18&\"|\"&ROW(A4),Begivenhedsplanlægger[ENTYDIGE VÆRDIER (BEREGNET)],0),3),\"\")","v":""}]
[null,"REDIGER TIDSPLAN",null,null,{"$f":"Tidsintervaller!E18","v":"09:45:00"},{"$f":"IFERROR(INDEX(Begivenhedsplanlægger[],MATCH(DATEVALUE(DatoVær)&Dagsplan[[#This Row],[Tidspunkt]],SlåTidOgDatoOp,0),3),\"\")","v":""},null,null,{"$f":"IFERROR(INDEX(Begivenhedsplanlægger[],MATCH($H$18&\"|\"&ROW(A5),Begivenhedsplanlægger[ENTYDIGE VÆRDIER (BEREGNET)],0),2),\"\")","v":""},{"$f":"IFERROR(INDEX(Begivenhedsplanlægger[],MATCH($H$18&\"|\"&ROW(A5),Begivenhedsplanlægger[ENTYDIGE VÆRDIER (BEREGNET)],0),3),\"\")","v":""}]
[{"$nulls":4},{"$f":"Tidsintervaller!E19","v":"10:00:00"},{"$f":"IFERROR(INDEX(Begivenhedsplanlægger[],MATCH(DATEVALUE(DatoVær)&Dagsplan[[#This Row],[Tidspunkt]],SlåTidOgDatoOp,0),3),\"\")","v":""},null,null,{"$f":"IFERROR(INDEX(Begivenhedsplanlægger[],MATCH($H$18&\"|\"&ROW(A6),Begivenhedsplanlægger[ENTYDIGE VÆRDIER (BEREGNET)],0),2),\"\")","v":""},{"$f":"IFERROR(INDEX(Begivenhedsplanlægger[],MATCH($H$18&\"|\"&ROW(A6),Begivenhedsplanlægger[ENTYDIGE VÆRDIER (BEREGNET)],0),3),\"\")","v":""}]
[null,"Vælg for at redigere tidsintervaller",null,null,{"$f":"Tidsintervaller!E20","v":"10:15:00"},{"$f":"IFERROR(INDEX(Begivenhedsplanlægger[],MATCH(DATEVALUE(DatoVær)&Dagsplan[[#This Row],[Tidspunkt]],SlåTidOgDatoOp,0),3),\"\")","v":""},null,{"$f":"IFERROR(TEXT(DATEVALUE(DatoVær)+4,\"dddd\"),\"\")","v":""},{"$f":"IFERROR(INDEX(Begivenhedsplanlægger[],MATCH($H$24&\"|\"&ROW(A1),Begivenhedsplanlægger[ENTYDIGE VÆRDIER (BEREGNET)],0),2),\"\")","v":""},{"$f":"IFERROR(INDEX(Begivenhedsplanlægger[],MATCH($H$24&\"|\"&ROW(A1),Begivenhedsplanlægger[ENTYDIGE VÆRDIER (BEREGNET)],0),3),\"\")","v":""}]
[{"$nulls":4},{"$f":"Tidsintervaller!E21","v":"10:30:00"},{"$f":"IFERROR(INDEX(Begivenhedsplanlægger[],MATCH(DATEVALUE(DatoVær)&Dagsplan[[#This Row],[Tidspunkt]],SlåTidOgDatoOp,0),3),\"\")","v":""},null,{"$f":"IFERROR(TEXT(DATEVALUE(DatoVær)+4,\"d\"),\"\")","v":""},{"$f":"IFERROR(INDEX(Begivenhedsplanlægger[],MATCH($H$24&\"|\"&ROW(A2),Begivenhedsplanlægger[ENTYDIGE VÆRDIER (BEREGNET)],0),2),\"\")","v":""},{"$f":"IFERROR(INDEX(Begivenhedsplanlægger[],MATCH($H$24&\"|\"&ROW(A2),Begivenhedsplanlægger[ENTYDIGE VÆRDIER (BEREGNET)],0),3),\"\")","v":""}]
[null,"Vælg for at tilføje en ny begivenhed",null,null,{"$f":"Tidsintervaller!E22","v":"10:45:00"},{"$f":"IFERROR(INDEX(Begivenhedsplanlægger[],MATCH(DATEVALUE(DatoVær)&Dagsplan[[#This Row],[Tidspunkt]],SlåTidOgDatoOp,0),3),\"\")","v":""},null,null,{"$f":"IFERROR(INDEX(Begivenhedsplanlægger[],MATCH($H$24&\"|\"&ROW(A3),Begivenhedsplanlægger[ENTYDIGE VÆRDIER (BEREGNET)],0),2),\"\")","v":""},{"$f":"IFERROR(INDEX(Begivenhedsplanlægger[],MATCH($H$24&\"|\"&ROW(A3),Begivenhedsplanlægger[ENTYDIGE VÆRDIER (BEREGNET)],0),3),\"\")","v":""}]
[{"$nulls":4},{"$f":"Tidsintervaller!E23","v":"11:00:00"},{"$f":"IFERROR(INDEX(Begivenhedsplanlægger[],MATCH(DATEVALUE(DatoVær)&Dagsplan[[#This Row],[Tidspunkt]],SlåTidOgDatoOp,0),3),\"\")","v":""},null,{"$f":"IFERROR(DatoVær+4,\"\")","v":""},{"$f":"IFERROR(INDEX(Begivenhedsplanlægger[],MATCH($H$24&\"|\"&ROW(A4),Begivenhedsplanlægger[ENTYDIGE VÆRDIER (BEREGNET)],0),2),\"\")","v":""},{"$f":"IFERROR(INDEX(Begivenhedsplanlægger[],MATCH($H$24&\"|\"&ROW(A4),Begivenhedsplanlægger[ENTYDIGE VÆRDIER (BEREGNET)],0),3),\"\")","v":""}]
[null,"FREMHÆV I TIDSPLAN:",null,null,{"$f":"Tidsintervaller!E24","v":"11:15:00"},{"$f":"IFERROR(INDEX(Begivenhedsplanlægger[],MATCH(DATEVALUE(DatoVær)&Dagsplan[[#This Row],[Tidspunkt]],SlåTidOgDatoOp,0),3),\"\")","v":""},null,null,{"$f":"IFERROR(INDEX(Begivenhedsplanlægger[],MATCH($H$24&\"|\"&ROW(A5),Begivenhedsplanlægger[ENTYDIGE VÆRDIER (BEREGNET)],0),2),\"\")","v":""},{"$f":"IFERROR(INDEX(Begivenhedsplanlægger[],MATCH($H$24&\"|\"&ROW(A5),Begivenhedsplanlægger[ENTYDIGE VÆRDIER (BEREGNET)],0),3),\"\")","v":""}]
[null,"Pause",null,null,{"$f":"Tidsintervaller!E25","v":"11:30:00"},{"$f":"IFERROR(INDEX(Begivenhedsplanlægger[],MATCH(DATEVALUE(DatoVær)&Dagsplan[[#This Row],[Tidspunkt]],SlåTidOgDatoOp,0),3),\"\")","v":""},null,{"$f":"IFERROR(TEXT(DATEVALUE(DatoVær)+5,\"dddd\"),\"\")","v":""},{"$f":"IFERROR(INDEX(Begivenhedsplanlægger[],MATCH($H$29&\"|\"&ROW(A1),Begivenhedsplanlægger[ENTYDIGE VÆRDIER (BEREGNET)],0),2),\"\")","v":""},{"$f":"IFERROR(INDEX(Begivenhedsplanlægger[],MATCH($H$29&\"|\"&ROW(A1),Begivenhedsplanlægger[ENTYDIGE VÆRDIER (BEREGNET)],0),3),\"\")","v":""}]
[{"$nulls":4},{"$f":"Tidsintervaller!E26","v":"11:45:00"},{"$f":"IFERROR(INDEX(Begivenhedsplanlægger[],MATCH(DATEVALUE(DatoVær)&Dagsplan[[#This Row],[Tidspunkt]],SlåTidOgDatoOp,0),3),\"\")","v":""},null,{"$f":"IFERROR(TEXT(DATEVALUE(DatoVær)+5,\"d\"),\"\")","v":""},{"$f":"IFERROR(INDEX(Begivenhedsplanlægger[],MATCH($H$29&\"|\"&ROW(#REF!),#REF!,0),2),\"\")","v":""},{"$f":"IFERROR(INDEX(Begivenhedsplanlægger[],MATCH($H$29&\"|\"&ROW(A2),Begivenhedsplanlægger[ENTYDIGE VÆRDIER (BEREGNET)],0),3),\"\")","v":""}]
[{"$nulls":4},{"$f":"Tidsintervaller!E27","v":"12:00:00"},{"$f":"IFERROR(INDEX(Begivenhedsplanlægger[],MATCH(DATEVALUE(DatoVær)&Dagsplan[[#This Row],[Tidspunkt]],SlåTidOgDatoOp,0),3),\"\")","v":""},null,null,{"$f":"IFERROR(INDEX(Begivenhedsplanlægger[],MATCH($H$29&\"|\"&ROW(A2),Begivenhedsplanlægger[ENTYDIGE VÆRDIER (BEREGNET)],0),2),\"\")","v":""},{"$f":"IFERROR(INDEX(Begivenhedsplanlægger[],MATCH($H$29&\"|\"&ROW(A3),Begivenhedsplanlægger[ENTYDIGE VÆRDIER (BEREGNET)],0),3),\"\")","v":""}]
[{"$nulls":4},{"$f":"Tidsintervaller!E28","v":"12:15:00"},{"$f":"IFERROR(INDEX(Begivenhedsplanlægger[],MATCH(DATEVALUE(DatoVær)&Dagsplan[[#This Row],[Tidspunkt]],SlåTidOgDatoOp,0),3),\"\")","v":""},null,{"$f":"IFERROR(DatoVær+5,\"\")","v":""},{"$f":"IFERROR(INDEX(Begivenhedsplanlægger[],MATCH($H$29&\"|\"&ROW(A3),Begivenhedsplanlægger[ENTYDIGE VÆRDIER (BEREGNET)],0),2),\"\")","v":""},{"$f":"IFERROR(INDEX(Begivenhedsplanlægger[],MATCH($H$29&\"|\"&ROW(A4),Begivenhedsplanlægger[ENTYDIGE VÆRDIER (BEREGNET)],0),3),\"\")","v":""}]
[{"$nulls":4},{"$f":"Tidsintervaller!E29","v":"12:30:00"},{"$f":"IFERROR(INDEX(Begivenhedsplanlægger[],MATCH(DATEVALUE(DatoVær)&Dagsplan[[#This Row],[Tidspunkt]],SlåTidOgDatoOp,0),3),\"\")","v":""},null,null,{"$f":"IFERROR(INDEX(Begivenhedsplanlægger[],MATCH($H$29&\"|\"&ROW(A4),Begivenhedsplanlægger[ENTYDIGE VÆRDIER (BEREGNET)],0),2),\"\")","v":""},{"$f":"IFERROR(INDEX(Begivenhedsplanlægger[],MATCH($H$29&\"|\"&ROW(A5),Begivenhedsplanlægger[ENTYDIGE VÆRDIER (BEREGNET)],0),3),\"\")","v":""}]
[{"$nulls":4},{"$f":"Tidsintervaller!E30","v":"12:45:00"},{"$f":"IFERROR(INDEX(Begivenhedsplanlægger[],MATCH(DATEVALUE(DatoVær)&Dagsplan[[#This Row],[Tidspunkt]],SlåTidOgDatoOp,0),3),\"\")","v":""},null,{"$f":"IFERROR(TEXT(DATEVALUE(DatoVær)+6,\"dddd\"),\"\")","v":""},{"$f":"IFERROR(INDEX(Begivenhedsplanlægger[],MATCH($H$34&\"|\"&ROW(A1),Begivenhedsplanlægger[ENTYDIGE VÆRDIER (BEREGNET)],0),2),\"\")","v":""},{"$f":"IFERROR(INDEX(Begivenhedsplanlægger[],MATCH($H$34&\"|\"&ROW(A1),Begivenhedsplanlægger[ENTYDIGE VÆRDIER (BEREGNET)],0),3),\"\")","v":""}]
[{"$nulls":4},{"$f":"Tidsintervaller!E31","v":"13:00:00"},{"$f":"IFERROR(INDEX(Begivenhedsplanlægger[],MATCH(DATEVALUE(DatoVær)&Dagsplan[[#This Row],[Tidspunkt]],SlåTidOgDatoOp,0),3),\"\")","v":""},null,{"$f":"IFERROR(TEXT(DATEVALUE(DatoVær)+6,\"d\"),\"\")","v":""},{"$f":"IFERROR(INDEX(Begivenhedsplanlægger[],MATCH($H$34&\"|\"&ROW(A2),Begivenhedsplanlægger[ENTYDIGE VÆRDIER (BEREGNET)],0),2),\"\")","v":""},{"$f":"IFERROR(INDEX(Begivenhedsplanlægger[],MATCH($H$34&\"|\"&ROW(A2),Begivenhedsplanlægger[ENTYDIGE VÆRDIER (BEREGNET)],0),3),\"\")","v":""}]
[{"$nulls":4},{"$f":"Tidsintervaller!E32","v":"13:15:00"},{"$f":"IFERROR(INDEX(Begivenhedsplanlægger[],MATCH(DATEVALUE(DatoVær)&Dagsplan[[#This Row],[Tidspunkt]],SlåTidOgDatoOp,0),3),\"\")","v":""},null,null,{"$f":"IFERROR(INDEX(Begivenhedsplanlægger[],MATCH($H$34&\"|\"&ROW(A3),Begivenhedsplanlægger[ENTYDIGE VÆRDIER (BEREGNET)],0),2),\"\")","v":""},{"$f":"IFERROR(INDEX(Begivenhedsplanlægger[],MATCH($H$34&\"|\"&ROW(A3),Begivenhedsplanlægger[ENTYDIGE VÆRDIER (BEREGNET)],0),3),\"\")","v":""}]
[{"$nulls":4},{"$f":"Tidsintervaller!E33","v":"13:30:00"},{"$f":"IFERROR(INDEX(Begivenhedsplanlægger[],MATCH(DATEVALUE(DatoVær)&Dagsplan[[#This Row],[Tidspunkt]],SlåTidOgDatoOp,0),3),\"\")","v":""},null,{"$f":"IFERROR(DatoVær+6,\"\")","v":""},{"$f":"IFERROR(INDEX(Begivenhedsplanlægger[],MATCH($H$34&\"|\"&ROW(A4),Begivenhedsplanlægger[ENTYDIGE VÆRDIER (BEREGNET)],0),2),\"\")","v":""},{"$f":"IFERROR(INDEX(Begivenhedsplanlægger[],MATCH($H$34&\"|\"&ROW(A4),Begivenhedsplanlægger[ENTYDIGE VÆRDIER (BEREGNET)],0),3),\"\")","v":""}]
[{"$nulls":4},{"$f":"Tidsintervaller!E34","v":"13:45:00"},{"$f":"IFERROR(INDEX(Begivenhedsplanlægger[],MATCH(DATEVALUE(DatoVær)&Dagsplan[[#This Row],[Tidspunkt]],SlåTidOgDatoOp,0),3),\"\")","v":""},null,null,{"$f":"IFERROR(INDEX(Begivenhedsplanlægger[],MATCH($H$34&\"|\"&ROW(A5),Begivenhedsplanlægger[ENTYDIGE VÆRDIER (BEREGNET)],0),2),\"\")","v":""},{"$f":"IFERROR(INDEX(Begivenhedsplanlægger[],MATCH($H$34&\"|\"&ROW(A5),Begivenhedsplanlægger[ENTYDIGE VÆRDIER (BEREGNET)],0),3),\"\")","v":""}]
[{"$nulls":4},{"$f":"Tidsintervaller!E35","v":"14:00:00"},{"$f":"IFERROR(INDEX(Begivenhedsplanlægger[],MATCH(DATEVALUE(DatoVær)&Dagsplan[[#This Row],[Tidspunkt]],SlåTidOgDatoOp,0),3),\"\")","v":""}]
[{"$nulls":4},{"$f":"Tidsintervaller!E36","v":"14:15:00"},{"$f":"IFERROR(INDEX(Begivenhedsplanlægger[],MATCH(DATEVALUE(DatoVær)&Dagsplan[[#This Row],[Tidspunkt]],SlåTidOgDatoOp,0),3),\"\")","v":""}]
[{"$nulls":4},{"$f":"Tidsintervaller!E37","v":"14:30:00"},{"$f":"IFERROR(INDEX(Begivenhedsplanlægger[],MATCH(DATEVALUE(DatoVær)&Dagsplan[[#This Row],[Tidspunkt]],SlåTidOgDatoOp,0),3),\"\")","v":""}]
[{"$nulls":4},{"$f":"Tidsintervaller!E38","v":"14:45:00"},{"$f":"IFERROR(INDEX(Begivenhedsplanlægger[],MATCH(DATEVALUE(DatoVær)&Dagsplan[[#This Row],[Tidspunkt]],SlåTidOgDatoOp,0),3),\"\")","v":""}]
[{"$nulls":4},{"$f":"Tidsintervaller!E39","v":"15:00:00"},{"$f":"IFERROR(INDEX(Begivenhedsplanlægger[],MATCH(DATEVALUE(DatoVær)&Dagsplan[[#This Row],[Tidspunkt]],SlåTidOgDatoOp,0),3),\"\")","v":""}]
{"$rows_left_out":37}
{"sheet":"Begivenhedsplanlægger","index":1,"n_rows":15,"n_cols":8,"rows_kept":15,"merged":[[0,1,0,2],[1,1,4,2],[5,1,6,2],[7,1,7,2]]}
[null,"Begivenhedsplanlægger"]
[null,{"$f":"DAY(DatoVær)","v":{"$error":"#VALUE!"}},null,null,"DATO","TIDSPUNKT","BESKRIVELSE","ENTYDIGE VÆRDIER (BEREGNET)"]
[{"$nulls":4},{"$f":"TODAY()","v":"2022-06-20"},"06:00:00","Stå op",{"$f":"Begivenhedsplanlægger[[#This Row],[DATO]]&\"|\"&COUNTIF($E$3:E3,E3)","v":"44732|1"}]
[{"$nulls":4},{"$f":"TODAY()","v":"2022-06-20"},"06:30:00","Brusebad",{"$f":"Begivenhedsplanlægger[[#This Row],[DATO]]&\"|\"&COUNTIF($E$3:E4,E4)","v":"44732|2"}]
[{"$nulls":4},"2022-06-20","07:30:00","Tag på arbejde",{"$f":"Begivenhedsplanlægger[[#This Row],[DATO]]&\"|\"&COUNTIF($E$3:E5,E5)","v":"44732|3"}]
[null,{"$f":"TEXT(DatoVær,\"dddd\")","v":"20 JUNE MONDAY"},null,null,"2022-06-20","08:00:00","Start vagt",{"$f":"Begivenhedsplanlægger[[#This Row],[DATO]]&\"|\"&COUNTIF($E$3:E6,E6)","v":"44732|4"}]
[{"$nulls":4},"2022-06-20","10:00:00","Pause",{"$f":"Begivenhedsplanlægger[[#This Row],[DATO]]&\"|\"&COUNTIF($E$3:E7,E7)","v":"44732|5"}]
[null,{"$f":"DatoVær","v":"20 JUNE MONDAY"},null,null,"2022-06-20","12:00:00","Frokost",{"$f":"Begivenhedsplanlægger[[#This Row],[DATO]]&\"|\"&COUNTIF($E$3:E8,E8)","v":"44732|6"}]
[{"$nulls":4},"2022-06-20","13:00:00","Tilbage til arbejdet",{"$f":"Begivenhedsplanlægger[[#This Row],[DATO]]&\"|\"&COUNTIF($E$3:E9,E9)","v":"44732|7"}]
[null,"Vælg for at redigere tidsintervaller",null,null,"2022-06-20","13:30:00","Kontakt virksomheden",{"$f":"Begivenhedsplanlægger[[#This Row],[DATO]]&\"|\"&COUNTIF($E$3:E10,E10)","v":"44732|8"}]
[{"$nulls":4},"2022-06-20","15:00:00","Pause",{"$f":"Begivenhedsplanlægger[[#This Row],[DATO]]&\"|\"&COUNTIF($E$3:E11,E11)","v":"44732|9"}]
[null,"Vælg for at få vist Dagsplan",null,null,"2022-06-20","17:00:00","Hjem",{"$f":"Begivenhedsplanlægger[[#This Row],[DATO]]&\"|\"&COUNTIF($E$3:E12,E12)","v":"44732|10"}]
[{"$nulls":4},"2022-06-20","18:00:00","Fodboldtræning",{"$f":"Begivenhedsplanlægger[[#This Row],[DATO]]&\"|\"&COUNTIF($E$3:E13,E13)","v":"44732|11"}]
[{"$nulls":4},{"$f":"TODAY()+1","v":"2022-06-21"},"06:30:00","Morgenmad",{"$f":"Begivenhedsplanlægger[[#This Row],[DATO]]&\"|\"&COUNTIF($E$3:E15,E14)","v":"44733|2"}]
[{"$nulls":4},{"$f":"TODAY()+1","v":"2022-06-21"},"07:30:00","Tag på arbejde",{"$f":"Begivenhedsplanlægger[[#This Row],[DATO]]&\"|\"&COUNTIF($E$3:E15,E15)","v":"44733|2"}]

{"sheet":"Tidsintervaller","index":2,"n_rows":75,"n_cols":5,"rows_kept":75,"merged":[[0,1,0,2],[1,1,1,2],[9,1,9,2]]}
[null,"Tidsintervaller"]
[null,"REDIGER TIDSTABEL",null,null,"Tidspunkt"]
[{"$nulls":4},{"$f":"Start_tidspunkt","v":"06:00:00"}]
[null,"Starttidspunkt","06:00:00",null,{"$f":"IFERROR(IF($E3+Forøgelse>Sluttidspunkt,\"\",$E3+Forøgelse),\"\")","v":"06:15:00"}]
[{"$nulls":4},"06:30:00"]
[null,"Interval","15 MIN",null,"06:45:00"]
[{"$nulls":4},"07:00:00"]
[null,"Sluttidspunkt","21:00:00",null,"07:15:00"]
[{"$nulls":4},"07:30:00"]
[null,"SE TIDSPLAN",null,null,"07:45:00"]
[{"$nulls":4},"08:00:00"]
[null,"Vælg for at få vist Dagsplan",null,null,"08:15:00"]
[{"$nulls":4},"08:30:00"]
[null,"Vælg for at tilføje en ny begivenhed",null,null,"08:45:00"]
[{"$nulls":4},"09:00:00"]
[{"$nulls":4},"09:15:00"]
[{"$nulls":4},"09:30:00"]
[{"$nulls":4},"09:45:00"]
[{"$nulls":4},"10:00:00"]
[{"$nulls":4},"10:15:00"]
[{"$nulls":4},"10:30:00"]
[{"$nulls":4},"10:45:00"]
[{"$nulls":4},"11:00:00"]
[{"$nulls":4},"11:15:00"]
[{"$nulls":4},"11:30:00"]
[{"$nulls":4},"11:45:00"]
[{"$nulls":4},"12:00:00"]
[{"$nulls":4},"12:15:00"]
[{"$nulls":4},"12:30:00"]
[{"$nulls":4},"12:45:00"]
[{"$nulls":4},"13:00:00"]
[{"$nulls":4},"13:15:00"]
[{"$nulls":4},"13:30:00"]
[{"$nulls":4},"13:45:00"]
[{"$nulls":4},"14:00:00"]
[{"$nulls":4},{"$f":"IFERROR(IF($E35+Forøgelse>Sluttidspunkt,\"\",$E35+Forøgelse),\"\")","v":"14:15:00"}]
[{"$nulls":4},"14:30:00"]
[{"$nulls":4},"14:45:00"]
[{"$nulls":4},"15:00:00"]
[{"$nulls":4},"15:15:00"]
{"$rows_left_out":35}