{"text_format":"3","workbook":"xlsx","n_sheets":4,"sheets":["ZAČÁTEK","PARAMETRY PROJEKTU","PODROBNOSTI O PROJEKTU","CELKOVÉ ČÁSTKY PROJEKTU"],"not_rendered":{"charts":2,"defined_names":3,"pivot_tables":1},"read":"whole","date_system":"1900"}

{"sheet":"ZAČÁTEK","index":0,"n_rows":7,"n_cols":2,"rows_kept":7}
[null,"O TÉTO ŠABLONĚ"]
[null,"V tomto sešitu pro sledování plánování události můžete sledovat parametry, podrobnosti a celkové částky projektu."]
[null,"Když zadáte informace do listu Parametry projektu, aktualizují se sloupcové grafy a na listu Podrobnosti projektu. Kontingenční tabulka na listu Celkové částky projektu se aktualizuje automaticky."]
[null,"Když zadáte název společnosti na listu Parametry, automaticky se doplní do dalších listů."]
[null,"Poznámka:  "]
[null,"Další pokyny jsou k dispozici ve sloupci A na každém listu v sešitu SLEDOVÁNÍ PLÁNOVÁNÍ UDÁLOSTI. Tento text je záměrně skrytý. Pokud ho chcete odebrat, vyberte sloupec A a stiskněte klávesu DELETE. Pokud ho chcete zobrazit, vyberte sloupec A a změňte barvu písma."]
{"$rows_left_out":2}
{"sheet":"PARAMETRY PROJEKTU","index":1,"n_rows":19,"n_cols":9,"rows_kept":19,"merged":[[23,1,42,3]]}
[null,"Název společnosti"]
[null,"Sledování projektu správy události"]
[null,{"$f":"B1&\" Důvěrné\"","v":"Název společnosti Důvěrné"}]
[null,"Šedě vybarvené buňky se vám počítají automaticky. Nic do nich nezadáváte."]
[null,"TYP PROJEKTU","ACCOUNT MANAŽER","PROJEKTOVÝ MANAŽER","STRATEGICKÝ MANAŽER","SPECIALISTA NA DESIGN","OBSLUHA AKCE","ADMINISTRATIVNÍ PRACOVNÍCI","Celkem"]
[null,"Vývoj strategie události",{"v":0.2,"d":"20%"},{"v":0.1,"d":"10%"},{"v":0.6,"d":"60%"},{"v":0,"d":"0%"},{"v":0,"d":"0%"},{"v":0.1,"d":"10%"},{"$f":"SUM(Parametry[[#This Row],[ACCOUNT MANAŽER]:[ADMINISTRATIVNÍ PRACOVNÍCI]])","v":{"v":1,"d":"100%"}}]
{"$rows_left_out":14}
{"sheet":"PODROBNOSTI O PROJEKTU","index":2,"n_rows":10,"n_cols":23,"rows_kept":10}
[null,{"$f":"'PARAMETRY PROJEKTU'!B1","v":"Název společnosti"}]
[null,"Sledování projektu správy události"]
[null,{"$f":"'PARAMETRY PROJEKTU'!B3","v":"Název společnosti Důvěrné"}]
["Zadejte informace do tabulky Podrobnosti projektu, která začíná v buňce napravo.\nINFORMACE\nPokud chcete přidat řádek do tabulky vpravo, vyberte pravou dolní buňku v těle tabulky (ne na řádku celkových částek) a stiskněte klávesu Tab. Další možností je kliknout do tabulky na místo, kam chcete vložit řádek, stisknout SHIFT+F10 a vybrat příkaz Vložit | Řádky tabulky nad/pod.\nNezapomeňte odstranit všechny nepoužité řádky, protože kontingenční tabulka CELKOVÉ ČÁSTKY PROJEKTU používá všechny buňky tabulky, takže kdybyste to neudělali, zobrazovala by nesprávné výsledky.","NÁZEV PROJEKTU","TYP PROJEKTU","PŘEDPOKLÁDANÉ ZAHÁJENÍ","PŘEDPOKLÁDANÉ DOKONČENÍ","SKUTEČNÉ ZAHÁJENÍ","SKUTEČNÉ DOKONČENÍ","PŘEDPOKLÁDANÁ PRÁCE","SKUTEČNÁ PRÁCE","PŘEDPOKLÁDANÁ DOBA TRVÁNÍ","SKUTEČNÁ DOBA TRVÁNÍ","ACCOUNT MANAŽER","PROJEKTOVÝ MANAŽER","STRATEGICKÝ MANAŽER","SPECIALISTA NA DESIGN","OBSLUHA AKCE","ADMINISTRATIVNÍ PRACOVNÍCI","ACCOUNT MANAŽER ","PROJEKTOVÝ MANAŽER ","STRATEGICKÝ MANAŽER ","SPECIALISTA NA DESIGN ","OBSLUHA AKCE ","ADMINISTRATIVNÍ PRACOVNÍCI "]
[null,"Projekt 1","Vývoj strategie události",{"$f":"DATE(YEAR(TODAY()),6,9)","v":"2022-06-09"},{"$f":" DATE(YEAR(TODAY()),8,7)","v":"2022-08-07"},{"$f":"DATE(YEAR(TODAY()),6,29)","v":"2022-06-29"},{"$f":"DATE(YEAR(TODAY()),9,3)","v":"2022-09-03"},200,220,{"$f":"DAYS360(PodrobnostiOProjektu[[#This Row],[PŘEDPOKLÁDANÉ ZAHÁJENÍ]],PodrobnostiOProjektu[[#This Row],[PŘEDPOKLÁDANÉ DOKONČENÍ]],FALSE)","v":58},{"$f":"DAYS360(PodrobnostiOProjektu[[#This Row],[SKUTEČNÉ ZAHÁJENÍ]],PodrobnostiOProjektu[[#This Row],[SKUTEČNÉ DOKONČENÍ]],FALSE)","v":64},{"$f":"INDEX(Parametry[],MATCH(PodrobnostiOProjektu[[#This Row],[TYP PROJEKTU]],Parametry[TYP PROJEKTU],0),MATCH(PodrobnostiOProjektu[[#Headers],[ACCOUNT MANAŽER]],Parametry[#Headers],0))*INDEX('PARAMETRY PROJEKTU'!$B$12:$H$12,1,MATCH(PodrobnostiOProjektu[[#Headers],[ACCOUNT MANAŽER]],Parametry[#Headers],0))*PodrobnostiOProjektu[[#This Row],[PŘEDPOKLÁDANÁ PRÁCE]]","v":{"v":7200,"d":"7,200 Kč"}},{"$f":"INDEX(Parametry[],MATCH(PodrobnostiOProjektu[[#This Row],[TYP PROJEKTU]],Parametry[TYP PROJEKTU],0),MATCH(PodrobnostiOProjektu[[#Headers],[PROJEKTOVÝ MANAŽER]],Parametry[#Headers],0))*INDEX('PARAMETRY PROJEKTU'!$B$12:$H$12,1,MATCH(PodrobnostiOProjektu[[#Headers],[PROJEKTOVÝ MANAŽER]],Parametry[#Headers],0))*PodrobnostiOProjektu[[#This Row],[PŘEDPOKLÁDANÁ PRÁCE]]","v":{"v":2400,"d":"2,400 Kč"}},{"$f":"INDEX(Parametry[],MATCH(PodrobnostiOProjektu[[#This Row],[TYP PROJEKTU]],Parametry[TYP PROJEKTU],0),MATCH(PodrobnostiOProjektu[[#Headers],[STRATEGICKÝ MANAŽER]],Parametry[#Headers],0))*INDEX('PARAMETRY PROJEKTU'!$B$12:$H$12,1,MATCH(PodrobnostiOProjektu[[#Headers],[STRATEGICKÝ MANAŽER]],Parametry[#Headers],0))*PodrobnostiOProjektu[[#This Row],[PŘEDPOKLÁDANÁ PRÁCE]]","v":{"v":18000,"d":"18,000 Kč"}},{"$f":"INDEX(Parametry[],MATCH(PodrobnostiOProjektu[[#This Row],[TYP PROJEKTU]],Parametry[TYP PROJEKTU],0),MATCH(PodrobnostiOProjektu[[#Headers],[SPECIALISTA NA DESIGN]],Parametry[#Headers],0))*INDEX('PARAMETRY PROJEKTU'!$B$12:$H$12,1,MATCH(PodrobnostiOProjektu[[#Headers],[SPECIALISTA NA DESIGN]],Parametry[#Headers],0))*PodrobnostiOProjektu[[#This Row],[PŘEDPOKLÁDANÁ PRÁCE]]","v":{"v":0,"d":"0 Kč"}},{"$f":"INDEX(Parametry[],MATCH(PodrobnostiOProjektu[[#This Row],[TYP PROJEKTU]],Parametry[TYP PROJEKTU],0),MATCH(PodrobnostiOProjektu[[#Headers],[OBSLUHA AKCE]],Parametry[#Headers],0))*INDEX('PARAMETRY PROJEKTU'!$B$12:$H$12,1,MATCH(PodrobnostiOProjektu[[#Headers],[OBSLUHA AKCE]],Parametry[#Headers],0))*PodrobnostiOProjektu[[#This Row],[PŘEDPOKLÁDANÁ PRÁCE]]","v":{"v":0,"d":"0 Kč"}},{"$f":"INDEX(Parametry[],MATCH(PodrobnostiOProjektu[[#This Row],[TYP PROJEKTU]],Parametry[TYP PROJEKTU],0),MATCH(PodrobnostiOProjektu[[#Headers],[ADMINISTRATIVNÍ PRACOVNÍCI]],Parametry[#Headers],0))*INDEX('PARAMETRY PROJEKTU'!$B$12:$H$12,1,MATCH(PodrobnostiOProjektu[[#Headers],[ADMINISTRATIVNÍ PRACOVNÍCI]],Parametry[#Headers],0))*PodrobnostiOProjektu[[#This Row],[PŘEDPOKLÁDANÁ PRÁCE]]","v":{"v":1200,"d":"1,200 Kč"}},{"$f":"INDEX(Parametry[],MATCH(PodrobnostiOProjektu[[#This Row],[TYP PROJEKTU]],Parametry[TYP PROJEKTU],0),MATCH(PodrobnostiOProjektu[[#Headers],[ACCOUNT MANAŽER]],Parametry[#Headers],0))*INDEX('PARAMETRY PROJEKTU'!$B$12:$H$12,1,MATCH(PodrobnostiOProjektu[[#Headers],[ACCOUNT MANAŽER]],Parametry[#Headers],0))*PodrobnostiOProjektu[[#This Row],[SKUTEČNÁ PRÁCE]]","v":{"v":7920,"d":"7,920 Kč"}},{"$f":"INDEX(Parametry[],MATCH(PodrobnostiOProjektu[[#This Row],[TYP PROJEKTU]],Parametry[TYP PROJEKTU],0),MATCH(PodrobnostiOProjektu[[#Headers],[PROJEKTOVÝ MANAŽER]],Parametry[#Headers],0))*INDEX('PARAMETRY PROJEKTU'!$B$12:$H$12,1,MATCH(PodrobnostiOProjektu[[#Headers],[PROJEKTOVÝ MANAŽER]],Parametry[#Headers],0))*PodrobnostiOProjektu[[#This Row],[SKUTEČNÁ PRÁCE]]","v":{"v":2640,"d":"2,640 Kč"}},{"$f":"INDEX(Parametry[],MATCH(PodrobnostiOProjektu[[#This Row],[TYP PROJEKTU]],Parametry[TYP PROJEKTU],0),MATCH(PodrobnostiOProjektu[[#Headers],[STRATEGICKÝ MANAŽER]],Parametry[#Headers],0))*INDEX('PARAMETRY PROJEKTU'!$B$12:$H$12,1,MATCH(PodrobnostiOProjektu[[#Headers],[STRATEGICKÝ MANAŽER]],Parametry[#Headers],0))*PodrobnostiOProjektu[[#This Row],[SKUTEČNÁ PRÁCE]]","v":{"v":19800,"d":"19,800 Kč"}},{"$f":"INDEX(Parametry[],MATCH(PodrobnostiOProjektu[[#This Row],[TYP PROJEKTU]],Parametry[TYP PROJEKTU],0),MATCH(PodrobnostiOProjektu[[#Headers],[SPECIALISTA NA DESIGN]],Parametry[#Headers],0))*INDEX('PARAMETRY PROJEKTU'!$B$12:$H$12,1,MATCH(PodrobnostiOProjektu[[#Headers],[SPECIALISTA NA DESIGN]],Parametry[#Headers],0))*PodrobnostiOProjektu[[#This Row],[SKUTEČNÁ PRÁCE]]","v":{"v":0,"d":"0 Kč"}},{"$f":"INDEX(Parametry[],MATCH(PodrobnostiOProjektu[[#This Row],[TYP PROJEKTU]],Parametry[TYP PROJEKTU],0),MATCH(PodrobnostiOProjektu[[#Headers],[OBSLUHA AKCE]],Parametry[#Headers],0))*INDEX('PARAMETRY PROJEKTU'!$B$12:$H$12,1,MATCH(PodrobnostiOProjektu[[#Headers],[OBSLUHA AKCE]],Parametry[#Headers],0))*PodrobnostiOProjektu[[#This Row],[SKUTEČNÁ PRÁCE]]","v":{"v":0,"d":"0 Kč"}},{"$f":"INDEX(Parametry[],MATCH(PodrobnostiOProjektu[[#This Row],[TYP PROJEKTU]],Parametry[TYP PROJEKTU],0),MATCH(PodrobnostiOProjektu[[#Headers],[ADMINISTRATIVNÍ PRACOVNÍCI]],Parametry[#Headers],0))*INDEX('PARAMETRY PROJEKTU'!$B$12:$H$12,1,MATCH(PodrobnostiOProjektu[[#Headers],[ADMINISTRATIVNÍ PRACOVNÍCI]],Parametry[#Headers],0))*PodrobnostiOProjektu[[#This Row],[SKUTEČNÁ PRÁCE]]","v":{"v":1320,"d":"1,320 Kč"}}]
[null,"Projekt 2","Plánování události",{"$f":"DATE(YEAR(TODAY())+1,6,25)","v":"2023-06-25"},{"$f":"DATE(YEAR(TODAY())+1,7,27)","v":"2023-07-27"},{"$f":"DATE(YEAR(TODAY()),7,15)","v":"2022-07-15"},{"$f":"DATE(YEAR(TODAY())+1,8,25)","v":"2023-08-25"},400,390,{"$f":"DAYS360(PodrobnostiOProjektu[[#This Row],[PŘEDPOKLÁDANÉ ZAHÁJENÍ]],PodrobnostiOProjektu[[#This Row],[PŘEDPOKLÁDANÉ DOKONČENÍ]],FALSE)","v":32},{"$f":"DAYS360(PodrobnostiOProjektu[[#This Row],[SKUTEČNÉ ZAHÁJENÍ]],PodrobnostiOProjektu[[#This Row],[SKUTEČNÉ DOKONČENÍ]],FALSE)","v":400},{"$f":"INDEX(Parametry[],MATCH(PodrobnostiOProjektu[[#This Row],[TYP PROJEKTU]],Parametry[TYP PROJEKTU],0),MATCH(PodrobnostiOProjektu[[#Headers],[ACCOUNT MANAŽER]],Parametry[#Headers],0))*INDEX('PARAMETRY PROJEKTU'!$B$12:$H$12,1,MATCH(PodrobnostiOProjektu[[#Headers],[ACCOUNT MANAŽER]],Parametry[#Headers],0))*PodrobnostiOProjektu[[#This Row],[PŘEDPOKLÁDANÁ PRÁCE]]","v":{"v":14400,"d":"14,400 Kč"}},{"$f":"INDEX(Parametry[],MATCH(PodrobnostiOProjektu[[#This Row],[TYP PROJEKTU]],Parametry[TYP PROJEKTU],0),MATCH(PodrobnostiOProjektu[[#Headers],[PROJEKTOVÝ MANAŽER]],Parametry[#Headers],0))*INDEX('PARAMETRY PROJEKTU'!$B$12:$H$12,1,MATCH(PodrobnostiOProjektu[[#Headers],[PROJEKTOVÝ MANAŽER]],Parametry[#Headers],0))*PodrobnostiOProjektu[[#This Row],[PŘEDPOKLÁDANÁ PRÁCE]]","v":{"v":24000,"d":"24,000 Kč"}},{"$f":"INDEX(Parametry[],MATCH(PodrobnostiOProjektu[[#This Row],[TYP PROJEKTU]],Parametry[TYP PROJEKTU],0),MATCH(PodrobnostiOProjektu[[#Headers],[STRATEGICKÝ MANAŽER]],Parametry[#Headers],0))*INDEX('PARAMETRY PROJEKTU'!$B$12:$H$12,1,MATCH(PodrobnostiOProjektu[[#Headers],[STRATEGICKÝ MANAŽER]],Parametry[#Headers],0))*PodrobnostiOProjektu[[#This Row],[PŘEDPOKLÁDANÁ PRÁCE]]","v":{"v":6000,"d":"6,000 Kč"}},{"$f":"INDEX(Parametry[],MATCH(PodrobnostiOProjektu[[#This Row],[TYP PROJEKTU]],Parametry[TYP PROJEKTU],0),MATCH(PodrobnostiOProjektu[[#Headers],[SPECIALISTA NA DESIGN]],Parametry[#Headers],0))*INDEX('PARAMETRY PROJEKTU'!$B$12:$H$12,1,MATCH(PodrobnostiOProjektu[[#Headers],[SPECIALISTA NA DESIGN]],Parametry[#Headers],0))*PodrobnostiOProjektu[[#This Row],[PŘEDPOKLÁDANÁ PRÁCE]]","v":{"v":4000,"d":"4,000 Kč"}},{"$f":"INDEX(Parametry[],MATCH(PodrobnostiOProjektu[[#This Row],[TYP PROJEKTU]],Parametry[TYP PROJEKTU],0),MATCH(PodrobnostiOProjektu[[#Headers],[OBSLUHA AKCE]],Parametry[#Headers],0))*INDEX('PARAMETRY PROJEKTU'!$B$12:$H$12,1,MATCH(PodrobnostiOProjektu[[#Headers],[OBSLUHA AKCE]],Parametry[#Headers],0))*PodrobnostiOProjektu[[#This Row],[PŘEDPOKLÁDANÁ PRÁCE]]","v":{"v":0,"d":"0 Kč"}},{"$f":"INDEX(Parametry[],MATCH(PodrobnostiOProjektu[[#This Row],[TYP PROJEKTU]],Parametry[TYP PROJEKTU],0),MATCH(PodrobnostiOProjektu[[#Headers],[ADMINISTRATIVNÍ PRACOVNÍCI]],Parametry[#Headers],0))*INDEX('PARAMETRY PROJEKTU'!$B$12:$H$12,1,MATCH(PodrobnostiOProjektu[[#Headers],[ADMINISTRATIVNÍ PRACOVNÍCI]],Parametry[#Headers],0))*PodrobnostiOProjektu[[#This Row],[PŘEDPOKLÁDANÁ PRÁCE]]","v":{"v":2400,"d":"2,400 Kč"}},{"$f":"INDEX(Parametry[],MATCH(PodrobnostiOProjektu[[#This Row],[TYP PROJEKTU]],Parametry[TYP PROJEKTU],0),MATCH(PodrobnostiOProjektu[[#Headers],[ACCOUNT MANAŽER]],Parametry[#Headers],0))*INDEX('PARAMETRY PROJEKTU'!$B$12:$H$12,1,MATCH(PodrobnostiOProjektu[[#Headers],[ACCOUNT MANAŽER]],Parametry[#Headers],0))*PodrobnostiOProjektu[[#This Row],[SKUTEČNÁ PRÁCE]]","v":{"v":14040,"d":"14,040 Kč"}},{"$f":"INDEX(Parametry[],MATCH(PodrobnostiOProjektu[[#This Row],[TYP PROJEKTU]],Parametry[TYP PROJEKTU],0),MATCH(PodrobnostiOProjektu[[#Headers],[PROJEKTOVÝ MANAŽER]],Parametry[#Headers],0))*INDEX('PARAMETRY PROJEKTU'!$B$12:$H$12,1,MATCH(PodrobnostiOProjektu[[#Headers],[PROJEKTOVÝ MANAŽER]],Parametry[#Headers],0))*PodrobnostiOProjektu[[#This Row],[SKUTEČNÁ PRÁCE]]","v":{"v":23400,"d":"23,400 Kč"}},{"$f":"INDEX(Parametry[],MATCH(PodrobnostiOProjektu[[#This Row],[TYP PROJEKTU]],Parametry[TYP PROJEKTU],0),MATCH(PodrobnostiOProjektu[[#Headers],[STRATEGICKÝ MANAŽER]],Parametry[#Headers],0))*INDEX('PARAMETRY PROJEKTU'!$B$12:$H$12,1,MATCH(PodrobnostiOProjektu[[#Headers],[STRATEGICKÝ MANAŽER]],Parametry[#Headers],0))*PodrobnostiOProjektu[[#This Row],[SKUTEČNÁ PRÁCE]]","v":{"v":5850,"d":"5,850 Kč"}},{"$f":"INDEX(Parametry[],MATCH(PodrobnostiOProjektu[[#This Row],[TYP PROJEKTU]],Parametry[TYP PROJEKTU],0),MATCH(PodrobnostiOProjektu[[#Headers],[SPECIALISTA NA DESIGN]],Parametry[#Headers],0))*INDEX('PARAMETRY PROJEKTU'!$B$12:$H$12,1,MATCH(PodrobnostiOProjektu[[#Headers],[SPECIALISTA NA DESIGN]],Parametry[#Headers],0))*PodrobnostiOProjektu[[#This Row],[SKUTEČNÁ PRÁCE]]","v":{"v":3900,"d":"3,900 Kč"}},{"$f":"INDEX(Parametry[],MATCH(PodrobnostiOProjektu[[#This Row],[TYP PROJEKTU]],Parametry[TYP PROJEKTU],0),MATCH(PodrobnostiOProjektu[[#Headers],[OBSLUHA AKCE]],Parametry[#Headers],0))*INDEX('PARAMETRY PROJEKTU'!$B$12:$H$12,1,MATCH(PodrobnostiOProjektu[[#Headers],[OBSLUHA AKCE]],Parametry[#Headers],0))*PodrobnostiOProjektu[[#This Row],[SKUTEČNÁ PRÁCE]]","v":{"v":0,"d":"0 Kč"}},{"$f":"INDEX(Parametry[],MATCH(PodrobnostiOProjektu[[#This Row],[TYP PROJEKTU]],Parametry[TYP PROJEKTU],0),MATCH(PodrobnostiOProjektu[[#Headers],[ADMINISTRATIVNÍ PRACOVNÍCI]],Parametry[#Headers],0))*INDEX('PARAMETRY PROJEKTU'!$B$12:$H$12,1,MATCH(PodrobnostiOProjektu[[#Headers],[ADMINISTRATIVNÍ PRACOVNÍCI]],Parametry[#Headers],0))*PodrobnostiOProjektu[[#This Row],[SKUTEČNÁ PRÁCE]]","v":{"v":2340,"d":"2,340 Kč"}}]
{"$rows_left_out":5}
{"sheet":"CELKOVÉ ČÁSTKY PROJEKTU","index":3,"n_rows":10,"n_cols":14,"rows_kept":10}
[null,{"$f":"'PARAMETRY PROJEKTU'!B1","v":"Název společnosti"}]
[null,"Sledování projektu správy události"]
[null,{"$f":"'PARAMETRY PROJEKTU'!B3","v":"Název společnosti Důvěrné"}]
["Kontingenční tabulka, která začíná v buňce napravo, se automaticky aktualizuje.\nINFORMACE\nPokud chcete aktualizovat kontingenční tabulku vpravo, vyberte ji (klikněte na libovolnou buňku v kontingenční tabulce) a na kartě NÁSTROJE KONTINGENČNÍ TABULKY | ANALÝZA vyberte Aktualizovat. Můžete také vybrat libovolnou buňku v kontingenční tabulce, stisknout SHIFT+F10 a vybrat příkaz Aktualizovat.","NÁZEV PROJEKTU","ACCOUNT MANAŽER – PŘEDPOKLAD","PROJEKTOVÝ MANAŽER – PŘEDPOKLAD","STRATEGICKÝ MANAŽER – PŘEDPOKLAD","SPECIALISTA NA DESIGN – PŘEDPOKLAD","OBSLUHA AKCE – PŘEDPOKLAD","ADMINISTRATIVNÍ PRACOVNÍCI – PŘEDPOKLAD","ACCOUNT MANAŽER – SKUTEČNOST","PROJEKTOVÝ MANAŽER – SKUTEČNOST","STRATEGICKÝ MANAŽER – SKUTEČNOST","SPECIALISTA NA DESIGN – SKUTEČNOST","OBSLUHA AKCE – SKUTEČNOST","ADMINISTRATIVNÍ PRACOVNÍCI – SKUTEČNOST"]
[null,"Projekt 1",{"v":7200,"d":"7,200.00 Kč"},{"v":2400,"d":"2,400.00 Kč"},{"v":18000,"d":"18,000.00 Kč"},{"v":0,"d":"0.00 Kč"},{"v":0,"d":"0.00 Kč"},{"v":1200,"d":"1,200.00 Kč"},{"v":7920,"d":"7,920.00 Kč"},{"v":2640,"d":"2,640.00 Kč"},{"v":19800,"d":"19,800.00 Kč"},{"v":0,"d":"0.00 Kč"},{"v":0,"d":"0.00 Kč"},{"v":1320,"d":"1,320.00 Kč"}]
[null,"Projekt 2",{"v":14400,"d":"14,400.00 Kč"},{"v":24000,"d":"24,000.00 Kč"},{"v":6000,"d":"6,000.00 Kč"},{"v":4000,"d":"4,000.00 Kč"},{"v":0,"d":"0.00 Kč"},{"v":2400,"d":"2,400.00 Kč"},{"v":14040,"d":"14,040.00 Kč"},{"v":23400,"d":"23,400.00 Kč"},{"v":5850,"d":"5,850.00 Kč"},{"v":3900,"d":"3,900.00 Kč"},{"v":0,"d":"0.00 Kč"},{"v":2340,"d":"2,340.00 Kč"}]
{"$rows_left_out":4}