{"text_format":"3","workbook":"xlsx","n_sheets":3,"sheets":["Začátek","Měsíční rozpočet na VŠ","graf_výpočty"],"not_rendered":{"charts":4,"defined_names":19},"read":"whole","date_system":"1900"}

{"sheet":"Začátek","index":0,"n_rows":8,"n_cols":2,"rows_kept":8}
[null,"INFORMACE O TÉTO ŠABLONĚ"]
[null,"Pokud chcete sledovat příjmy, výdaje a peněžní tok, můžete použít list Měsíční rozpočet na VŠ."]
[null,"Zadejte měsíční příjmy a výdaje a vypočítají se celkové příjmy a výdaje."]
[null,"Finanční tok je počítán automaticky a graf finančního toku se aktualizuje za vás."]
[null,"Grafy příjmů, výdajů a finančních toků za měsíc a rok získáte pomocí výběru posuvníku."]
[null,"Poznámka: "]
[null,"Další pokyny jsou k dispozici na listu ve sloupci A. Text těchto pokynů je záměrně skrytý. Pokud ho chcete odebrat, vyberte sloupec A a stiskněte klávesu DELETE. Pokud tento text chcete zobrazit, vyberte sloupec A a změňte barvu písma."]
[null," "]

{"sheet":"Měsíční rozpočet na VŠ","index":1,"n_rows":72,"n_cols":17,"rows_kept":72}
[null,"Měsíční rozpočet na VŠ",{"$nulls":14},{"$f":"\"\"","v":""}]
[{"$nulls":16},""]
[{"$nulls":16},""]
[null,{"$f":"graf_výpočty!$D$6","v":"leden Příjmy:"},null,null,{"$f":"graf_výpočty!$D$7","v":"leden Výdaje:"},{"$nulls":7},{"$f":"graf_výpočty!$D$8","v":"leden Peněžní tok:"},{"$nulls":3},""]
[null,{"$f":"\" \"&graf_výpočty!$F$6","v":" 1 225 Kč"},null,null,{"$f":"\" \"&graf_výpočty!$F$7","v":" 1 056 Kč"},{"$nulls":7},{"$f":"\" \"&graf_výpočty!$F$8","v":" 169 Kč"},{"$nulls":3},""]
[{"$nulls":16},""]
[{"$nulls":16},""]
[{"$nulls":16},""]
[{"$nulls":16},""]
[{"$nulls":16},""]
[{"$nulls":16},""]
[{"$nulls":16},""]
[{"$nulls":16},""]
[{"$nulls":16},""]
[{"$nulls":16},""]
[{"$nulls":16},""]
[{"$nulls":16},""]
[{"$nulls":16},""]
[{"$nulls":16},""]
[{"$nulls":16},""]
[]
[]
[]
[]
[null,"LEDEN"]
[{"$nulls":15},{"$f":"VybranéObdobí","v":"LEDEN "}]
[null,"Měsíční hotovost po výdajích",{"$f":"PrvníMěsíc","v":"LEDEN "},{"$f":"DalšíMěsíc","v":"ÚNOR "},"BŘEZEN ","DUBEN ","KVĚTEN ","ČERVEN ","ČERVENEC ","SRPEN ","ZÁŘÍ ","ŘÍJEN ","LISTOPAD ","PROSINEC ","ROK  ","% INC "]
[null,"Finanční tok",{"$f":"C37-C72","v":169},69,192,199,204,{"v":-771,"d":"-771 "},124,154,{"v":-721,"d":"-721 "},109,34,{"v":-61,"d":"-61 "},{"$f":"SUM(C28:N28)","v":{"v":-299,"d":"-299 "}},{"$f":"INDEX($C28:$O28,,SloupecVybranéhoObdobí)/INDEX($C$37:$O$37,,SloupecVybranéhoObdobí)","v":{"v":0.13795918367346938,"d":"13.8%"}}]
[null,"Kumulativní finanční tok",{"$f":"SUM($C$28:C$28)","v":169},{"$f":"SUM($C$28:D$28)","v":238},{"$f":"SUM($C$28:E$28)","v":430},{"$f":"SUM($C$28:F$28)","v":629},{"$f":"SUM($C$28:G$28)","v":833},{"$f":"SUM($C$28:H$28)","v":62},{"$f":"SUM($C$28:I$28)","v":186},{"$f":"SUM($C$28:J$28)","v":340},{"$f":"SUM($C$28:K$28)","v":{"v":-381,"d":"-381 "}},{"$f":"SUM($C$28:L$28)","v":{"v":-272,"d":"-272 "}},{"$f":"SUM($C$28:M$28)","v":{"v":-238,"d":"-238 "}},{"$f":"SUM($C$28:N$28)","v":{"v":-299,"d":"-299 "}}]
[]
[null,"MĚSÍČNÍ PŘÍJMY",{"$f":"PrvníMěsíc","v":"LEDEN "},{"$f":"DalšíMěsíc","v":"ÚNOR "},"BŘEZEN ","DUBEN ","KVĚTEN ","ČERVEN ","ČERVENEC ","SRPEN ","ZÁŘÍ ","ŘÍJEN ","LISTOPAD ","PROSINEC ","ROK  ","% INC "]
[null,"Finanční pomoc (granty, stipendia, půjčky) zaplacená vám",0,0,750,750,750,750,750,750,750,750,750,750,{"$f":"SUM(C32:N32)","v":{"v":7500,"d":"7,500"}},{"$f":"INDEX($C32:$O32,,SloupecVybranéhoObdobí)/INDEX($C$37:$O$37,,SloupecVybranéhoObdobí)","v":{"v":0,"d":"0.0%"}}]
[null,"Mzdy ze zaměstnání po zdanění",450,450,450,450,450,450,450,450,550,350,350,350,{"v":5200,"d":"5,200"},{"$f":"INDEX($C33:$O33,,SloupecVybranéhoObdobí)/INDEX($C$37:$O$37,,SloupecVybranéhoObdobí)","v":{"v":0.3673469387755102,"d":"36.7%"}}]
[null,"Finanční pomoc od rodiny",200,200,{"v":1000,"d":"1,000"},350,350,350,350,350,350,350,350,350,{"v":4550,"d":"4,550"},{"$f":"INDEX($C34:$O34,,SloupecVybranéhoObdobí)/INDEX($C$37:$O$37,,SloupecVybranéhoObdobí)","v":{"v":0.16326530612244897,"d":"16.3%"}}]
[null,"Výběry z úspor",500,350,150,0,0,0,0,0,0,0,0,0,{"v":1000,"d":"1,000"},{"$f":"INDEX($C35:$O35,,SloupecVybranéhoObdobí)/INDEX($C$37:$O$37,,SloupecVybranéhoObdobí)","v":{"v":0.40816326530612246,"d":"40.8%"}}]
[null,"Jiné (výživné, veřejná podpora, dárky, atd.)",75,75,75,75,75,75,75,75,75,75,75,75,900,{"$f":"INDEX($C36:$O36,,SloupecVybranéhoObdobí)/INDEX($C$37:$O$37,,SloupecVybranéhoObdobí)","v":{"v":0.061224489795918366,"d":"6.1%"}}]
[null,"CELKOVÉ PŘÍJMY",{"$f":"SUM(C32:C36)","v":{"v":1225,"d":"1,225"}},{"v":1075,"d":"1,075"},{"v":2425,"d":"2,425"},{"v":1625,"d":"1,625"},{"v":1625,"d":"1,625"},{"v":1625,"d":"1,625"},{"v":1625,"d":"1,625"},{"v":1625,"d":"1,625"},{"v":1725,"d":"1,725"},{"v":1525,"d":"1,525"},{"v":1525,"d":"1,525"},{"v":1525,"d":"1,525"},{"v":19150,"d":"19,150"},{"$f":"INDEX($C37:$O37,,SloupecVybranéhoObdobí)/INDEX($C$37:$O$37,,SloupecVybranéhoObdobí)","v":{"v":1,"d":"100.0%"}}]
[]
[null,"Měsíční výdaje",{"$f":"PrvníMěsíc","v":"LEDEN "},{"$f":"DalšíMěsíc","v":"ÚNOR "},"BŘEZEN ","DUBEN ","KVĚTEN ","ČERVEN ","ČERVENEC ","SRPEN ","ZÁŘÍ ","ŘÍJEN ","LISTOPAD ","PROSINEC ","ROK  ","% INC "]
[null,"Ubytování a stravování",{"$f":"SUM(C41:C43)","v":565},565,565,565,565,565,565,565,565,565,565,565,{"$f":"SUM(C40:N40)","v":{"v":6780,"d":"6,780"}},{"$f":"INDEX($C40:$O40,,SloupecVybranéhoObdobí)/INDEX($C$72:$O$72,,SloupecVybranéhoObdobí)","v":{"v":0.5350378787878788,"d":"53.5%"}}]
[null,null,315,315,315,315,315,315,315,315,315,315,315,315,{"$f":"SUM(C41:N41)","v":{"v":3780,"d":"3,780"}},{"$f":"INDEX($C41:$O41,,SloupecVybranéhoObdobí)/INDEX($C$72:$O$72,,SloupecVybranéhoObdobí)","v":{"v":0.29829545454545453,"d":"29.8%"}}]
[null,null,200,200,200,200,200,200,200,200,200,200,200,200,{"$f":"SUM(C42:N42)","v":{"v":2400,"d":"2,400"}},{"$f":"INDEX($C42:$O42,,SloupecVybranéhoObdobí)/INDEX($C$72:$O$72,,SloupecVybranéhoObdobí)","v":{"v":0.1893939393939394,"d":"18.9%"}}]
[null,null,50,50,50,50,50,50,50,50,50,50,50,50,{"$f":"SUM(C43:N43)","v":600},{"$f":"INDEX($C43:$O43,,SloupecVybranéhoObdobí)/INDEX($C$72:$O$72,,SloupecVybranéhoObdobí)","v":{"v":0.04734848484848485,"d":"4.7%"}}]
[]
[null,"Školné a poplatky",{"$f":"SUM(C46:C47)","v":0},0,750,0,0,650,0,0,650,0,0,0,{"$f":"SUM(C45:N45)","v":{"v":2050,"d":"2,050"}},{"$f":"INDEX($C45:$O45,,SloupecVybranéhoObdobí)/INDEX($C$72:$O$72,,SloupecVybranéhoObdobí)","v":{"v":0,"d":"0.0%"}}]
[null,null,0,0,500,0,0,500,0,0,500,0,0,0,{"$f":"SUM(C46:N46)","v":{"v":1500,"d":"1,500"}},{"$f":"INDEX($C46:$O46,,SloupecVybranéhoObdobí)/INDEX($C$72:$O$72,,SloupecVybranéhoObdobí)","v":{"v":0,"d":"0.0%"}}]
[null,null,0,0,250,0,0,150,0,0,150,0,0,0,{"$f":"SUM(C47:N47)","v":550},{"$f":"INDEX($C47:$O47,,SloupecVybranéhoObdobí)/INDEX($C$72:$O$72,,SloupecVybranéhoObdobí)","v":{"v":0,"d":"0.0%"}}]
[]
[null,"Knihy a potřeby",{"$f":"SUM(C50:C51)","v":0},0,325,20,20,325,10,10,400,15,15,15,{"$f":"SUM(C49:N49)","v":{"v":1155,"d":"1,155"}},{"$f":"INDEX($C49:$O49,,SloupecVybranéhoObdobí)/INDEX($C$72:$O$72,,SloupecVybranéhoObdobí)","v":{"v":0,"d":"0.0%"}}]
[null,null,0,0,225,0,0,275,0,0,325,0,0,0,{"$f":"SUM(C50:N50)","v":825},{"$f":"INDEX($C50:$O50,,SloupecVybranéhoObdobí)/INDEX($C$72:$O$72,,SloupecVybranéhoObdobí)","v":{"v":0,"d":"0.0%"}}]
[null,null,0,0,100,20,20,50,10,10,75,15,15,15,{"$f":"SUM(C51:N51)","v":330},{"$f":"INDEX($C51:$O51,,SloupecVybranéhoObdobí)/INDEX($C$72:$O$72,,SloupecVybranéhoObdobí)","v":{"v":0,"d":"0.0%"}}]
[]
[null,"Doprava",{"$f":"SUM(C54:C57)","v":224},174,174,219,174,174,274,219,174,174,224,269,{"$f":"SUM(C53:N53)","v":{"v":2473,"d":"2,473"}},{"$f":"INDEX($C53:$O53,,SloupecVybranéhoObdobí)/INDEX($C$72:$O$72,,SloupecVybranéhoObdobí)","v":{"v":0.21212121212121213,"d":"21.2%"}}]
[null,null,30,30,30,75,30,30,30,75,30,30,30,75,{"$f":"SUM(C54:N54)","v":495},{"$f":"INDEX($C54:$O54,,SloupecVybranéhoObdobí)/INDEX($C$72:$O$72,,SloupecVybranéhoObdobí)","v":{"v":0.028409090909090908,"d":"2.8%"}}]
[null,null,129,129,129,129,129,129,129,129,129,129,129,129,{"$f":"SUM(C55:N55)","v":{"v":1548,"d":"1,548"}},{"$f":"INDEX($C55:$O55,,SloupecVybranéhoObdobí)/INDEX($C$72:$O$72,,SloupecVybranéhoObdobí)","v":{"v":0.12215909090909091,"d":"12.2%"}}]
[null,null,15,15,15,15,15,15,15,15,15,15,15,15,{"$f":"SUM(C56:N56)","v":180},{"$f":"INDEX($C56:$O56,,SloupecVybranéhoObdobí)/INDEX($C$72:$O$72,,SloupecVybranéhoObdobí)","v":{"v":0.014204545454545454,"d":"1.4%"}}]
[null,null,50,0,0,0,0,0,100,0,0,0,50,50,{"$f":"SUM(C57:N57)","v":250},{"$f":"INDEX($C57:$O57,,SloupecVybranéhoObdobí)/INDEX($C$72:$O$72,,SloupecVybranéhoObdobí)","v":{"v":0.04734848484848485,"d":"4.7%"}}]
[]
[null,"Volná útrata",{"$f":"SUM(C60:C65)","v":69},69,169,369,419,444,419,419,394,394,419,469,{"$f":"SUM(C59:N59)","v":{"v":4053,"d":"4,053"}},{"$f":"INDEX($C59:$O59,,SloupecVybranéhoObdobí)/INDEX($C$72:$O$72,,SloupecVybranéhoObdobí)","v":{"v":0.06534090909090909,"d":"6.5%"}}]
[null,null,0,0,0,50,100,100,100,100,75,75,100,100,800,{"$f":"INDEX($C60:$O60,,SloupecVybranéhoObdobí)/INDEX($C$72:$O$72,,SloupecVybranéhoObdobí)","v":{"v":0,"d":"0.0%"}}]
[null,null,69,69,69,69,69,69,69,69,69,69,69,69,828,{"$f":"INDEX($C61:$O61,,SloupecVybranéhoObdobí)/INDEX($C$72:$O$72,,SloupecVybranéhoObdobí)","v":{"v":0.06534090909090909,"d":"6.5%"}}]
[null,null,0,0,0,0,0,25,0,0,0,0,0,50,75,{"$f":"INDEX($C62:$O62,,SloupecVybranéhoObdobí)/INDEX($C$72:$O$72,,SloupecVybranéhoObdobí)","v":{"v":0,"d":"0.0%"}}]
[null,null,0,0,100,100,100,100,100,100,100,100,100,100,{"v":1000,"d":"1,000"},{"$f":"INDEX($C63:$O63,,SloupecVybranéhoObdobí)/INDEX($C$72:$O$72,,SloupecVybranéhoObdobí)","v":{"v":0,"d":"0.0%"}}]
[null,null,0,0,0,50,50,50,50,50,50,50,50,50,450,{"$f":"INDEX($C64:$O64,,SloupecVybranéhoObdobí)/INDEX($C$72:$O$72,,SloupecVybranéhoObdobí)","v":{"v":0,"d":"0.0%"}}]
[null,null,0,0,0,100,100,100,100,100,100,100,100,100,900,{"$f":"INDEX($C65:$O65,,SloupecVybranéhoObdobí)/INDEX($C$72:$O$72,,SloupecVybranéhoObdobí)","v":{"v":0,"d":"0.0%"}}]
[]
[null,"Jiné výdaje",{"$f":"SUM(C68:C70)","v":198},{"$f":"SUM(D68:D70)","v":198},250,253,243,238,233,258,263,268,268,268,{"$f":"SUM(C67:N67)","v":{"v":2938,"d":"2,938"}},{"$f":"INDEX($C67:$O67,,SloupecVybranéhoObdobí)/INDEX($C$72:$O$72,,SloupecVybranéhoObdobí)","v":{"v":0.1875,"d":"18.8%"}}]
[null,null,123,123,123,123,123,123,123,123,123,123,123,123,{"$f":"SUM(C68:N68)","v":{"v":1476,"d":"1,476"}},{"$f":"INDEX($C68:$O68,,SloupecVybranéhoObdobí)/INDEX($C$72:$O$72,,SloupecVybranéhoObdobí)","v":{"v":0.11647727272727272,"d":"11.6%"}}]
[null,null,0,0,52,55,45,40,35,60,65,70,70,70,{"$f":"SUM(C69:N69)","v":562},{"$f":"INDEX($C69:$O69,,SloupecVybranéhoObdobí)/INDEX($C$72:$O$72,,SloupecVybranéhoObdobí)","v":{"v":0,"d":"0.0%"}}]
[null,null,75,75,75,75,75,75,75,75,75,75,75,75,{"$f":"SUM(C70:N70)","v":900},{"$f":"INDEX($C70:$O70,,SloupecVybranéhoObdobí)/INDEX($C$72:$O$72,,SloupecVybranéhoObdobí)","v":{"v":0.07102272727272728,"d":"7.1%"}}]
[]
[null,"CELKOVÉ VÝDAJE",{"$f":"SUM(C40,C45,C49,C53,C59,C67)","v":{"v":1056,"d":"1,056"}},{"v":1006,"d":"1,006"},{"v":2233,"d":"2,233"},{"v":1426,"d":"1,426"},{"v":1421,"d":"1,421"},{"v":2396,"d":"2,396"},{"v":1501,"d":"1,501"},{"v":1471,"d":"1,471"},{"v":2446,"d":"2,446"},{"v":1416,"d":"1,416"},{"v":1491,"d":"1,491"},{"v":1586,"d":"1,586"},{"$f":"SUM(C72:N72)","v":{"v":19449,"d":"19,449"}},{"$f":"INDEX($C72:$O72,,SloupecVybranéhoObdobí)/INDEX($C$72:$O$72,,SloupecVybranéhoObdobí)","v":{"v":1,"d":"100.0%"}}]

{"sheet":"graf_výpočty","index":2,"n_rows":23,"n_cols":16,"rows_kept":23,"hidden":true}
["*** Tento list by měl zůstat SKRYTÝ.***"]
[]
[{"$nulls":3},{"$f":"IFERROR(LOWER(TEXT(VALUE(VybranéObdobí&\" 1\"),\"mmmm\")),\"rok\")","v":"leden"}]
[]
[{"$nulls":3},"Dynamické názvy grafů"]
[{"$nulls":3},{"$f":"D3&\" Příjmy:\"","v":"leden Příjmy:"},null,{"$f":"TEXT(INDEX('Měsíční rozpočet na VŠ'!$C$37:$O$37,,SloupecVybranéhoObdobí),\"# ##0 Kč\")","v":"1 225 Kč"}]
[{"$nulls":3},{"$f":"D3&\" Výdaje:\"","v":"leden Výdaje:"},null,{"$f":"TEXT(INDEX('Měsíční rozpočet na VŠ'!$C$72:$O$72,,SloupecVybranéhoObdobí),\"# ##0 Kč\")","v":"1 056 Kč"}]
[{"$nulls":3},{"$f":"D3&\" Peněžní tok:\"","v":"leden Peněžní tok:"},{"$f":"INDEX('Měsíční rozpočet na VŠ'!C28:O28,HodnotaPosuvníku)","v":169},{"$f":"TEXT(E8,\"# ##0 Kč\")","v":"169 Kč"}]
[]
[]
[]
[{"$nulls":3},{"$f":"LOWER('Měsíční rozpočet na VŠ'!C27)","v":"leden "},{"$f":"LOWER('Měsíční rozpočet na VŠ'!D27)","v":"únor "},{"$f":"LOWER('Měsíční rozpočet na VŠ'!E27)","v":"březen "},{"$f":"LOWER('Měsíční rozpočet na VŠ'!F27)","v":"duben "},{"$f":"LOWER('Měsíční rozpočet na VŠ'!G27)","v":"květen "},{"$f":"LOWER('Měsíční rozpočet na VŠ'!H27)","v":"červen "},{"$f":"LOWER('Měsíční rozpočet na VŠ'!I27)","v":"červenec "},{"$f":"LOWER('Měsíční rozpočet na VŠ'!J27)","v":"srpen "},{"$f":"LOWER('Měsíční rozpočet na VŠ'!K27)","v":"září "},{"$f":"LOWER('Měsíční rozpočet na VŠ'!L27)","v":"říjen "},{"$f":"LOWER('Měsíční rozpočet na VŠ'!M27)","v":"listopad "},{"$f":"LOWER('Měsíční rozpočet na VŠ'!N27)","v":"prosinec "},{"$f":"LOWER('Měsíční rozpočet na VŠ'!O27)","v":"rok  "}]
[null,null,"Hodnota posuvníku: ",1]
[null,null,"Graf finančního toku: ",{"$f":"IF(VybranéObdobí='Měsíční rozpočet na VŠ'!C$31,IF('Měsíční rozpočet na VŠ'!$C$28:$O$28>=0,'Měsíční rozpočet na VŠ'!$C$28:$O$28,NA()),NA())","v":69},{"$f":"IF(VybranéObdobí='Měsíční rozpočet na VŠ'!D$31,IF('Měsíční rozpočet na VŠ'!$C$28:$O$28>=0,'Měsíční rozpočet na VŠ'!$C$28:$O$28,NA()),NA())","v":{"$error":"#N/A"}},{"$f":"IF(VybranéObdobí='Měsíční rozpočet na VŠ'!E$31,IF('Měsíční rozpočet na VŠ'!$C$28:$O$28>=0,'Měsíční rozpočet na VŠ'!$C$28:$O$28,NA()),NA())","v":{"$error":"#N/A"}},{"$f":"IF(VybranéObdobí='Měsíční rozpočet na VŠ'!F$31,IF('Měsíční rozpočet na VŠ'!$C$28:$O$28>=0,'Měsíční rozpočet na VŠ'!$C$28:$O$28,NA()),NA())","v":{"$error":"#N/A"}},{"$f":"IF(VybranéObdobí='Měsíční rozpočet na VŠ'!G$31,IF('Měsíční rozpočet na VŠ'!$C$28:$O$28>=0,'Měsíční rozpočet na VŠ'!$C$28:$O$28,NA()),NA())","v":{"$error":"#N/A"}},{"$f":"IF(VybranéObdobí='Měsíční rozpočet na VŠ'!H$31,IF('Měsíční rozpočet na VŠ'!$C$28:$O$28>=0,'Měsíční rozpočet na VŠ'!$C$28:$O$28,NA()),NA())","v":{"$error":"#N/A"}},{"$f":"IF(VybranéObdobí='Měsíční rozpočet na VŠ'!I$31,IF('Měsíční rozpočet na VŠ'!$C$28:$O$28>=0,'Měsíční rozpočet na VŠ'!$C$28:$O$28,NA()),NA())","v":{"$error":"#N/A"}},{"$f":"IF(VybranéObdobí='Měsíční rozpočet na VŠ'!J$31,IF('Měsíční rozpočet na VŠ'!$C$28:$O$28>=0,'Měsíční rozpočet na VŠ'!$C$28:$O$28,NA()),NA())","v":{"$error":"#N/A"}},{"$f":"IF(VybranéObdobí='Měsíční rozpočet na VŠ'!K$31,IF('Měsíční rozpočet na VŠ'!$C$28:$O$28>=0,'Měsíční rozpočet na VŠ'!$C$28:$O$28,NA()),NA())","v":{"$error":"#N/A"}},{"$f":"IF(VybranéObdobí='Měsíční rozpočet na VŠ'!L$31,IF('Měsíční rozpočet na VŠ'!$C$28:$O$28>=0,'Měsíční rozpočet na VŠ'!$C$28:$O$28,NA()),NA())","v":{"$error":"#N/A"}},{"$f":"IF(VybranéObdobí='Měsíční rozpočet na VŠ'!M$31,IF('Měsíční rozpočet na VŠ'!$C$28:$O$28>=0,'Měsíční rozpočet na VŠ'!$C$28:$O$28,NA()),NA())","v":{"$error":"#N/A"}},{"$f":"IF(VybranéObdobí='Měsíční rozpočet na VŠ'!N$31,IF('Měsíční rozpočet na VŠ'!$C$28:$O$28>=0,'Měsíční rozpočet na VŠ'!$C$28:$O$28,NA()),NA())","v":{"$error":"#N/A"}},{"$f":"IF(VybranéObdobí='Měsíční rozpočet na VŠ'!O$31,IF('Měsíční rozpočet na VŠ'!$C$28:$O$28>=0,'Měsíční rozpočet na VŠ'!$C$28:$O$28,NA()),NA())","v":{"$error":"#N/A"}}]
[null,null,"Kumulativní: ",{"$f":"IF(VybranéObdobí='Měsíční rozpočet na VŠ'!C$31,IF('Měsíční rozpočet na VŠ'!$C$28:$O$28<0,'Měsíční rozpočet na VŠ'!$C$28:$O$28,NA()),NA())","v":{"$error":"#N/A"}},{"$f":"IF(VybranéObdobí='Měsíční rozpočet na VŠ'!D$31,IF('Měsíční rozpočet na VŠ'!$C$28:$O$28<0,'Měsíční rozpočet na VŠ'!$C$28:$O$28,NA()),NA())","v":{"$error":"#N/A"}},{"$f":"IF(VybranéObdobí='Měsíční rozpočet na VŠ'!E$31,IF('Měsíční rozpočet na VŠ'!$C$28:$O$28<0,'Měsíční rozpočet na VŠ'!$C$28:$O$28,NA()),NA())","v":{"$error":"#N/A"}},{"$f":"IF(VybranéObdobí='Měsíční rozpočet na VŠ'!F$31,IF('Měsíční rozpočet na VŠ'!$C$28:$O$28<0,'Měsíční rozpočet na VŠ'!$C$28:$O$28,NA()),NA())","v":{"$error":"#N/A"}},{"$f":"IF(VybranéObdobí='Měsíční rozpočet na VŠ'!G$31,IF('Měsíční rozpočet na VŠ'!$C$28:$O$28<0,'Měsíční rozpočet na VŠ'!$C$28:$O$28,NA()),NA())","v":{"$error":"#N/A"}},{"$f":"IF(VybranéObdobí='Měsíční rozpočet na VŠ'!H$31,IF('Měsíční rozpočet na VŠ'!$C$28:$O$28<0,'Měsíční rozpočet na VŠ'!$C$28:$O$28,NA()),NA())","v":{"$error":"#N/A"}},{"$f":"IF(VybranéObdobí='Měsíční rozpočet na VŠ'!I$31,IF('Měsíční rozpočet na VŠ'!$C$28:$O$28<0,'Měsíční rozpočet na VŠ'!$C$28:$O$28,NA()),NA())","v":{"$error":"#N/A"}},{"$f":"IF(VybranéObdobí='Měsíční rozpočet na VŠ'!J$31,IF('Měsíční rozpočet na VŠ'!$C$28:$O$28<0,'Měsíční rozpočet na VŠ'!$C$28:$O$28,NA()),NA())","v":{"$error":"#N/A"}},{"$f":"IF(VybranéObdobí='Měsíční rozpočet na VŠ'!K$31,IF('Měsíční rozpočet na VŠ'!$C$28:$O$28<0,'Měsíční rozpočet na VŠ'!$C$28:$O$28,NA()),NA())","v":{"$error":"#N/A"}},{"$f":"IF(VybranéObdobí='Měsíční rozpočet na VŠ'!L$31,IF('Měsíční rozpočet na VŠ'!$C$28:$O$28<0,'Měsíční rozpočet na VŠ'!$C$28:$O$28,NA()),NA())","v":{"$error":"#N/A"}},{"$f":"IF(VybranéObdobí='Měsíční rozpočet na VŠ'!M$31,IF('Měsíční rozpočet na VŠ'!$C$28:$O$28<0,'Měsíční rozpočet na VŠ'!$C$28:$O$28,NA()),NA())","v":{"$error":"#N/A"}},{"$f":"IF(VybranéObdobí='Měsíční rozpočet na VŠ'!N$31,IF('Měsíční rozpočet na VŠ'!$C$28:$O$28<0,'Měsíční rozpočet na VŠ'!$C$28:$O$28,NA()),NA())","v":{"$error":"#N/A"}},{"$f":"IF(VybranéObdobí='Měsíční rozpočet na VŠ'!O$31,IF('Měsíční rozpočet na VŠ'!$C$28:$O$28<0,'Měsíční rozpočet na VŠ'!$C$28:$O$28,NA()),NA())","v":{"$error":"#N/A"}}]
[]
[]
[null,null,"DATA GRAFU PŘÍJMŮ"]
[null,null,"Finanční pomoc (granty, stipendia, půjčky) zaplacená vám",{"$f":"'Měsíční rozpočet na VŠ'!P32","v":{"v":0,"d":"0.0%"}}]
[null,null,"Mzdy ze zaměstnání po zdanění",{"$f":"'Měsíční rozpočet na VŠ'!P33","v":{"v":0.3673469387755102,"d":"36.7%"}}]
[null,null,"Finanční pomoc od rodiny",{"$f":"'Měsíční rozpočet na VŠ'!P34","v":{"v":0.16326530612244897,"d":"16.3%"}}]
[null,null,"Výběry z úspor",{"$f":"'Měsíční rozpočet na VŠ'!P35","v":{"v":0.40816326530612246,"d":"40.8%"}}]
[null,null,"Jiné (výživné, veřejná podpora, dárky, atd.)",{"$f":"'Měsíční rozpočet na VŠ'!P36","v":{"v":0.061224489795918366,"d":"6.1%"}}]