{"text_format":"3","workbook":"xlsx","n_sheets":5,"sheets":["Souhrn od začátku roku","1. čtv.","2. čtv.","3. čtv.","4. čtv."],"not_rendered":{"defined_names":12},"read":"whole","date_system":"1900"}

{"sheet":"Souhrn od začátku roku","index":0,"n_rows":36,"n_cols":12,"rows_kept":36,"merged":[[3,0,3,6]]}
["Název společnosti"]
["Sledování docházky, souhrn od začátku roku"]
["Datum"]
[{"$f":"Název_společnosti","v":"Název společnosti"},{"$nulls":6},"DŮVĚRNÉ"]
["Příjmení","Jméno","Dovolená","Osobní volno","Nemoc","Rodné číslo","Pozice","Vedoucí","Datum přijetí","Komentáře","Počet dní dovolené \nza rok","Počet dní dovolené \n– zbývající"]
["Příjmení","Jméno",{"$f":"SUM('1. čtv.:4. čtv.'!C6)","v":3},{"$f":"SUM('1. čtv.:4. čtv.'!D6)","v":0},{"$f":"SUM('1. čtv.:4. čtv.'!E6)","v":1},"xxxxxx/xxxx","Nadřízený","Jméno",null,null,10,{"$f":"K6-C6","v":7}]
[null,null,{"$f":"SUM('1. čtv.:4. čtv.'!C7)","v":0},{"$f":"SUM('1. čtv.:4. čtv.'!D7)","v":0},{"$f":"SUM('1. čtv.:4. čtv.'!E7)","v":0},{"$nulls":6},{"$f":"K7-C7","v":0}]
[null,null,{"$f":"SUM('1. čtv.:4. čtv.'!C8)","v":0},{"$f":"SUM('1. čtv.:4. čtv.'!D8)","v":0},{"$f":"SUM('1. čtv.:4. čtv.'!E8)","v":0},{"$nulls":6},0]
[null,null,{"$f":"SUM('1. čtv.:4. čtv.'!C9)","v":0},{"$f":"SUM('1. čtv.:4. čtv.'!D9)","v":0},{"$f":"SUM('1. čtv.:4. čtv.'!E9)","v":0},{"$nulls":6},0]
[null,null,{"$f":"SUM('1. čtv.:4. čtv.'!C10)","v":0},{"$f":"SUM('1. čtv.:4. čtv.'!D10)","v":0},{"$f":"SUM('1. čtv.:4. čtv.'!E10)","v":0},{"$nulls":6},0]
[null,null,{"$f":"SUM('1. čtv.:4. čtv.'!C11)","v":0},{"$f":"SUM('1. čtv.:4. čtv.'!D11)","v":0},{"$f":"SUM('1. čtv.:4. čtv.'!E11)","v":0},{"$nulls":6},0]
[null,null,{"$f":"SUM('1. čtv.:4. čtv.'!C12)","v":0},{"$f":"SUM('1. čtv.:4. čtv.'!D12)","v":0},{"$f":"SUM('1. čtv.:4. čtv.'!E12)","v":0},{"$nulls":6},0]
[null,null,{"$f":"SUM('1. čtv.:4. čtv.'!C13)","v":0},{"$f":"SUM('1. čtv.:4. čtv.'!D13)","v":0},{"$f":"SUM('1. čtv.:4. čtv.'!E13)","v":0},{"$nulls":6},0]
[null,null,{"$f":"SUM('1. čtv.:4. čtv.'!C14)","v":0},{"$f":"SUM('1. čtv.:4. čtv.'!D14)","v":0},{"$f":"SUM('1. čtv.:4. čtv.'!E14)","v":0},{"$nulls":6},0]
[null,null,{"$f":"SUM('1. čtv.:4. čtv.'!C15)","v":0},{"$f":"SUM('1. čtv.:4. čtv.'!D15)","v":0},{"$f":"SUM('1. čtv.:4. čtv.'!E15)","v":0},{"$nulls":6},0]
[null,null,{"$f":"SUM('1. čtv.:4. čtv.'!C16)","v":0},{"$f":"SUM('1. čtv.:4. čtv.'!D16)","v":0},{"$f":"SUM('1. čtv.:4. čtv.'!E16)","v":0},{"$nulls":6},0]
[null,null,{"$f":"SUM('1. čtv.:4. čtv.'!C17)","v":0},{"$f":"SUM('1. čtv.:4. čtv.'!D17)","v":0},{"$f":"SUM('1. čtv.:4. čtv.'!E17)","v":0},{"$nulls":6},0]
[null,null,{"$f":"SUM('1. čtv.:4. čtv.'!C18)","v":0},{"$f":"SUM('1. čtv.:4. čtv.'!D18)","v":0},{"$f":"SUM('1. čtv.:4. čtv.'!E18)","v":0},{"$nulls":6},0]
[null,null,{"$f":"SUM('1. čtv.:4. čtv.'!C19)","v":0},{"$f":"SUM('1. čtv.:4. čtv.'!D19)","v":0},{"$f":"SUM('1. čtv.:4. čtv.'!E19)","v":0},{"$nulls":6},0]
[null,null,{"$f":"SUM('1. čtv.:4. čtv.'!C20)","v":0},{"$f":"SUM('1. čtv.:4. čtv.'!D20)","v":0},{"$f":"SUM('1. čtv.:4. čtv.'!E20)","v":0},{"$nulls":6},0]
[null,null,{"$f":"SUM('1. čtv.:4. čtv.'!C21)","v":0},{"$f":"SUM('1. čtv.:4. čtv.'!D21)","v":0},{"$f":"SUM('1. čtv.:4. čtv.'!E21)","v":0},{"$nulls":6},0]
[null,null,{"$f":"SUM('1. čtv.:4. čtv.'!C22)","v":0},{"$f":"SUM('1. čtv.:4. čtv.'!D22)","v":0},{"$f":"SUM('1. čtv.:4. čtv.'!E22)","v":0},{"$nulls":6},0]
[null,null,{"$f":"SUM('1. čtv.:4. čtv.'!C23)","v":0},{"$f":"SUM('1. čtv.:4. čtv.'!D23)","v":0},{"$f":"SUM('1. čtv.:4. čtv.'!E23)","v":0},{"$nulls":6},0]
[null,null,{"$f":"SUM('1. čtv.:4. čtv.'!C24)","v":0},{"$f":"SUM('1. čtv.:4. čtv.'!D24)","v":0},{"$f":"SUM('1. čtv.:4. čtv.'!E24)","v":0},{"$nulls":6},0]
[null,null,{"$f":"SUM('1. čtv.:4. čtv.'!C25)","v":0},{"$f":"SUM('1. čtv.:4. čtv.'!D25)","v":0},{"$f":"SUM('1. čtv.:4. čtv.'!E25)","v":0},{"$nulls":6},0]
[null,null,{"$f":"SUM('1. čtv.:4. čtv.'!C26)","v":0},{"$f":"SUM('1. čtv.:4. čtv.'!D26)","v":0},{"$f":"SUM('1. čtv.:4. čtv.'!E26)","v":0},{"$nulls":6},0]
[null,null,{"$f":"SUM('1. čtv.:4. čtv.'!C27)","v":0},{"$f":"SUM('1. čtv.:4. čtv.'!D27)","v":0},{"$f":"SUM('1. čtv.:4. čtv.'!E27)","v":0},{"$nulls":6},0]
[null,null,{"$f":"SUM('1. čtv.:4. čtv.'!C28)","v":0},{"$f":"SUM('1. čtv.:4. čtv.'!D28)","v":0},{"$f":"SUM('1. čtv.:4. čtv.'!E28)","v":0},{"$nulls":6},0]
[null,null,{"$f":"SUM('1. čtv.:4. čtv.'!C29)","v":0},{"$f":"SUM('1. čtv.:4. čtv.'!D29)","v":0},{"$f":"SUM('1. čtv.:4. čtv.'!E29)","v":0},{"$nulls":6},0]
[null,null,{"$f":"SUM('1. čtv.:4. čtv.'!C30)","v":0},{"$f":"SUM('1. čtv.:4. čtv.'!D30)","v":0},{"$f":"SUM('1. čtv.:4. čtv.'!E30)","v":0},{"$nulls":6},0]
[null,null,{"$f":"SUM('1. čtv.:4. čtv.'!C31)","v":0},{"$f":"SUM('1. čtv.:4. čtv.'!D31)","v":0},{"$f":"SUM('1. čtv.:4. čtv.'!E31)","v":0},{"$nulls":6},0]
[null,null,{"$f":"SUM('1. čtv.:4. čtv.'!C32)","v":0},{"$f":"SUM('1. čtv.:4. čtv.'!D32)","v":0},{"$f":"SUM('1. čtv.:4. čtv.'!E32)","v":0},{"$nulls":6},0]
[null,null,{"$f":"SUM('1. čtv.:4. čtv.'!C33)","v":0},{"$f":"SUM('1. čtv.:4. čtv.'!D33)","v":0},{"$f":"SUM('1. čtv.:4. čtv.'!E33)","v":0},{"$nulls":6},0]
[null,null,{"$f":"SUM('1. čtv.:4. čtv.'!C34)","v":0},{"$f":"SUM('1. čtv.:4. čtv.'!D34)","v":0},{"$f":"SUM('1. čtv.:4. čtv.'!E34)","v":0},{"$nulls":6},0]
[null,null,{"$f":"SUM('1. čtv.:4. čtv.'!C35)","v":0},{"$f":"SUM('1. čtv.:4. čtv.'!D35)","v":0},{"$f":"SUM('1. čtv.:4. čtv.'!E35)","v":0},{"$nulls":6},0]
[null,null,{"$f":"SUM('1. čtv.:4. čtv.'!C36)","v":0},{"$f":"SUM('1. čtv.:4. čtv.'!D36)","v":0},{"$f":"SUM('1. čtv.:4. čtv.'!E36)","v":0},{"$nulls":6},0]

{"sheet":"1. čtv.","index":1,"n_rows":36,"n_cols":95,"rows_kept":36,"merged":[[3,0,3,6]]}
[{"$f":"Název_společnosti","v":"Název společnosti"}]
["Sledování docházky, 1. čtvrtletí"]
["Datum"]
[{"$f":"Název_společnosti","v":"Název společnosti"},{"$nulls":6},"DŮVĚRNÉ"]
["Příjmení","Jméno","Dovolená","Osobní volno","Nemoc","1.1","2.1","3.1","4.1","5.1","6.1","7.1","8.1","9.1","10.1","11.1","12.1","13.1","14.1","15.1","16.1","17.1","18.1","19.1","20.1","21.1","22.1","23.1","24.1","25.1","26.1","27.1","28.1","29.1","30.1","31.1","1.2","2.2","3.2","4.2","5.2","6.2","7.2","8.2","9.2","10.2","11.2","12.2","13.2","14.2","15.2","16.2","17.2","18.2","19.2","20.2","21.2","22.2","23.2","24.2","25.2","26.2","27.2","28.2","1.3","2.3","3.3","4.3","5.3","6.3","7.3","8.3","9.3","10.3","11.3","12.3","13.3","14.3","15.3","16.3","17.3","18.3","19.3","20.3","21.3","22.3","23.3","24.3","25.3","26.3","27.3","28.3","29.3","30.3","31.3"]
[{"$f":"IF(ISBLANK('Souhrn od začátku roku'!A6),\"\",'Souhrn od začátku roku'!A6)","v":"Příjmení"},{"$f":"IF(ISBLANK('Souhrn od začátku roku'!B6),\"\",'Souhrn od začátku roku'!B6)","v":"Jméno"},{"$f":"COUNTIF($F6:$CQ6, \"D\")","v":3},{"$f":"COUNTIF($F6:$CQ6, \"O\")","v":0},{"$f":"COUNTIF($F6:$CQ6, \"N\")","v":1},"d","d","d",{"$nulls":4},"n"]
[{"$f":"IF(ISBLANK('Souhrn od začátku roku'!A7),\"\",'Souhrn od začátku roku'!A7)","v":""},{"$f":"IF(ISBLANK('Souhrn od začátku roku'!B7),\"\",'Souhrn od začátku roku'!B7)","v":""},0,0,0]
[{"$f":"IF(ISBLANK('Souhrn od začátku roku'!A8),\"\",'Souhrn od začátku roku'!A8)","v":""},{"$f":"IF(ISBLANK('Souhrn od začátku roku'!B8),\"\",'Souhrn od začátku roku'!B8)","v":""},0,0,0]
[{"$f":"IF(ISBLANK('Souhrn od začátku roku'!A9),\"\",'Souhrn od začátku roku'!A9)","v":""},{"$f":"IF(ISBLANK('Souhrn od začátku roku'!B9),\"\",'Souhrn od začátku roku'!B9)","v":""},0,0,0]
[{"$f":"IF(ISBLANK('Souhrn od začátku roku'!A10),\"\",'Souhrn od začátku roku'!A10)","v":""},{"$f":"IF(ISBLANK('Souhrn od začátku roku'!B10),\"\",'Souhrn od začátku roku'!B10)","v":""},0,0,0]
[{"$f":"IF(ISBLANK('Souhrn od začátku roku'!A11),\"\",'Souhrn od začátku roku'!A11)","v":""},{"$f":"IF(ISBLANK('Souhrn od začátku roku'!B11),\"\",'Souhrn od začátku roku'!B11)","v":""},0,0,0]
[{"$f":"IF(ISBLANK('Souhrn od začátku roku'!A12),\"\",'Souhrn od začátku roku'!A12)","v":""},{"$f":"IF(ISBLANK('Souhrn od začátku roku'!B12),\"\",'Souhrn od začátku roku'!B12)","v":""},0,0,0]
[{"$f":"IF(ISBLANK('Souhrn od začátku roku'!A13),\"\",'Souhrn od začátku roku'!A13)","v":""},{"$f":"IF(ISBLANK('Souhrn od začátku roku'!B13),\"\",'Souhrn od začátku roku'!B13)","v":""},0,0,0]
[{"$f":"IF(ISBLANK('Souhrn od začátku roku'!A14),\"\",'Souhrn od začátku roku'!A14)","v":""},{"$f":"IF(ISBLANK('Souhrn od začátku roku'!B14),\"\",'Souhrn od začátku roku'!B14)","v":""},0,0,0]
[{"$f":"IF(ISBLANK('Souhrn od začátku roku'!A15),\"\",'Souhrn od začátku roku'!A15)","v":""},{"$f":"IF(ISBLANK('Souhrn od začátku roku'!B15),\"\",'Souhrn od začátku roku'!B15)","v":""},0,0,0]
[{"$f":"IF(ISBLANK('Souhrn od začátku roku'!A16),\"\",'Souhrn od začátku roku'!A16)","v":""},{"$f":"IF(ISBLANK('Souhrn od začátku roku'!B16),\"\",'Souhrn od začátku roku'!B16)","v":""},0,0,0]
[{"$f":"IF(ISBLANK('Souhrn od začátku roku'!A17),\"\",'Souhrn od začátku roku'!A17)","v":""},{"$f":"IF(ISBLANK('Souhrn od začátku roku'!B17),\"\",'Souhrn od začátku roku'!B17)","v":""},0,0,0]
[{"$f":"IF(ISBLANK('Souhrn od začátku roku'!A18),\"\",'Souhrn od začátku roku'!A18)","v":""},{"$f":"IF(ISBLANK('Souhrn od začátku roku'!B18),\"\",'Souhrn od začátku roku'!B18)","v":""},0,0,0]
[{"$f":"IF(ISBLANK('Souhrn od začátku roku'!A19),\"\",'Souhrn od začátku roku'!A19)","v":""},{"$f":"IF(ISBLANK('Souhrn od začátku roku'!B19),\"\",'Souhrn od začátku roku'!B19)","v":""},0,0,0]
[{"$f":"IF(ISBLANK('Souhrn od začátku roku'!A20),\"\",'Souhrn od začátku roku'!A20)","v":""},{"$f":"IF(ISBLANK('Souhrn od začátku roku'!B20),\"\",'Souhrn od začátku roku'!B20)","v":""},0,0,0]
[{"$f":"IF(ISBLANK('Souhrn od začátku roku'!A21),\"\",'Souhrn od začátku roku'!A21)","v":""},{"$f":"IF(ISBLANK('Souhrn od začátku roku'!B21),\"\",'Souhrn od začátku roku'!B21)","v":""},0,0,0]
[{"$f":"IF(ISBLANK('Souhrn od začátku roku'!A22),\"\",'Souhrn od začátku roku'!A22)","v":""},{"$f":"IF(ISBLANK('Souhrn od začátku roku'!B22),\"\",'Souhrn od začátku roku'!B22)","v":""},0,0,0]
[{"$f":"IF(ISBLANK('Souhrn od začátku roku'!A23),\"\",'Souhrn od začátku roku'!A23)","v":""},{"$f":"IF(ISBLANK('Souhrn od začátku roku'!B23),\"\",'Souhrn od začátku roku'!B23)","v":""},0,0,0]
[{"$f":"IF(ISBLANK('Souhrn od začátku roku'!A24),\"\",'Souhrn od začátku roku'!A24)","v":""},{"$f":"IF(ISBLANK('Souhrn od začátku roku'!B24),\"\",'Souhrn od začátku roku'!B24)","v":""},0,0,0]
[{"$f":"IF(ISBLANK('Souhrn od začátku roku'!A25),\"\",'Souhrn od začátku roku'!A25)","v":""},{"$f":"IF(ISBLANK('Souhrn od začátku roku'!B25),\"\",'Souhrn od začátku roku'!B25)","v":""},0,0,0]
[{"$f":"IF(ISBLANK('Souhrn od začátku roku'!A26),\"\",'Souhrn od začátku roku'!A26)","v":""},{"$f":"IF(ISBLANK('Souhrn od začátku roku'!B26),\"\",'Souhrn od začátku roku'!B26)","v":""},0,0,0]
[{"$f":"IF(ISBLANK('Souhrn od začátku roku'!A27),\"\",'Souhrn od začátku roku'!A27)","v":""},{"$f":"IF(ISBLANK('Souhrn od začátku roku'!B27),\"\",'Souhrn od začátku roku'!B27)","v":""},0,0,0]
[{"$f":"IF(ISBLANK('Souhrn od začátku roku'!A28),\"\",'Souhrn od začátku roku'!A28)","v":""},{"$f":"IF(ISBLANK('Souhrn od začátku roku'!B28),\"\",'Souhrn od začátku roku'!B28)","v":""},0,0,0]
[{"$f":"IF(ISBLANK('Souhrn od začátku roku'!A29),\"\",'Souhrn od začátku roku'!A29)","v":""},{"$f":"IF(ISBLANK('Souhrn od začátku roku'!B29),\"\",'Souhrn od začátku roku'!B29)","v":""},0,0,0]
[{"$f":"IF(ISBLANK('Souhrn od začátku roku'!A30),\"\",'Souhrn od začátku roku'!A30)","v":""},{"$f":"IF(ISBLANK('Souhrn od začátku roku'!B30),\"\",'Souhrn od začátku roku'!B30)","v":""},0,0,0]
[{"$f":"IF(ISBLANK('Souhrn od začátku roku'!A31),\"\",'Souhrn od začátku roku'!A31)","v":""},{"$f":"IF(ISBLANK('Souhrn od začátku roku'!B31),\"\",'Souhrn od začátku roku'!B31)","v":""},0,0,0]
[{"$f":"IF(ISBLANK('Souhrn od začátku roku'!A32),\"\",'Souhrn od začátku roku'!A32)","v":""},{"$f":"IF(ISBLANK('Souhrn od začátku roku'!B32),\"\",'Souhrn od začátku roku'!B32)","v":""},0,0,0]
[{"$f":"IF(ISBLANK('Souhrn od začátku roku'!A33),\"\",'Souhrn od začátku roku'!A33)","v":""},{"$f":"IF(ISBLANK('Souhrn od začátku roku'!B33),\"\",'Souhrn od začátku roku'!B33)","v":""},0,0,0]
[{"$f":"IF(ISBLANK('Souhrn od začátku roku'!A34),\"\",'Souhrn od začátku roku'!A34)","v":""},{"$f":"IF(ISBLANK('Souhrn od začátku roku'!B34),\"\",'Souhrn od začátku roku'!B34)","v":""},0,0,0]
[{"$f":"IF(ISBLANK('Souhrn od začátku roku'!A35),\"\",'Souhrn od začátku roku'!A35)","v":""},{"$f":"IF(ISBLANK('Souhrn od začátku roku'!B35),\"\",'Souhrn od začátku roku'!B35)","v":""},0,0,0]
[{"$f":"IF(ISBLANK('Souhrn od začátku roku'!A36),\"\",'Souhrn od začátku roku'!A36)","v":""},{"$f":"IF(ISBLANK('Souhrn od začátku roku'!B36),\"\",'Souhrn od začátku roku'!B36)","v":""},0,0,0]

{"sheet":"2. čtv.","index":2,"n_rows":36,"n_cols":96,"rows_kept":36,"merged":[[3,0,3,6]]}
[{"$f":"Název_společnosti","v":"Název společnosti"}]
["Sledování docházky, 2. čtvrtletí"]
["Datum"]
[{"$f":"Název_společnosti","v":"Název společnosti"},{"$nulls":6},"DŮVĚRNÉ"]
["Příjmení","Jméno","Dovolená","Osobní volno","Nemoc","1.4","2.4","3.4","4.4","5.4","6.4","7.4","8.4","9.4","10.4","11.4","12.4","13.4","14.4","15.4","16.4","17.4","18.4","19.4","20.4","21.4","22.4","23.4","24.4","25.4","26.4","27.4","28.4","29.4","30.4","1.5","2.5","3.5","4.5","5.5","6.5","7.5","8.5","9.5","10.5","11.5","12.5","13.5","14.5","15.5","16.5","17.5","18.5","19.5","20.5","21.5","22.5","23.5","24.5","25.5","26.5","27.5","28.5","29.5","30.5","31.5","1.6","2.6","3.6","4.6","5.6","6.6","7.6","8.6","9.6","10.6","11.6","12.6","13.6","14.6","15.6","16.6","17.6","18.6","19.6","20.6","21.6","22.6","23.6","24.6","25.6","26.6","27.6","28.6","29.6","6.30"]
[{"$f":"IF(ISBLANK('Souhrn od začátku roku'!A6),\"\",'Souhrn od začátku roku'!A6)","v":"Příjmení"},{"$f":"IF(ISBLANK('Souhrn od začátku roku'!B6),\"\",'Souhrn od začátku roku'!B6)","v":"Jméno"},{"$f":"COUNTIF($F6:$CR6, \"D\")","v":0},{"$f":"COUNTIF($F6:$CR6, \"O\")","v":0},{"$f":"COUNTIF($F6:$CR6, \"N\")","v":0}]
[{"$f":"IF(ISBLANK('Souhrn od začátku roku'!A7),\"\",'Souhrn od začátku roku'!A7)","v":""},{"$f":"IF(ISBLANK('Souhrn od začátku roku'!B7),\"\",'Souhrn od začátku roku'!B7)","v":""},0,0,0]
[{"$f":"IF(ISBLANK('Souhrn od začátku roku'!A8),\"\",'Souhrn od začátku roku'!A8)","v":""},{"$f":"IF(ISBLANK('Souhrn od začátku roku'!B8),\"\",'Souhrn od začátku roku'!B8)","v":""},0,0,0]
[{"$f":"IF(ISBLANK('Souhrn od začátku roku'!A9),\"\",'Souhrn od začátku roku'!A9)","v":""},{"$f":"IF(ISBLANK('Souhrn od začátku roku'!B9),\"\",'Souhrn od začátku roku'!B9)","v":""},0,0,0]
[{"$f":"IF(ISBLANK('Souhrn od začátku roku'!A10),\"\",'Souhrn od začátku roku'!A10)","v":""},{"$f":"IF(ISBLANK('Souhrn od začátku roku'!B10),\"\",'Souhrn od začátku roku'!B10)","v":""},0,0,0]
[{"$f":"IF(ISBLANK('Souhrn od začátku roku'!A11),\"\",'Souhrn od začátku roku'!A11)","v":""},{"$f":"IF(ISBLANK('Souhrn od začátku roku'!B11),\"\",'Souhrn od začátku roku'!B11)","v":""},0,0,0]
[{"$f":"IF(ISBLANK('Souhrn od začátku roku'!A12),\"\",'Souhrn od začátku roku'!A12)","v":""},{"$f":"IF(ISBLANK('Souhrn od začátku roku'!B12),\"\",'Souhrn od začátku roku'!B12)","v":""},0,0,0]
[{"$f":"IF(ISBLANK('Souhrn od začátku roku'!A13),\"\",'Souhrn od začátku roku'!A13)","v":""},{"$f":"IF(ISBLANK('Souhrn od začátku roku'!B13),\"\",'Souhrn od začátku roku'!B13)","v":""},0,0,0]
[{"$f":"IF(ISBLANK('Souhrn od začátku roku'!A14),\"\",'Souhrn od začátku roku'!A14)","v":""},{"$f":"IF(ISBLANK('Souhrn od začátku roku'!B14),\"\",'Souhrn od začátku roku'!B14)","v":""},0,0,0]
[{"$f":"IF(ISBLANK('Souhrn od začátku roku'!A15),\"\",'Souhrn od začátku roku'!A15)","v":""},{"$f":"IF(ISBLANK('Souhrn od začátku roku'!B15),\"\",'Souhrn od začátku roku'!B15)","v":""},0,0,0]
[{"$f":"IF(ISBLANK('Souhrn od začátku roku'!A16),\"\",'Souhrn od začátku roku'!A16)","v":""},{"$f":"IF(ISBLANK('Souhrn od začátku roku'!B16),\"\",'Souhrn od začátku roku'!B16)","v":""},0,0,0]
[{"$f":"IF(ISBLANK('Souhrn od začátku roku'!A17),\"\",'Souhrn od začátku roku'!A17)","v":""},{"$f":"IF(ISBLANK('Souhrn od začátku roku'!B17),\"\",'Souhrn od začátku roku'!B17)","v":""},0,0,0]
[{"$f":"IF(ISBLANK('Souhrn od začátku roku'!A18),\"\",'Souhrn od začátku roku'!A18)","v":""},{"$f":"IF(ISBLANK('Souhrn od začátku roku'!B18),\"\",'Souhrn od začátku roku'!B18)","v":""},0,0,0]
[{"$f":"IF(ISBLANK('Souhrn od začátku roku'!A19),\"\",'Souhrn od začátku roku'!A19)","v":""},{"$f":"IF(ISBLANK('Souhrn od začátku roku'!B19),\"\",'Souhrn od začátku roku'!B19)","v":""},0,0,0]
[{"$f":"IF(ISBLANK('Souhrn od začátku roku'!A20),\"\",'Souhrn od začátku roku'!A20)","v":""},{"$f":"IF(ISBLANK('Souhrn od začátku roku'!B20),\"\",'Souhrn od začátku roku'!B20)","v":""},0,0,0]
[{"$f":"IF(ISBLANK('Souhrn od začátku roku'!A21),\"\",'Souhrn od začátku roku'!A21)","v":""},{"$f":"IF(ISBLANK('Souhrn od začátku roku'!B21),\"\",'Souhrn od začátku roku'!B21)","v":""},0,0,0]
[{"$f":"IF(ISBLANK('Souhrn od začátku roku'!A22),\"\",'Souhrn od začátku roku'!A22)","v":""},{"$f":"IF(ISBLANK('Souhrn od začátku roku'!B22),\"\",'Souhrn od začátku roku'!B22)","v":""},0,0,0]
[{"$f":"IF(ISBLANK('Souhrn od začátku roku'!A23),\"\",'Souhrn od začátku roku'!A23)","v":""},{"$f":"IF(ISBLANK('Souhrn od začátku roku'!B23),\"\",'Souhrn od začátku roku'!B23)","v":""},0,0,0]
[{"$f":"IF(ISBLANK('Souhrn od začátku roku'!A24),\"\",'Souhrn od začátku roku'!A24)","v":""},{"$f":"IF(ISBLANK('Souhrn od začátku roku'!B24),\"\",'Souhrn od začátku roku'!B24)","v":""},0,0,0]
[{"$f":"IF(ISBLANK('Souhrn od začátku roku'!A25),\"\",'Souhrn od začátku roku'!A25)","v":""},{"$f":"IF(ISBLANK('Souhrn od začátku roku'!B25),\"\",'Souhrn od začátku roku'!B25)","v":""},0,0,0]
[{"$f":"IF(ISBLANK('Souhrn od začátku roku'!A26),\"\",'Souhrn od začátku roku'!A26)","v":""},{"$f":"IF(ISBLANK('Souhrn od začátku roku'!B26),\"\",'Souhrn od začátku roku'!B26)","v":""},0,0,0]
[{"$f":"IF(ISBLANK('Souhrn od začátku roku'!A27),\"\",'Souhrn od začátku roku'!A27)","v":""},{"$f":"IF(ISBLANK('Souhrn od začátku roku'!B27),\"\",'Souhrn od začátku roku'!B27)","v":""},0,0,0]
[{"$f":"IF(ISBLANK('Souhrn od začátku roku'!A28),\"\",'Souhrn od začátku roku'!A28)","v":""},{"$f":"IF(ISBLANK('Souhrn od začátku roku'!B28),\"\",'Souhrn od začátku roku'!B28)","v":""},0,0,0]
[{"$f":"IF(ISBLANK('Souhrn od začátku roku'!A29),\"\",'Souhrn od začátku roku'!A29)","v":""},{"$f":"IF(ISBLANK('Souhrn od začátku roku'!B29),\"\",'Souhrn od začátku roku'!B29)","v":""},0,0,0]
[{"$f":"IF(ISBLANK('Souhrn od začátku roku'!A30),\"\",'Souhrn od začátku roku'!A30)","v":""},{"$f":"IF(ISBLANK('Souhrn od začátku roku'!B30),\"\",'Souhrn od začátku roku'!B30)","v":""},0,0,0]
[{"$f":"IF(ISBLANK('Souhrn od začátku roku'!A31),\"\",'Souhrn od začátku roku'!A31)","v":""},{"$f":"IF(ISBLANK('Souhrn od začátku roku'!B31),\"\",'Souhrn od začátku roku'!B31)","v":""},0,0,0]
[{"$f":"IF(ISBLANK('Souhrn od začátku roku'!A32),\"\",'Souhrn od začátku roku'!A32)","v":""},{"$f":"IF(ISBLANK('Souhrn od začátku roku'!B32),\"\",'Souhrn od začátku roku'!B32)","v":""},0,0,0]
[{"$f":"IF(ISBLANK('Souhrn od začátku roku'!A33),\"\",'Souhrn od začátku roku'!A33)","v":""},{"$f":"IF(ISBLANK('Souhrn od začátku roku'!B33),\"\",'Souhrn od začátku roku'!B33)","v":""},0,0,0]
[{"$f":"IF(ISBLANK('Souhrn od začátku roku'!A34),\"\",'Souhrn od začátku roku'!A34)","v":""},{"$f":"IF(ISBLANK('Souhrn od začátku roku'!B34),\"\",'Souhrn od začátku roku'!B34)","v":""},0,0,0]
[{"$f":"IF(ISBLANK('Souhrn od začátku roku'!A35),\"\",'Souhrn od začátku roku'!A35)","v":""},{"$f":"IF(ISBLANK('Souhrn od začátku roku'!B35),\"\",'Souhrn od začátku roku'!B35)","v":""},0,0,0]
[{"$f":"IF(ISBLANK('Souhrn od začátku roku'!A36),\"\",'Souhrn od začátku roku'!A36)","v":""},{"$f":"IF(ISBLANK('Souhrn od začátku roku'!B36),\"\",'Souhrn od začátku roku'!B36)","v":""},0,0,0]

{"sheet":"3. čtv.","index":3,"n_rows":36,"n_cols":97,"rows_kept":36,"merged":[[3,0,3,6]]}
[{"$f":"Název_společnosti","v":"Název společnosti"}]
["Sledování docházky, 3. čtvrtletí"]
["Datum"]
[{"$f":"Název_společnosti","v":"Název společnosti"},{"$nulls":6},"DŮVĚRNÉ"]
["Příjmení","Jméno","Dovolená","Osobní volno","Nemoc","1.7","2.7","3.7","4.7","5.7","6.7","7.7","8.7","9.7","10.7","11.7","12.7","13.7","14.7","15.7","16.7","17.7","18.7","19.7","20.7","21.7","22.7","23.7","24.7","25.7","26.7","27.7","28.7","29.7","30.7","31.7","1.8","2.8","3.8","4.8","5.8","6.8","7.8","8.8","9.8","10.8","11.8","12.8","13.8","14.8","15.8","16.8","17.8","18.8","19.8","20.8","21.8","22.8","23.8","24.8","25.8","26.8","27.8","28.8","29.8","30.8","31.8","1.9","2.9","3.9","4.9","5.9","6.9","7.9","8.9","9.9","10.9","11.9","12.9","13.9","14.9","15.9","16.9","17.9","18.9","19.9","20.9","21.9","22.9","23.9","24.9","25.9","26.9","27.9","28.9","9.29","9.30"]
[{"$f":"IF(ISBLANK('Souhrn od začátku roku'!A6),\"\",'Souhrn od začátku roku'!A6)","v":"Příjmení"},{"$f":"IF(ISBLANK('Souhrn od začátku roku'!B6),\"\",'Souhrn od začátku roku'!B6)","v":"Jméno"},{"$f":"COUNTIF($F6:$CS6, \"D\")","v":0},{"$f":"COUNTIF($F6:$CS6, \"O\")","v":0},{"$f":"COUNTIF($F6:$CS6, \"N\")","v":0}]
[{"$f":"IF(ISBLANK('Souhrn od začátku roku'!A7),\"\",'Souhrn od začátku roku'!A7)","v":""},{"$f":"IF(ISBLANK('Souhrn od začátku roku'!B7),\"\",'Souhrn od začátku roku'!B7)","v":""},0,0,0]
[{"$f":"IF(ISBLANK('Souhrn od začátku roku'!A8),\"\",'Souhrn od začátku roku'!A8)","v":""},{"$f":"IF(ISBLANK('Souhrn od začátku roku'!B8),\"\",'Souhrn od začátku roku'!B8)","v":""},0,0,0]
[{"$f":"IF(ISBLANK('Souhrn od začátku roku'!A9),\"\",'Souhrn od začátku roku'!A9)","v":""},{"$f":"IF(ISBLANK('Souhrn od začátku roku'!B9),\"\",'Souhrn od začátku roku'!B9)","v":""},0,0,0]
[{"$f":"IF(ISBLANK('Souhrn od začátku roku'!A10),\"\",'Souhrn od začátku roku'!A10)","v":""},{"$f":"IF(ISBLANK('Souhrn od začátku roku'!B10),\"\",'Souhrn od začátku roku'!B10)","v":""},0,0,0]
[{"$f":"IF(ISBLANK('Souhrn od začátku roku'!A11),\"\",'Souhrn od začátku roku'!A11)","v":""},{"$f":"IF(ISBLANK('Souhrn od začátku roku'!B11),\"\",'Souhrn od začátku roku'!B11)","v":""},0,0,0]
[{"$f":"IF(ISBLANK('Souhrn od začátku roku'!A12),\"\",'Souhrn od začátku roku'!A12)","v":""},{"$f":"IF(ISBLANK('Souhrn od začátku roku'!B12),\"\",'Souhrn od začátku roku'!B12)","v":""},0,0,0]
[{"$f":"IF(ISBLANK('Souhrn od začátku roku'!A13),\"\",'Souhrn od začátku roku'!A13)","v":""},{"$f":"IF(ISBLANK('Souhrn od začátku roku'!B13),\"\",'Souhrn od začátku roku'!B13)","v":""},0,0,0]
[{"$f":"IF(ISBLANK('Souhrn od začátku roku'!A14),\"\",'Souhrn od začátku roku'!A14)","v":""},{"$f":"IF(ISBLANK('Souhrn od začátku roku'!B14),\"\",'Souhrn od začátku roku'!B14)","v":""},0,0,0]
[{"$f":"IF(ISBLANK('Souhrn od začátku roku'!A15),\"\",'Souhrn od začátku roku'!A15)","v":""},{"$f":"IF(ISBLANK('Souhrn od začátku roku'!B15),\"\",'Souhrn od začátku roku'!B15)","v":""},0,0,0]
[{"$f":"IF(ISBLANK('Souhrn od začátku roku'!A16),\"\",'Souhrn od začátku roku'!A16)","v":""},{"$f":"IF(ISBLANK('Souhrn od začátku roku'!B16),\"\",'Souhrn od začátku roku'!B16)","v":""},0,0,0]
[{"$f":"IF(ISBLANK('Souhrn od začátku roku'!A17),\"\",'Souhrn od začátku roku'!A17)","v":""},{"$f":"IF(ISBLANK('Souhrn od začátku roku'!B17),\"\",'Souhrn od začátku roku'!B17)","v":""},0,0,0]
[{"$f":"IF(ISBLANK('Souhrn od začátku roku'!A18),\"\",'Souhrn od začátku roku'!A18)","v":""},{"$f":"IF(ISBLANK('Souhrn od začátku roku'!B18),\"\",'Souhrn od začátku roku'!B18)","v":""},0,0,0]
[{"$f":"IF(ISBLANK('Souhrn od začátku roku'!A19),\"\",'Souhrn od začátku roku'!A19)","v":""},{"$f":"IF(ISBLANK('Souhrn od začátku roku'!B19),\"\",'Souhrn od začátku roku'!B19)","v":""},0,0,0]
[{"$f":"IF(ISBLANK('Souhrn od začátku roku'!A20),\"\",'Souhrn od začátku roku'!A20)","v":""},{"$f":"IF(ISBLANK('Souhrn od začátku roku'!B20),\"\",'Souhrn od začátku roku'!B20)","v":""},0,0,0]
[{"$f":"IF(ISBLANK('Souhrn od začátku roku'!A21),\"\",'Souhrn od začátku roku'!A21)","v":""},{"$f":"IF(ISBLANK('Souhrn od začátku roku'!B21),\"\",'Souhrn od začátku roku'!B21)","v":""},0,0,0]
[{"$f":"IF(ISBLANK('Souhrn od začátku roku'!A22),\"\",'Souhrn od začátku roku'!A22)","v":""},{"$f":"IF(ISBLANK('Souhrn od začátku roku'!B22),\"\",'Souhrn od začátku roku'!B22)","v":""},0,0,0]
[{"$f":"IF(ISBLANK('Souhrn od začátku roku'!A23),\"\",'Souhrn od začátku roku'!A23)","v":""},{"$f":"IF(ISBLANK('Souhrn od začátku roku'!B23),\"\",'Souhrn od začátku roku'!B23)","v":""},0,0,0]
[{"$f":"IF(ISBLANK('Souhrn od začátku roku'!A24),\"\",'Souhrn od začátku roku'!A24)","v":""},{"$f":"IF(ISBLANK('Souhrn od začátku roku'!B24),\"\",'Souhrn od začátku roku'!B24)","v":""},0,0,0]
[{"$f":"IF(ISBLANK('Souhrn od začátku roku'!A25),\"\",'Souhrn od začátku roku'!A25)","v":""},{"$f":"IF(ISBLANK('Souhrn od začátku roku'!B25),\"\",'Souhrn od začátku roku'!B25)","v":""},0,0,0]
[{"$f":"IF(ISBLANK('Souhrn od začátku roku'!A26),\"\",'Souhrn od začátku roku'!A26)","v":""},{"$f":"IF(ISBLANK('Souhrn od začátku roku'!B26),\"\",'Souhrn od začátku roku'!B26)","v":""},0,0,0]
[{"$f":"IF(ISBLANK('Souhrn od začátku roku'!A27),\"\",'Souhrn od začátku roku'!A27)","v":""},{"$f":"IF(ISBLANK('Souhrn od začátku roku'!B27),\"\",'Souhrn od začátku roku'!B27)","v":""},0,0,0]
[{"$f":"IF(ISBLANK('Souhrn od začátku roku'!A28),\"\",'Souhrn od začátku roku'!A28)","v":""},{"$f":"IF(ISBLANK('Souhrn od začátku roku'!B28),\"\",'Souhrn od začátku roku'!B28)","v":""},0,0,0]
[{"$f":"IF(ISBLANK('Souhrn od začátku roku'!A29),\"\",'Souhrn od začátku roku'!A29)","v":""},{"$f":"IF(ISBLANK('Souhrn od začátku roku'!B29),\"\",'Souhrn od začátku roku'!B29)","v":""},0,0,0]
[{"$f":"IF(ISBLANK('Souhrn od začátku roku'!A30),\"\",'Souhrn od začátku roku'!A30)","v":""},{"$f":"IF(ISBLANK('Souhrn od začátku roku'!B30),\"\",'Souhrn od začátku roku'!B30)","v":""},0,0,0]
[{"$f":"IF(ISBLANK('Souhrn od začátku roku'!A31),\"\",'Souhrn od začátku roku'!A31)","v":""},{"$f":"IF(ISBLANK('Souhrn od začátku roku'!B31),\"\",'Souhrn od začátku roku'!B31)","v":""},0,0,0]
[{"$f":"IF(ISBLANK('Souhrn od začátku roku'!A32),\"\",'Souhrn od začátku roku'!A32)","v":""},{"$f":"IF(ISBLANK('Souhrn od začátku roku'!B32),\"\",'Souhrn od začátku roku'!B32)","v":""},0,0,0]
[{"$f":"IF(ISBLANK('Souhrn od začátku roku'!A33),\"\",'Souhrn od začátku roku'!A33)","v":""},{"$f":"IF(ISBLANK('Souhrn od začátku roku'!B33),\"\",'Souhrn od začátku roku'!B33)","v":""},0,0,0]
[{"$f":"IF(ISBLANK('Souhrn od začátku roku'!A34),\"\",'Souhrn od začátku roku'!A34)","v":""},{"$f":"IF(ISBLANK('Souhrn od začátku roku'!B34),\"\",'Souhrn od začátku roku'!B34)","v":""},0,0,0]
[{"$f":"IF(ISBLANK('Souhrn od začátku roku'!A35),\"\",'Souhrn od začátku roku'!A35)","v":""},{"$f":"IF(ISBLANK('Souhrn od začátku roku'!B35),\"\",'Souhrn od začátku roku'!B35)","v":""},0,0,0]
[{"$f":"IF(ISBLANK('Souhrn od začátku roku'!A36),\"\",'Souhrn od začátku roku'!A36)","v":""},{"$f":"IF(ISBLANK('Souhrn od začátku roku'!B36),\"\",'Souhrn od začátku roku'!B36)","v":""},0,0,0]

{"sheet":"4. čtv.","index":4,"n_rows":36,"n_cols":97,"rows_kept":36,"merged":[[3,0,3,6]]}
[{"$f":"Název_společnosti","v":"Název společnosti"}]
["Sledování docházky, 4. čtvrtletí"]
["Datum"]
[{"$f":"Název_společnosti","v":"Název společnosti"},{"$nulls":6},"DŮVĚRNÉ"]
["Příjmení","Jméno","Dovolená","Osobní volno","Nemoc","1.10","2.10","3.10","4.10","5.10","6.10","7.10","8.10","9.10","10.10","11.10","12.10","13.10","14.10","15.10","16.10","17.10","18.10","19.10","20.10","21.10","22.10","23.10","24.10","25.10","26.10","27.10","28.10","29.10","30.10","31.10","1.11","2.11","3.11","4.11","5.11","6.11","7.11","8.11","9.11","10.11","11.11","12.11","13.11","14.11","15.11","16.11","17.11","18.11","19.11","20.11","21.11","22.11","23.11","24.11","25.11","26.11","27.11","28.11","29.11","30.11","1.12","2.12","3.12","4.12","5.12","6.12","7.12","8.12","9.12","10.12","11.12","12.12","13.12","14.12","15.12","16.12","17.12","18.12","19.12","20.12","21.12","22.12","23.12","24.12","25.12","26.12","27.12","28.12","29.12","30.12","31.12"]
[{"$f":"IF(ISBLANK('Souhrn od začátku roku'!A6),\"\",'Souhrn od začátku roku'!A6)","v":"Příjmení"},{"$f":"IF(ISBLANK('Souhrn od začátku roku'!B6),\"\",'Souhrn od začátku roku'!B6)","v":"Jméno"},{"$f":"COUNTIF($F6:$CS6, \"D\")","v":0},{"$f":"COUNTIF($F6:CS6, \"O\")","v":0},{"$f":"COUNTIF($F6:CS6, \"N\")","v":0}]
[{"$f":"IF(ISBLANK('Souhrn od začátku roku'!A7),\"\",'Souhrn od začátku roku'!A7)","v":""},{"$f":"IF(ISBLANK('Souhrn od začátku roku'!B7),\"\",'Souhrn od začátku roku'!B7)","v":""},0,{"$f":"COUNTIF($F7:CS7, \"O\")","v":0},{"$f":"COUNTIF($F7:CS7, \"N\")","v":0}]
[{"$f":"IF(ISBLANK('Souhrn od začátku roku'!A8),\"\",'Souhrn od začátku roku'!A8)","v":""},{"$f":"IF(ISBLANK('Souhrn od začátku roku'!B8),\"\",'Souhrn od začátku roku'!B8)","v":""},0,{"$f":"COUNTIF($F8:CS8, \"O\")","v":0},{"$f":"COUNTIF($F8:CS8, \"N\")","v":0}]
[{"$f":"IF(ISBLANK('Souhrn od začátku roku'!A9),\"\",'Souhrn od začátku roku'!A9)","v":""},{"$f":"IF(ISBLANK('Souhrn od začátku roku'!B9),\"\",'Souhrn od začátku roku'!B9)","v":""},0,{"$f":"COUNTIF($F9:CS9, \"O\")","v":0},{"$f":"COUNTIF($F9:CS9, \"N\")","v":0}]
[{"$f":"IF(ISBLANK('Souhrn od začátku roku'!A10),\"\",'Souhrn od začátku roku'!A10)","v":""},{"$f":"IF(ISBLANK('Souhrn od začátku roku'!B10),\"\",'Souhrn od začátku roku'!B10)","v":""},0,{"$f":"COUNTIF($F10:CS10, \"O\")","v":0},{"$f":"COUNTIF($F10:CS10, \"N\")","v":0}]
[{"$f":"IF(ISBLANK('Souhrn od začátku roku'!A11),\"\",'Souhrn od začátku roku'!A11)","v":""},{"$f":"IF(ISBLANK('Souhrn od začátku roku'!B11),\"\",'Souhrn od začátku roku'!B11)","v":""},0,{"$f":"COUNTIF($F11:CS11, \"O\")","v":0},{"$f":"COUNTIF($F11:CS11, \"N\")","v":0}]
[{"$f":"IF(ISBLANK('Souhrn od začátku roku'!A12),\"\",'Souhrn od začátku roku'!A12)","v":""},{"$f":"IF(ISBLANK('Souhrn od začátku roku'!B12),\"\",'Souhrn od začátku roku'!B12)","v":""},0,{"$f":"COUNTIF($F12:CS12, \"O\")","v":0},{"$f":"COUNTIF($F12:CS12, \"N\")","v":0}]
[{"$f":"IF(ISBLANK('Souhrn od začátku roku'!A13),\"\",'Souhrn od začátku roku'!A13)","v":""},{"$f":"IF(ISBLANK('Souhrn od začátku roku'!B13),\"\",'Souhrn od začátku roku'!B13)","v":""},0,{"$f":"COUNTIF($F13:CS13, \"O\")","v":0},{"$f":"COUNTIF($F13:CS13, \"N\")","v":0}]
[{"$f":"IF(ISBLANK('Souhrn od začátku roku'!A14),\"\",'Souhrn od začátku roku'!A14)","v":""},{"$f":"IF(ISBLANK('Souhrn od začátku roku'!B14),\"\",'Souhrn od začátku roku'!B14)","v":""},0,{"$f":"COUNTIF($F14:CS14, \"O\")","v":0},{"$f":"COUNTIF($F14:CS14, \"N\")","v":0}]
[{"$f":"IF(ISBLANK('Souhrn od začátku roku'!A15),\"\",'Souhrn od začátku roku'!A15)","v":""},{"$f":"IF(ISBLANK('Souhrn od začátku roku'!B15),\"\",'Souhrn od začátku roku'!B15)","v":""},0,{"$f":"COUNTIF($F15:CS15, \"O\")","v":0},{"$f":"COUNTIF($F15:CS15, \"N\")","v":0}]
[{"$f":"IF(ISBLANK('Souhrn od začátku roku'!A16),\"\",'Souhrn od začátku roku'!A16)","v":""},{"$f":"IF(ISBLANK('Souhrn od začátku roku'!B16),\"\",'Souhrn od začátku roku'!B16)","v":""},0,{"$f":"COUNTIF($F16:CS16, \"O\")","v":0},{"$f":"COUNTIF($F16:CS16, \"N\")","v":0}]
[{"$f":"IF(ISBLANK('Souhrn od začátku roku'!A17),\"\",'Souhrn od začátku roku'!A17)","v":""},{"$f":"IF(ISBLANK('Souhrn od začátku roku'!B17),\"\",'Souhrn od začátku roku'!B17)","v":""},0,{"$f":"COUNTIF($F17:CS17, \"O\")","v":0},{"$f":"COUNTIF($F17:CS17, \"N\")","v":0}]
[{"$f":"IF(ISBLANK('Souhrn od začátku roku'!A18),\"\",'Souhrn od začátku roku'!A18)","v":""},{"$f":"IF(ISBLANK('Souhrn od začátku roku'!B18),\"\",'Souhrn od začátku roku'!B18)","v":""},0,{"$f":"COUNTIF($F18:CS18, \"O\")","v":0},{"$f":"COUNTIF($F18:CS18, \"N\")","v":0}]
[{"$f":"IF(ISBLANK('Souhrn od začátku roku'!A19),\"\",'Souhrn od začátku roku'!A19)","v":""},{"$f":"IF(ISBLANK('Souhrn od začátku roku'!B19),\"\",'Souhrn od začátku roku'!B19)","v":""},0,{"$f":"COUNTIF($F19:CS19, \"O\")","v":0},{"$f":"COUNTIF($F19:CS19, \"N\")","v":0}]
[{"$f":"IF(ISBLANK('Souhrn od začátku roku'!A20),\"\",'Souhrn od začátku roku'!A20)","v":""},{"$f":"IF(ISBLANK('Souhrn od začátku roku'!B20),\"\",'Souhrn od začátku roku'!B20)","v":""},0,{"$f":"COUNTIF($F20:CS20, \"O\")","v":0},{"$f":"COUNTIF($F20:CS20, \"N\")","v":0}]
[{"$f":"IF(ISBLANK('Souhrn od začátku roku'!A21),\"\",'Souhrn od začátku roku'!A21)","v":""},{"$f":"IF(ISBLANK('Souhrn od začátku roku'!B21),\"\",'Souhrn od začátku roku'!B21)","v":""},0,{"$f":"COUNTIF($F21:CS21, \"O\")","v":0},{"$f":"COUNTIF($F21:CS21, \"N\")","v":0}]
[{"$f":"IF(ISBLANK('Souhrn od začátku roku'!A22),\"\",'Souhrn od začátku roku'!A22)","v":""},{"$f":"IF(ISBLANK('Souhrn od začátku roku'!B22),\"\",'Souhrn od začátku roku'!B22)","v":""},0,{"$f":"COUNTIF($F22:CS22, \"O\")","v":0},{"$f":"COUNTIF($F22:CS22, \"N\")","v":0}]
[{"$f":"IF(ISBLANK('Souhrn od začátku roku'!A23),\"\",'Souhrn od začátku roku'!A23)","v":""},{"$f":"IF(ISBLANK('Souhrn od začátku roku'!B23),\"\",'Souhrn od začátku roku'!B23)","v":""},0,{"$f":"COUNTIF($F23:CS23, \"O\")","v":0},{"$f":"COUNTIF($F23:CS23, \"N\")","v":0}]
[{"$f":"IF(ISBLANK('Souhrn od začátku roku'!A24),\"\",'Souhrn od začátku roku'!A24)","v":""},{"$f":"IF(ISBLANK('Souhrn od začátku roku'!B24),\"\",'Souhrn od začátku roku'!B24)","v":""},0,{"$f":"COUNTIF($F24:CS24, \"O\")","v":0},{"$f":"COUNTIF($F24:CS24, \"N\")","v":0}]
[{"$f":"IF(ISBLANK('Souhrn od začátku roku'!A25),\"\",'Souhrn od začátku roku'!A25)","v":""},{"$f":"IF(ISBLANK('Souhrn od začátku roku'!B25),\"\",'Souhrn od začátku roku'!B25)","v":""},0,{"$f":"COUNTIF($F25:CS25, \"O\")","v":0},{"$f":"COUNTIF($F25:CS25, \"N\")","v":0}]
[{"$f":"IF(ISBLANK('Souhrn od začátku roku'!A26),\"\",'Souhrn od začátku roku'!A26)","v":""},{"$f":"IF(ISBLANK('Souhrn od začátku roku'!B26),\"\",'Souhrn od začátku roku'!B26)","v":""},0,{"$f":"COUNTIF($F26:CS26, \"O\")","v":0},{"$f":"COUNTIF($F26:CS26, \"N\")","v":0}]
[{"$f":"IF(ISBLANK('Souhrn od začátku roku'!A27),\"\",'Souhrn od začátku roku'!A27)","v":""},{"$f":"IF(ISBLANK('Souhrn od začátku roku'!B27),\"\",'Souhrn od začátku roku'!B27)","v":""},0,{"$f":"COUNTIF($F27:CS27, \"O\")","v":0},{"$f":"COUNTIF($F27:CS27, \"N\")","v":0}]
[{"$f":"IF(ISBLANK('Souhrn od začátku roku'!A28),\"\",'Souhrn od začátku roku'!A28)","v":""},{"$f":"IF(ISBLANK('Souhrn od začátku roku'!B28),\"\",'Souhrn od začátku roku'!B28)","v":""},0,{"$f":"COUNTIF($F28:CS28, \"O\")","v":0},{"$f":"COUNTIF($F28:CS28, \"N\")","v":0}]
[{"$f":"IF(ISBLANK('Souhrn od začátku roku'!A29),\"\",'Souhrn od začátku roku'!A29)","v":""},{"$f":"IF(ISBLANK('Souhrn od začátku roku'!B29),\"\",'Souhrn od začátku roku'!B29)","v":""},0,{"$f":"COUNTIF($F29:CS29, \"O\")","v":0},{"$f":"COUNTIF($F29:CS29, \"N\")","v":0}]
[{"$f":"IF(ISBLANK('Souhrn od začátku roku'!A30),\"\",'Souhrn od začátku roku'!A30)","v":""},{"$f":"IF(ISBLANK('Souhrn od začátku roku'!B30),\"\",'Souhrn od začátku roku'!B30)","v":""},0,{"$f":"COUNTIF($F30:CS30, \"O\")","v":0},{"$f":"COUNTIF($F30:CS30, \"N\")","v":0}]
[{"$f":"IF(ISBLANK('Souhrn od začátku roku'!A31),\"\",'Souhrn od začátku roku'!A31)","v":""},{"$f":"IF(ISBLANK('Souhrn od začátku roku'!B31),\"\",'Souhrn od začátku roku'!B31)","v":""},0,{"$f":"COUNTIF($F31:CS31, \"O\")","v":0},{"$f":"COUNTIF($F31:CS31, \"N\")","v":0}]
[{"$f":"IF(ISBLANK('Souhrn od začátku roku'!A32),\"\",'Souhrn od začátku roku'!A32)","v":""},{"$f":"IF(ISBLANK('Souhrn od začátku roku'!B32),\"\",'Souhrn od začátku roku'!B32)","v":""},0,{"$f":"COUNTIF($F32:CS32, \"O\")","v":0},{"$f":"COUNTIF($F32:CS32, \"N\")","v":0}]
[{"$f":"IF(ISBLANK('Souhrn od začátku roku'!A33),\"\",'Souhrn od začátku roku'!A33)","v":""},{"$f":"IF(ISBLANK('Souhrn od začátku roku'!B33),\"\",'Souhrn od začátku roku'!B33)","v":""},0,{"$f":"COUNTIF($F33:CS33, \"O\")","v":0},{"$f":"COUNTIF($F33:CS33, \"N\")","v":0}]
[{"$f":"IF(ISBLANK('Souhrn od začátku roku'!A34),\"\",'Souhrn od začátku roku'!A34)","v":""},{"$f":"IF(ISBLANK('Souhrn od začátku roku'!B34),\"\",'Souhrn od začátku roku'!B34)","v":""},0,{"$f":"COUNTIF($F34:CS34, \"O\")","v":0},{"$f":"COUNTIF($F34:CS34, \"N\")","v":0}]
[{"$f":"IF(ISBLANK('Souhrn od začátku roku'!A35),\"\",'Souhrn od začátku roku'!A35)","v":""},{"$f":"IF(ISBLANK('Souhrn od začátku roku'!B35),\"\",'Souhrn od začátku roku'!B35)","v":""},0,{"$f":"COUNTIF($F35:CS35, \"O\")","v":0},{"$f":"COUNTIF($F35:CS35, \"N\")","v":0}]
[{"$f":"IF(ISBLANK('Souhrn od začátku roku'!A36),\"\",'Souhrn od začátku roku'!A36)","v":""},{"$f":"IF(ISBLANK('Souhrn od začátku roku'!B36),\"\",'Souhrn od začátku roku'!B36)","v":""},0,{"$f":"COUNTIF($F36:CS36, \"O\")","v":0},{"$f":"COUNTIF($F36:CS36, \"N\")","v":0}]