{"text_format":"3","workbook":"xlsx","n_sheets":2,"sheets":["Časový rozvrh zaměstnance","Pracovní den_vyhledávání"],"not_rendered":{"defined_names":27},"read":"whole","date_system":"1900"}

{"sheet":"Časový rozvrh zaměstnance","index":0,"n_rows":36,"n_cols":26,"rows_kept":36,"merged":[[0,1,2,4],[0,5,2,9],[0,10,2,14],[0,15,3,23],[0,24,3,24],[3,1,3,3],[3,5,3,9],[3,10,3,14],[4,1,6,3],[4,4,6,6],[5,14,7,14],[5,22,7,22],[5,23,7,23],[5,24,7,24],[21,1,21,6],[22,1,23,3],[22,4,23,6],[23,14,24,14],[23,22,24,22],[23,23,24,23],[23,24,24,24],[32,1,32,6],[32,24,33,24],[32,25,33,25],[33,1,33,6],[34,1,34,6],[35,1,35,3],[35,4,35,5],[35,6,35,7],[35,8,35,14],[35,15,35,16],[35,17,35,23]]}
[null,"ČASOVÝ ROZVRH PROVOZNÍHO ZAMĚSTNANCE",{"$nulls":3},"Jméno zaměstnance",{"$nulls":9},"V buňce vpravo vyberte možnost Ano, pokud \nje vyžadováno schválení přesčasů."]
[]
[]
[null,"Mzda – koncové datum",null,null,{"$f":"V7","v":"2025-06-14"},"Číslo zaměstnance"]
[null,"NORMÁLNÍ PRACOVNÍ DOBA:",null,null,"Datum:"]
[{"$nulls":14},"Celkem týden 1\nnormální pracovní doba",{"$nulls":7},"Celkem týden 2\nnormální pracovní doba","Celkem\nhodin normální\npracovní doby","Mzda – jenom\nmzdový kód"]
[{"$nulls":7},"2025-06-01",{"$f":"Den_jedna+1","v":"2025-06-02"},{"$f":"Den_jedna+2","v":"2025-06-03"},{"$f":"Den_jedna+3","v":"2025-06-04"},{"$f":"Den_jedna+4","v":"2025-06-05"},{"$f":"Den_jedna+5","v":"2025-06-06"},{"$f":"Den_jedna+6","v":"2025-06-07"},null,{"$f":"Den_jedna+7","v":"2025-06-08"},{"$f":"Den_jedna+8","v":"2025-06-09"},{"$f":"Den_jedna+9","v":"2025-06-10"},{"$f":"Den_jedna+10","v":"2025-06-11"},{"$f":"Den_jedna+11","v":"2025-06-12"},{"$f":"Den_jedna+12","v":"2025-06-13"},{"$f":"Den_jedna+13","v":"2025-06-14"}]
[null,"Úkol","Umístění","Pracovní příkaz","Popis práce","Název pozice","Funkce",{"$f":"VLOOKUP(WEEKDAY(Den_jedna),'Pracovní den_vyhledávání'!$B$2:$C$8,2)","v":"Ne"},{"$f":"VLOOKUP(WEEKDAY(I7),'Pracovní den_vyhledávání'!$B$2:$C$8,2)","v":"Po"},{"$f":"VLOOKUP(WEEKDAY(J7),'Pracovní den_vyhledávání'!$B$2:$C$8,2)","v":"Út"},{"$f":"VLOOKUP(WEEKDAY(K7),'Pracovní den_vyhledávání'!$B$2:$C$8,2)","v":"St"},{"$f":"VLOOKUP(WEEKDAY(L7),'Pracovní den_vyhledávání'!$B$2:$C$8,2)","v":"Čt"},{"$f":"VLOOKUP(WEEKDAY(M7),'Pracovní den_vyhledávání'!$B$2:$C$8,2)","v":"Pá"},{"$f":"VLOOKUP(WEEKDAY(N7),'Pracovní den_vyhledávání'!$B$2:$C$8,2)","v":"So"},null,{"$f":"VLOOKUP(WEEKDAY(P7),'Pracovní den_vyhledávání'!$B$2:$C$8,2)","v":"Ne"},{"$f":"VLOOKUP(WEEKDAY(Q7),'Pracovní den_vyhledávání'!$B$2:$C$8,2)","v":"Po"},{"$f":"VLOOKUP(WEEKDAY(R7),'Pracovní den_vyhledávání'!$B$2:$C$8,2)","v":"Út"},{"$f":"VLOOKUP(WEEKDAY(S7),'Pracovní den_vyhledávání'!$B$2:$C$8,2)","v":"St"},{"$f":"VLOOKUP(WEEKDAY(T7),'Pracovní den_vyhledávání'!$B$2:$C$8,2)","v":"Čt"},{"$f":"VLOOKUP(WEEKDAY(U7),'Pracovní den_vyhledávání'!$B$2:$C$8,2)","v":"Pá"},{"$f":"VLOOKUP(WEEKDAY(V7),'Pracovní den_vyhledávání'!$B$2:$C$8,2)","v":"So"}]
[{"$nulls":14},{"$f":"SUM(H9:N9)","v":{"v":0,"d":"0.00"}},{"$nulls":7},{"$f":"SUM(P9:V9)","v":{"v":0,"d":"0.00"}},{"$f":"O9+W9","v":{"v":0,"d":"0.00"}}]
[{"$nulls":14},{"v":0,"d":"0.00"},{"$nulls":7},{"v":0,"d":"0.00"},{"v":0,"d":"0.00"}]
[{"$nulls":14},{"v":0,"d":"0.00"},{"$nulls":7},{"v":0,"d":"0.00"},{"v":0,"d":"0.00"}]
[{"$nulls":14},{"v":0,"d":"0.00"},{"$nulls":7},{"v":0,"d":"0.00"},{"v":0,"d":"0.00"}]
[{"$nulls":14},{"v":0,"d":"0.00"},{"$nulls":7},{"v":0,"d":"0.00"},{"v":0,"d":"0.00"}]
[{"$nulls":14},{"v":0,"d":"0.00"},{"$nulls":7},{"v":0,"d":"0.00"},{"v":0,"d":"0.00"}]
[{"$nulls":14},{"v":0,"d":"0.00"},{"$nulls":7},{"v":0,"d":"0.00"},{"v":0,"d":"0.00"}]
[{"$nulls":14},{"$f":"SUM(H16:N16)","v":{"v":0,"d":"0.00"}},{"$nulls":7},{"$f":"SUM(P16:V16)","v":{"v":0,"d":"0.00"}},{"$f":"O16+W16","v":{"v":0,"d":"0.00"}}]
[{"$nulls":14},{"v":0,"d":"0.00"},{"$nulls":7},{"v":0,"d":"0.00"},{"v":0,"d":"0.00"}]
[{"$nulls":14},{"v":0,"d":"0.00"},{"$nulls":7},{"v":0,"d":"0.00"},{"v":0,"d":"0.00"}]
[{"$nulls":14},{"v":0,"d":"0.00"},{"$nulls":7},{"v":0,"d":"0.00"},{"v":0,"d":"0.00"}]
[{"$nulls":14},{"v":0,"d":"0.00"},{"$nulls":7},{"v":0,"d":"0.00"},{"v":0,"d":"0.00"}]
[{"$nulls":14},{"v":0,"d":"0.00"},{"$nulls":7},{"v":0,"d":"0.00"},{"v":0,"d":"0.00"}]
[null,"Celkem hodin normální pracovní doby   ",{"$nulls":5},{"$f":"SUM(H9:H21)","v":{"v":0,"d":"0.00"}},{"v":0,"d":"0.00"},{"v":0,"d":"0.00"},{"v":0,"d":"0.00"},{"v":0,"d":"0.00"},{"v":0,"d":"0.00"},{"v":0,"d":"0.00"},{"v":0,"d":"0.00"},{"v":0,"d":"0.00"},{"$f":"SUM(Q9:Q21)","v":{"v":0,"d":"0.00"}},{"v":0,"d":"0.00"},{"v":0,"d":"0.00"},{"v":0,"d":"0.00"},{"v":0,"d":"0.00"},{"v":0,"d":"0.00"},{"$f":"SUM(W9:W21)","v":{"v":0,"d":"0.00"}},{"$f":"SUM(X9:X21)","v":{"v":0,"d":"0.00"}}]
[null,"PŘESČASOVÉ HODINY:",null,null,"Datum:"]
[{"$nulls":7},{"$f":"Den_jedna","v":"2025-06-01"},{"$f":"Den_jedna+1","v":"2025-06-02"},{"$f":"Den_jedna+2","v":"2025-06-03"},{"$f":"Den_jedna+3","v":"2025-06-04"},{"$f":"Den_jedna+4","v":"2025-06-05"},{"$f":"Den_jedna+5","v":"2025-06-06"},{"$f":"Den_jedna+6","v":"2025-06-07"},"Týden 1 – přesčasy",{"$f":"Den_jedna+7","v":"2025-06-08"},{"$f":"Den_jedna+8","v":"2025-06-09"},{"$f":"Den_jedna+9","v":"2025-06-10"},{"$f":"Den_jedna+10","v":"2025-06-11"},{"$f":"Den_jedna+11","v":"2025-06-12"},{"$f":"Den_jedna+12","v":"2025-06-13"},{"$f":"Den_jedna+13","v":"2025-06-14"},"Týden 2 – přesčasy","Celkem – přesčasy","Přesčasy – kód"]
[null,"Úkol","Umístění","Pracovní příkaz","Popis práce","Název pozice","Funkce",{"$f":"VLOOKUP(WEEKDAY(Den_jedna),'Pracovní den_vyhledávání'!$B$2:$C$8,2)","v":"Ne"},{"$f":"VLOOKUP(WEEKDAY(I24),'Pracovní den_vyhledávání'!$B$2:$C$8,2)","v":"Po"},{"$f":"VLOOKUP(WEEKDAY(J24),'Pracovní den_vyhledávání'!$B$2:$C$8,2)","v":"Út"},{"$f":"VLOOKUP(WEEKDAY(K24),'Pracovní den_vyhledávání'!$B$2:$C$8,2)","v":"St"},{"$f":"VLOOKUP(WEEKDAY(L24),'Pracovní den_vyhledávání'!$B$2:$C$8,2)","v":"Čt"},{"$f":"VLOOKUP(WEEKDAY(M24),'Pracovní den_vyhledávání'!$B$2:$C$8,2)","v":"Pá"},{"$f":"VLOOKUP(WEEKDAY(N24),'Pracovní den_vyhledávání'!$B$2:$C$8,2)","v":"So"},null,{"$f":"VLOOKUP(WEEKDAY(P24),'Pracovní den_vyhledávání'!$B$2:$C$8,2)","v":"Ne"},{"$f":"VLOOKUP(WEEKDAY(Q24),'Pracovní den_vyhledávání'!$B$2:$C$8,2)","v":"Po"},{"$f":"VLOOKUP(WEEKDAY(R24),'Pracovní den_vyhledávání'!$B$2:$C$8,2)","v":"Út"},{"$f":"VLOOKUP(WEEKDAY(S24),'Pracovní den_vyhledávání'!$B$2:$C$8,2)","v":"St"},{"$f":"VLOOKUP(WEEKDAY(T24),'Pracovní den_vyhledávání'!$B$2:$C$8,2)","v":"Čt"},{"$f":"VLOOKUP(WEEKDAY(U24),'Pracovní den_vyhledávání'!$B$2:$C$8,2)","v":"Pá"},{"$f":"VLOOKUP(WEEKDAY(V24),'Pracovní den_vyhledávání'!$B$2:$C$8,2)","v":"So"}]
[{"$nulls":14},{"$f":"SUM(H26:N26)","v":{"v":0,"d":"0.00"}},{"$nulls":7},{"$f":"SUM(P26:V26)","v":{"v":0,"d":"0.00"}},{"$f":"O26+W26","v":{"v":0,"d":"0.00"}}]
[{"$nulls":14},{"v":0,"d":"0.00"},{"$nulls":7},{"v":0,"d":"0.00"},{"v":0,"d":"0.00"}]
[{"$nulls":14},{"v":0,"d":"0.00"},{"$nulls":7},{"v":0,"d":"0.00"},{"v":0,"d":"0.00"}]
[{"$nulls":14},{"v":0,"d":"0.00"},{"$nulls":7},{"v":0,"d":"0.00"},{"v":0,"d":"0.00"}]
[{"$nulls":14},{"v":0,"d":"0.00"},{"$nulls":7},{"v":0,"d":"0.00"},{"v":0,"d":"0.00"}]
[{"$nulls":14},{"v":0,"d":"0.00"},{"$nulls":7},{"v":0,"d":"0.00"},{"v":0,"d":"0.00"}]
[{"$nulls":14},{"v":0,"d":"0.00"},{"$nulls":7},{"v":0,"d":"0.00"},{"v":0,"d":"0.00"}]
[null,"Celkem přesčasových hodin     ",{"$nulls":5},{"$f":"SUM(H26:H32)","v":{"v":0,"d":"0.00"}},{"v":0,"d":"0.00"},{"v":0,"d":"0.00"},{"v":0,"d":"0.00"},{"v":0,"d":"0.00"},{"v":0,"d":"0.00"},{"v":0,"d":"0.00"},{"$f":"SUM(O26:O32)","v":{"v":0,"d":"0.00"}},{"v":0,"d":"0.00"},{"v":0,"d":"0.00"},{"v":0,"d":"0.00"},{"v":0,"d":"0.00"},{"v":0,"d":"0.00"},{"v":0,"d":"0.00"},{"v":0,"d":"0.00"},{"$f":"SUM(P33:V33)","v":{"v":0,"d":"0.00"}},{"$f":"SUM(X26:X32)","v":{"v":0,"d":"0.00"}},"Celkem\nodpracovaných\nhodin","Celkem\nzaplacených\nhodin"]
[null,"Přesčasy – náhrada     ",{"$nulls":12},{"$f":"IF(SUM(H34:N34)<=O33,SUM(H34:N34),O33)","v":{"v":0,"d":"0.00"}},{"$nulls":7},{"$f":"IF(SUM(P34:V34)<=W33,SUM(P34:V34),W33)","v":{"v":0,"d":"0.00"}},{"$f":"IF(SUM(Q34:W34)<=X33,SUM(Q34:W34),X33)","v":{"v":0,"d":"0.00"}}]
[null,"Přesčasy – zaplaceno     ",{"$nulls":5},{"$f":"IF(H33>=H34,H33-H34,H33)","v":{"v":0,"d":"0.00"}},{"$f":"IF(I33>=I34,I33-I34,I33)","v":{"v":0,"d":"0.00"}},{"v":0,"d":"0.00"},{"v":0,"d":"0.00"},{"v":0,"d":"0.00"},{"v":0,"d":"0.00"},{"v":0,"d":"0.00"},{"v":0,"d":"0.00"},{"v":0,"d":"0.00"},{"v":0,"d":"0.00"},{"v":0,"d":"0.00"},{"v":0,"d":"0.00"},{"v":0,"d":"0.00"},{"v":0,"d":"0.00"},{"v":0,"d":"0.00"},{"$f":"IF(W33>=W34,W33-W34,W33)","v":{"v":0,"d":"0.00"}},{"$f":"IF(X33>=X34,X33-X34,X33)","v":{"v":0,"d":"0.00"}},{"$f":"$X$22+$X$33","v":{"v":0,"d":"0.00"}},{"$f":"X22+X35","v":{"v":0,"d":"0.00"}}]
[null,"Zaměstnanec ",{"$nulls":4},"Nadřízený ",{"$nulls":8},"Nadřízený "]

{"sheet":"Pracovní den_vyhledávání","index":1,"n_rows":8,"n_cols":3,"rows_kept":8}
[null,"Den v týdnu\n– celé číslo","Den v týdnu\n– zkratka"]
[null,1,"Ne"]
[null,2,"Po"]
[null,3,"Út"]
[null,4,"St"]
[null,5,"Čt"]
[null,6,"Pá"]
[null,7,"So"]