{"text_format":"3","workbook":"xlsx","n_sheets":4,"sheets":["Начало","ПАРАМЕТРИ НА ПРОЕКТИ","ПОДРОБНОСТИ ЗА ПРОЕКТИ","ОБЩИ СУМИ ЗА ПРОЕКТИТЕ"],"not_rendered":{"charts":2,"defined_names":3,"pivot_tables":1},"read":"whole","date_system":"1900"}

{"sheet":"Начало","index":0,"n_rows":8,"n_cols":2,"rows_kept":8}
[null,"ЗА ТОЗИ ШАБЛОН"]
[]
[null,"Използвайте тази работна книга, за да проследявате параметри на проекти, подробности за проекти и общите суми по време на планиране на проекти за юридически фирми."]
[null,"Попълнете име на фирма в работния лист \"Параметри на проекти\", и то се актуализира автоматично в другите работни листове."]
[null,"Въведете информация в работния лист \"Параметри на проекти\", за да актуализирате колонните диаграми, и в работния лист \"Подробности за проекти\". Обобщената таблица в работния лист \"Общи суми за проектите\" се актуализира автоматично."]
[null,"Забележка:  "]
{"$rows_left_out":3}
{"sheet":"ПАРАМЕТРИ НА ПРОЕКТИ","index":1,"n_rows":19,"n_cols":9,"rows_kept":19}
["В този работен лист създайте параметри на проекти. Въведете име на фирма в клетката вдясно. В клетките в тази колона има полезни инструкции.","Име на фирма"]
["Заглавието на този работен лист е в клетката вдясно.","Планиране на проекти за юридически фирми"]
["Съобщението за поверителност е в клетка вдясно.",{"$f":"\"Поверително за \"&B1","v":"Поверително за Име на фирма"}]
["Съветът е в клетката вдясно.","Оцветените клетки се изчисляват автоматично. Не трябва да въвеждате нищо в тях."]
["Въведете подробности в таблицата \"Параметри\", като започнете от клетката вдясно. Следващата инструкция е в клетка A12.","ТИП ПРОЕКТ","ОБЩ ПАРТНЬОР","БИЗНЕС ЮРИСТ","ЗАЩИТНИК ПО ДЕЛО","ЮРИСТ ПО ИНТЕЛЕКТУАЛНА СОБСТВЕНОСТ","ЮРИСТ ПО НЕСЪСТОЯТЕЛНОСТ","АДМИНИСТРАТИВЕН ПЕРСОНАЛ","ОБЩО"]
[null,"Обединяване на бизнес",{"v":0.1,"d":"10%"},{"v":0.4,"d":"40%"},{"v":0,"d":"0%"},{"v":0,"d":"0%"},{"v":0,"d":"0%"},{"v":0.5,"d":"50%"},{"$f":"SUM(Параметри[[#This Row],[ОБЩ ПАРТНЬОР]:[АДМИНИСТРАТИВЕН ПЕРСОНАЛ]])","v":{"v":1,"d":"100%"}}]
{"$rows_left_out":14}
{"sheet":"ПОДРОБНОСТИ ЗА ПРОЕКТИ","index":2,"n_rows":10,"n_cols":25,"rows_kept":10,"merged":[[1,24,8,28]]}
["В този работен лист създайте подробности за проекти. Име на фирма се актуализира автоматично в клетката вдясно. В клетките в тази колона има полезни инструкции. Натиснете стрелката надолу, за да започнете.",{"$f":"'ПАРАМЕТРИ НА ПРОЕКТИ'!B1","v":"Име на фирма"}]
["Заглавието на този работен лист е в клетката вдясно, а съветът с информация – в клетка Y2.",{"$f":"'ПАРАМЕТРИ НА ПРОЕКТИ'!B2","v":"Планиране на проекти за юридически фирми"},{"$nulls":22},"ИНФОРМАЦИЯ:\nЗа добавяне на ред изберете клетката най-долу вдясно в тялото на таблицата (а не в сумарния ред) и натиснете клавиша Tab или натиснете SHIFT и след това F10 в таблицата там, където искате да се вмъкне редът, след което изберете \"Вмъкни\" | Редове за таблица отгоре/отдолу\".\nНе забравяйте да изтриете всички неизползвани редове, тъй като обобщената таблица ОБЩИ СУМИ ЗА ПРОЕКТИТЕ ще използва всички клетки на таблиците и в противен случай ще върне грешни резултати."]
["Съобщението за поверителност е в клетка вдясно.",{"$f":"'ПАРАМЕТРИ НА ПРОЕКТИ'!B3","v":"Поверително за Име на фирма"}]
["Въведете информация в таблицата \"Подробности\", като започнете от клетката вдясно. Тип проект в таблицата \"Подробности\" вдясно се актуализират автоматично от таблицата \"Параметри\" в работния лист \"Параметри на проекти\".","ИМЕ НА ПРОЕКТ","ТИП ПРОЕКТ","ОЧАКВАНО НАЧАЛО","ОЧАКВАН КРАЙ","ДЕЙСТВИТЕЛНО НАЧАЛО","ДЕЙСТВИТЕЛЕН КРАЙ","ОЧАКВАНА РАБОТА","ДЕЙСТВИТЕЛНА РАБОТА","ОЧАКВАНА ПРОДЪЛЖИТЕЛНОСТ","ДЕЙСТВИТЕЛНА ПРОДЪЛЖИТЕЛНОСТ","ОБЩ ПАРТНЬОР","БИЗНЕС ЮРИСТ","ЗАЩИТНИК ПО ДЕЛО","ЮРИСТ ПО ИНТЕЛЕКТУАЛНА СОБСТВЕНОСТ","ЮРИСТ ПО НЕСЪСТОЯТЕЛНОСТ","АДМИНИСТРАТИВЕН ПЕРСОНАЛ","ОБЩ ПАРТНЬОР 2","БИЗНЕС ЮРИСТ 2","ЗАЩИТНИК ПО ДЕЛО 2","ЮРИСТ ПО ИНТЕЛЕКТУАЛНА СОБСТВЕНОСТ 2","ЮРИСТ ПО НЕСЪСТОЯТЕЛНОСТ 2","АДМИНИСТРАТИВЕН ПЕРСОНАЛ 2"]
[null,"Проект 1","Обединяване на бизнес",{"$f":"TODAY()","v":"2019-02-18"},{"$f":"TODAY()+60","v":"2019-04-19"},{"$f":"TODAY()+10","v":"2019-02-28"},{"$f":"TODAY()+65","v":"2019-04-24"},200,220,{"$f":"DAYS360(Подробности[[#This Row],[ОЧАКВАНО НАЧАЛО]],Подробности[[#This Row],[ОЧАКВАН КРАЙ]],FALSE)","v":61},{"$f":"DAYS360(Подробности[[#This Row],[ДЕЙСТВИТЕЛНО НАЧАЛО]],Подробности[[#This Row],[ДЕЙСТВИТЕЛЕН КРАЙ]],FALSE)","v":54},{"$f":"INDEX(Параметри[],MATCH(Подробности[[#This Row],[ТИП ПРОЕКТ]],Параметри[ТИП ПРОЕКТ],0),MATCH(Подробности[[#Headers],[ОБЩ ПАРТНЬОР]],Параметри[#Headers],0))*INDEX('ПАРАМЕТРИ НА ПРОЕКТИ'!$B$12:$H$12,1,MATCH(Подробности[[#Headers],[ОБЩ ПАРТНЬОР]],Параметри[#Headers],0))*Подробности[[#This Row],[ОЧАКВАНА РАБОТА]]","v":{"v":7000,"d":"7,000 лв."}},{"$f":"INDEX(Параметри[],MATCH(Подробности[[#This Row],[ТИП ПРОЕКТ]],Параметри[ТИП ПРОЕКТ],0),MATCH(Подробности[[#Headers],[БИЗНЕС ЮРИСТ]],Параметри[#Headers],0))*INDEX('ПАРАМЕТРИ НА ПРОЕКТИ'!$B$12:$H$12,1,MATCH(Подробности[[#Headers],[БИЗНЕС ЮРИСТ]],Параметри[#Headers],0))*Подробности[[#This Row],[ОЧАКВАНА РАБОТА]]","v":{"v":20000,"d":"20,000 лв."}},{"$f":"INDEX(Параметри[],MATCH(Подробности[[#This Row],[ТИП ПРОЕКТ]],Параметри[ТИП ПРОЕКТ],0),MATCH(Подробности[[#Headers],[ЗАЩИТНИК ПО ДЕЛО]],Параметри[#Headers],0))*INDEX('ПАРАМЕТРИ НА ПРОЕКТИ'!$B$12:$H$12,1,MATCH(Подробности[[#Headers],[ЗАЩИТНИК ПО ДЕЛО]],Параметри[#Headers],0))*Подробности[[#This Row],[ОЧАКВАНА РАБОТА]]","v":{"v":0,"d":"0 лв."}},{"$f":"INDEX(Параметри[],MATCH(Подробности[[#This Row],[ТИП ПРОЕКТ]],Параметри[ТИП ПРОЕКТ],0),MATCH(Подробности[[#Headers],[ЮРИСТ ПО ИНТЕЛЕКТУАЛНА СОБСТВЕНОСТ]],Параметри[#Headers],0))*INDEX('ПАРАМЕТРИ НА ПРОЕКТИ'!$B$12:$H$12,1,MATCH(Подробности[[#Headers],[ЮРИСТ ПО ИНТЕЛЕКТУАЛНА СОБСТВЕНОСТ]],Параметри[#Headers],0))*Подробности[[#This Row],[ОЧАКВАНА РАБОТА]]","v":{"v":0,"d":"0 лв."}},{"$f":"INDEX(Параметри[],MATCH(Подробности[[#This Row],[ТИП ПРОЕКТ]],Параметри[ТИП ПРОЕКТ],0),MATCH(Подробности[[#Headers],[ЮРИСТ ПО НЕСЪСТОЯТЕЛНОСТ]],Параметри[#Headers],0))*INDEX('ПАРАМЕТРИ НА ПРОЕКТИ'!$B$12:$H$12,1,MATCH(Подробности[[#Headers],[ЮРИСТ ПО НЕСЪСТОЯТЕЛНОСТ]],Параметри[#Headers],0))*Подробности[[#This Row],[ОЧАКВАНА РАБОТА]]","v":{"v":0,"d":"0 лв."}},{"$f":"INDEX(Параметри[],MATCH(Подробности[[#This Row],[ТИП ПРОЕКТ]],Параметри[ТИП ПРОЕКТ],0),MATCH(Подробности[[#Headers],[АДМИНИСТРАТИВЕН ПЕРСОНАЛ]],Параметри[#Headers],0))*INDEX('ПАРАМЕТРИ НА ПРОЕКТИ'!$B$12:$H$12,1,MATCH(Подробности[[#Headers],[АДМИНИСТРАТИВЕН ПЕРСОНАЛ]],Параметри[#Headers],0))*Подробности[[#This Row],[ОЧАКВАНА РАБОТА]]","v":{"v":12500,"d":"12,500 лв."}},{"$f":"INDEX(Параметри[],MATCH(Подробности[[#This Row],[ТИП ПРОЕКТ]],Параметри[ТИП ПРОЕКТ],0),MATCH(Подробности[[#Headers],[ОБЩ ПАРТНЬОР]],Параметри[#Headers],0))*INDEX('ПАРАМЕТРИ НА ПРОЕКТИ'!$B$12:$H$12,1,MATCH(Подробности[[#Headers],[ОБЩ ПАРТНЬОР]],Параметри[#Headers],0))*Подробности[[#This Row],[ДЕЙСТВИТЕЛНА РАБОТА]]","v":{"v":7700,"d":"7,700 лв."}},{"$f":"INDEX(Параметри[],MATCH(Подробности[[#This Row],[ТИП ПРОЕКТ]],Параметри[ТИП ПРОЕКТ],0),MATCH(Подробности[[#Headers],[БИЗНЕС ЮРИСТ]],Параметри[#Headers],0))*INDEX('ПАРАМЕТРИ НА ПРОЕКТИ'!$B$12:$H$12,1,MATCH(Подробности[[#Headers],[БИЗНЕС ЮРИСТ]],Параметри[#Headers],0))*Подробности[[#This Row],[ДЕЙСТВИТЕЛНА РАБОТА]]","v":{"v":22000,"d":"22,000 лв."}},{"$f":"INDEX(Параметри[],MATCH(Подробности[[#This Row],[ТИП ПРОЕКТ]],Параметри[ТИП ПРОЕКТ],0),MATCH(Подробности[[#Headers],[ЗАЩИТНИК ПО ДЕЛО]],Параметри[#Headers],0))*INDEX('ПАРАМЕТРИ НА ПРОЕКТИ'!$B$12:$H$12,1,MATCH(Подробности[[#Headers],[ЗАЩИТНИК ПО ДЕЛО]],Параметри[#Headers],0))*Подробности[[#This Row],[ДЕЙСТВИТЕЛНА РАБОТА]]","v":{"v":0,"d":"0 лв."}},{"$f":"INDEX(Параметри[],MATCH(Подробности[[#This Row],[ТИП ПРОЕКТ]],Параметри[ТИП ПРОЕКТ],0),MATCH(Подробности[[#Headers],[ЮРИСТ ПО ИНТЕЛЕКТУАЛНА СОБСТВЕНОСТ]],Параметри[#Headers],0))*INDEX('ПАРАМЕТРИ НА ПРОЕКТИ'!$B$12:$H$12,1,MATCH(Подробности[[#Headers],[ЮРИСТ ПО ИНТЕЛЕКТУАЛНА СОБСТВЕНОСТ]],Параметри[#Headers],0))*Подробности[[#This Row],[ДЕЙСТВИТЕЛНА РАБОТА]]","v":{"v":0,"d":"0 лв."}},{"$f":"INDEX(Параметри[],MATCH(Подробности[[#This Row],[ТИП ПРОЕКТ]],Параметри[ТИП ПРОЕКТ],0),MATCH(Подробности[[#Headers],[ЮРИСТ ПО НЕСЪСТОЯТЕЛНОСТ]],Параметри[#Headers],0))*INDEX('ПАРАМЕТРИ НА ПРОЕКТИ'!$B$12:$H$12,1,MATCH(Подробности[[#Headers],[ЮРИСТ ПО НЕСЪСТОЯТЕЛНОСТ]],Параметри[#Headers],0))*Подробности[[#This Row],[ДЕЙСТВИТЕЛНА РАБОТА]]","v":{"v":0,"d":"0 лв."}},{"$f":"INDEX(Параметри[],MATCH(Подробности[[#This Row],[ТИП ПРОЕКТ]],Параметри[ТИП ПРОЕКТ],0),MATCH(Подробности[[#Headers],[АДМИНИСТРАТИВЕН ПЕРСОНАЛ]],Параметри[#Headers],0))*INDEX('ПАРАМЕТРИ НА ПРОЕКТИ'!$B$12:$H$12,1,MATCH(Подробности[[#Headers],[АДМИНИСТРАТИВЕН ПЕРСОНАЛ]],Параметри[#Headers],0))*Подробности[[#This Row],[ДЕЙСТВИТЕЛНА РАБОТА]]","v":{"v":13750,"d":"13,750 лв."}}]
[null,"Проект 2","Придобиване на бизнес",{"$f":"TODAY()+30","v":"2019-03-20"},{"$f":"TODAY()+100","v":"2019-05-29"},{"$f":"TODAY()+40","v":"2019-03-30"},{"$f":"TODAY()+110","v":"2019-06-08"},400,390,{"$f":"DAYS360(Подробности[[#This Row],[ОЧАКВАНО НАЧАЛО]],Подробности[[#This Row],[ОЧАКВАН КРАЙ]],FALSE)","v":69},{"$f":"DAYS360(Подробности[[#This Row],[ДЕЙСТВИТЕЛНО НАЧАЛО]],Подробности[[#This Row],[ДЕЙСТВИТЕЛЕН КРАЙ]],FALSE)","v":68},{"$f":"INDEX(Параметри[],MATCH(Подробности[[#This Row],[ТИП ПРОЕКТ]],Параметри[ТИП ПРОЕКТ],0),MATCH(Подробности[[#Headers],[ОБЩ ПАРТНЬОР]],Параметри[#Headers],0))*INDEX('ПАРАМЕТРИ НА ПРОЕКТИ'!$B$12:$H$12,1,MATCH(Подробности[[#Headers],[ОБЩ ПАРТНЬОР]],Параметри[#Headers],0))*Подробности[[#This Row],[ОЧАКВАНА РАБОТА]]","v":{"v":14000,"d":"14,000 лв."}},{"$f":"INDEX(Параметри[],MATCH(Подробности[[#This Row],[ТИП ПРОЕКТ]],Параметри[ТИП ПРОЕКТ],0),MATCH(Подробности[[#Headers],[БИЗНЕС ЮРИСТ]],Параметри[#Headers],0))*INDEX('ПАРАМЕТРИ НА ПРОЕКТИ'!$B$12:$H$12,1,MATCH(Подробности[[#Headers],[БИЗНЕС ЮРИСТ]],Параметри[#Headers],0))*Подробности[[#This Row],[ОЧАКВАНА РАБОТА]]","v":{"v":40000,"d":"40,000 лв."}},{"$f":"INDEX(Параметри[],MATCH(Подробности[[#This Row],[ТИП ПРОЕКТ]],Параметри[ТИП ПРОЕКТ],0),MATCH(Подробности[[#Headers],[ЗАЩИТНИК ПО ДЕЛО]],Параметри[#Headers],0))*INDEX('ПАРАМЕТРИ НА ПРОЕКТИ'!$B$12:$H$12,1,MATCH(Подробности[[#Headers],[ЗАЩИТНИК ПО ДЕЛО]],Параметри[#Headers],0))*Подробности[[#This Row],[ОЧАКВАНА РАБОТА]]","v":{"v":0,"d":"0 лв."}},{"$f":"INDEX(Параметри[],MATCH(Подробности[[#This Row],[ТИП ПРОЕКТ]],Параметри[ТИП ПРОЕКТ],0),MATCH(Подробности[[#Headers],[ЮРИСТ ПО ИНТЕЛЕКТУАЛНА СОБСТВЕНОСТ]],Параметри[#Headers],0))*INDEX('ПАРАМЕТРИ НА ПРОЕКТИ'!$B$12:$H$12,1,MATCH(Подробности[[#Headers],[ЮРИСТ ПО ИНТЕЛЕКТУАЛНА СОБСТВЕНОСТ]],Параметри[#Headers],0))*Подробности[[#This Row],[ОЧАКВАНА РАБОТА]]","v":{"v":11000,"d":"11,000 лв."}},{"$f":"INDEX(Параметри[],MATCH(Подробности[[#This Row],[ТИП ПРОЕКТ]],Параметри[ТИП ПРОЕКТ],0),MATCH(Подробности[[#Headers],[ЮРИСТ ПО НЕСЪСТОЯТЕЛНОСТ]],Параметри[#Headers],0))*INDEX('ПАРАМЕТРИ НА ПРОЕКТИ'!$B$12:$H$12,1,MATCH(Подробности[[#Headers],[ЮРИСТ ПО НЕСЪСТОЯТЕЛНОСТ]],Параметри[#Headers],0))*Подробности[[#This Row],[ОЧАКВАНА РАБОТА]]","v":{"v":0,"d":"0 лв."}},{"$f":"INDEX(Параметри[],MATCH(Подробности[[#This Row],[ТИП ПРОЕКТ]],Параметри[ТИП ПРОЕКТ],0),MATCH(Подробности[[#Headers],[АДМИНИСТРАТИВЕН ПЕРСОНАЛ]],Параметри[#Headers],0))*INDEX('ПАРАМЕТРИ НА ПРОЕКТИ'!$B$12:$H$12,1,MATCH(Подробности[[#Headers],[АДМИНИСТРАТИВЕН ПЕРСОНАЛ]],Параметри[#Headers],0))*Подробности[[#This Row],[ОЧАКВАНА РАБОТА]]","v":{"v":20000,"d":"20,000 лв."}},{"$f":"INDEX(Параметри[],MATCH(Подробности[[#This Row],[ТИП ПРОЕКТ]],Параметри[ТИП ПРОЕКТ],0),MATCH(Подробности[[#Headers],[ОБЩ ПАРТНЬОР]],Параметри[#Headers],0))*INDEX('ПАРАМЕТРИ НА ПРОЕКТИ'!$B$12:$H$12,1,MATCH(Подробности[[#Headers],[ОБЩ ПАРТНЬОР]],Параметри[#Headers],0))*Подробности[[#This Row],[ДЕЙСТВИТЕЛНА РАБОТА]]","v":{"v":13650,"d":"13,650 лв."}},{"$f":"INDEX(Параметри[],MATCH(Подробности[[#This Row],[ТИП ПРОЕКТ]],Параметри[ТИП ПРОЕКТ],0),MATCH(Подробности[[#Headers],[БИЗНЕС ЮРИСТ]],Параметри[#Headers],0))*INDEX('ПАРАМЕТРИ НА ПРОЕКТИ'!$B$12:$H$12,1,MATCH(Подробности[[#Headers],[БИЗНЕС ЮРИСТ]],Параметри[#Headers],0))*Подробности[[#This Row],[ДЕЙСТВИТЕЛНА РАБОТА]]","v":{"v":39000,"d":"39,000 лв."}},{"$f":"INDEX(Параметри[],MATCH(Подробности[[#This Row],[ТИП ПРОЕКТ]],Параметри[ТИП ПРОЕКТ],0),MATCH(Подробности[[#Headers],[ЗАЩИТНИК ПО ДЕЛО]],Параметри[#Headers],0))*INDEX('ПАРАМЕТРИ НА ПРОЕКТИ'!$B$12:$H$12,1,MATCH(Подробности[[#Headers],[ЗАЩИТНИК ПО ДЕЛО]],Параметри[#Headers],0))*Подробности[[#This Row],[ДЕЙСТВИТЕЛНА РАБОТА]]","v":{"v":0,"d":"0 лв."}},{"$f":"INDEX(Параметри[],MATCH(Подробности[[#This Row],[ТИП ПРОЕКТ]],Параметри[ТИП ПРОЕКТ],0),MATCH(Подробности[[#Headers],[ЮРИСТ ПО ИНТЕЛЕКТУАЛНА СОБСТВЕНОСТ]],Параметри[#Headers],0))*INDEX('ПАРАМЕТРИ НА ПРОЕКТИ'!$B$12:$H$12,1,MATCH(Подробности[[#Headers],[ЮРИСТ ПО ИНТЕЛЕКТУАЛНА СОБСТВЕНОСТ]],Параметри[#Headers],0))*Подробности[[#This Row],[ДЕЙСТВИТЕЛНА РАБОТА]]","v":{"v":10725,"d":"10,725 лв."}},{"$f":"INDEX(Параметри[],MATCH(Подробности[[#This Row],[ТИП ПРОЕКТ]],Параметри[ТИП ПРОЕКТ],0),MATCH(Подробности[[#Headers],[ЮРИСТ ПО НЕСЪСТОЯТЕЛНОСТ]],Параметри[#Headers],0))*INDEX('ПАРАМЕТРИ НА ПРОЕКТИ'!$B$12:$H$12,1,MATCH(Подробности[[#Headers],[ЮРИСТ ПО НЕСЪСТОЯТЕЛНОСТ]],Параметри[#Headers],0))*Подробности[[#This Row],[ДЕЙСТВИТЕЛНА РАБОТА]]","v":{"v":0,"d":"0 лв."}},{"$f":"INDEX(Параметри[],MATCH(Подробности[[#This Row],[ТИП ПРОЕКТ]],Параметри[ТИП ПРОЕКТ],0),MATCH(Подробности[[#Headers],[АДМИНИСТРАТИВЕН ПЕРСОНАЛ]],Параметри[#Headers],0))*INDEX('ПАРАМЕТРИ НА ПРОЕКТИ'!$B$12:$H$12,1,MATCH(Подробности[[#Headers],[АДМИНИСТРАТИВЕН ПЕРСОНАЛ]],Параметри[#Headers],0))*Подробности[[#This Row],[ДЕЙСТВИТЕЛНА РАБОТА]]","v":{"v":19500,"d":"19,500 лв."}}]
{"$rows_left_out":5}
{"sheet":"ОБЩИ СУМИ ЗА ПРОЕКТИТЕ","index":3,"n_rows":11,"n_cols":16,"rows_kept":11,"merged":[[3,2,3,7],[3,8,3,13],[3,15,14,19]]}
["Получете общи суми за проектите в този работен лист. Име на фирма се актуализира автоматично в клетката вдясно. В клетките в тази колона има полезни инструкции. Натиснете стрелката надолу, за да започнете.",{"$f":"'ПАРАМЕТРИ НА ПРОЕКТИ'!B1","v":"Име на фирма"}]
["Заглавието на този работен лист е в клетката вдясно.",{"$f":"'ПАРАМЕТРИ НА ПРОЕКТИ'!B2","v":"Планиране на проекти за юридически фирми"}]
["Съобщението за поверителност е в клетка вдясно.",{"$f":"'ПАРАМЕТРИ НА ПРОЕКТИ'!B3","v":"Поверително за Име на фирма"}]
["Етикетът \"Очаквани\" е в клетка C4, етикетът \"Действителни\" е в клетка I4, а съветът с информация – в клетка P4.",null,"ОЧАКВАНИ",{"$nulls":5},"ДЕЙСТВИТЕЛНИ",{"$nulls":6},"ИНФОРМАЦИЯ: \nТази обобщена таблица няма да се обновява автоматично.  За да я обновите, изберете я (произволна клетка в обобщената таблица), в раздела ИНСТРУМЕНТИ ЗА ОБОБЩЕНА ТАБЛИЦА | АНАЛИЗИРАНЕ изберете \"Обнови\".  Или натиснете SHIFT + F10, като изберете обобщената таблица, и след това изберете \"Обнови\"."]
["Обобщената таблица, която започва от клетката вдясно, се актуализира автоматично.","ИМЕ НА ПРОЕКТ","ОБЩ ПАРТНЬОР ","БИЗНЕС ","ЗАЩИТНИК ПО ДЕЛО ","ИНТЕЛЕКТУАЛНА СОБСТВЕНОСТ ","НЕСЪСТОЯТЕЛНОСТ ","АДМИНИСТРАТИВЕН ПЕРСОНАЛ ","ОБЩ ПАРТНЬОР  ","БИЗНЕС  ","ЗАЩИТНИК ПО ДЕЛО  ","НЕСЪСТОЯТЕЛНОСТ  ","ИНТЕЛЕКТУАЛНА СОБСТВЕНОСТ  ","АДМИНИСТРАТИВЕН ПЕРСОНАЛ  "]
[null,"Проект 1",{"v":7000,"d":"7,000.00 лв."},{"v":20000,"d":"20,000.00 лв."},{"v":0,"d":"0.00 лв."},{"v":0,"d":"0.00 лв."},{"v":0,"d":"0.00 лв."},{"v":12500,"d":"12,500.00 лв."},{"v":7700,"d":"7,700.00 лв."},{"v":22000,"d":"22,000.00 лв."},{"v":0,"d":"0.00 лв."},{"v":0,"d":"0.00 лв."},{"v":0,"d":"0.00 лв."},{"v":13750,"d":"13,750.00 лв."}]
{"$rows_left_out":5}