{"text_format":"3","workbook":"xlsx","n_sheets":3,"sheets":["Въвеждане на данни","Отчет за продажбите","Прогноза за продажбите"],"not_rendered":{"charts":5,"defined_names":8,"pivot_tables":1},"read":"whole","date_system":"1900"}

{"sheet":"Въвеждане на данни","index":0,"n_rows":24,"n_cols":17,"rows_kept":24}
[{"$nulls":9},{"$f":"365*2","v":730}]
[null,"МЕСЕЧНО ВЪВЕЖДАНЕ НА ДАННИ"]
[{"$nulls":11},"ОБЩИ СУМИ",null,null,"ПРОГНОЗА"]
[]
[null,"ДАТА","ФИРМА","СУМА","ПЛАНИРАНО","РАЗХОДИ","ПРИХОДИ","МЕСЕЦ","ТРИМЕСЕЧИЕ","ГОДИНА","МЕСЕЦ НОМЕР (СКРИЙ)","МЕСЕЦ ","ТРИМЕСЕЧИЕ ","ГОДИШНО ","МЕСЕЦ  ","ТРИМЕСЕЧИЕ  ","ГОДИНА  "]
[null,{"$f":"40657+(365*2)","v":"2013-04-23"},"A. Datum Corporation",{"v":6400,"d":"6,400.00 лв."},{"v":6200,"d":"6,200.00 лв."},{"v":4450,"d":"4,450.00 лв."},{"$f":"таблДанни[[#This Row],[СУМА]]-таблДанни[[#This Row],[РАЗХОДИ]]","v":{"v":1950,"d":"1,950.00 лв."}},{"$f":"DATE(YEAR('Въвеждане на данни'!$B6),MONTH('Въвеждане на данни'!$B6),1)","v":"2013-04-01"},{"$f":"LOOKUP(MONTH('Въвеждане на данни'!$H6),{1,1;2,1;3,1;4,2;5,2;6,2;7,3;8,3;9,3;10,4;11,4;12,4})","v":{"v":2,"d":"Тpимeceчие 2"}},{"$f":"YEAR('Въвеждане на данни'!$B6)","v":2013},{"$f":"MONTH(таблДанни[[#This Row],[ДАТА]])","v":4},{"$f":"SUMIFS(таблДанни[СУМА],таблДанни[ДАТА],\">=\"&EOMONTH(таблДанни[[#This Row],[ДАТА]],-1)+1,таблДанни[ДАТА],\"<=\"&EOMONTH(таблДанни[[#This Row],[ДАТА]],0))","v":{"v":14600,"d":"14,600.00 лв."}},{"$f":"SUMIFS(таблДанни[СУМА],таблДанни[ДАТА],\">=\"&DATE(YEAR(таблДанни[[#This Row],[ДАТА]]),1,1),таблДанни[ДАТА],\"<=\"&DATE(YEAR(таблДанни[[#This Row],[ДАТА]]),12,31),таблДанни[ТРИМЕСЕЧИЕ],таблДанни[[#This Row],[ТРИМЕСЕЧИЕ]])","v":{"v":50800,"d":"50,800.00 лв."}},{"$f":"SUMIFS(таблДанни[СУМА],таблДанни[ДАТА],\">=\"&DATE(YEAR(таблДанни[[#This Row],[ДАТА]]),1,1),таблДанни[ДАТА],\"<=\"&DATE(YEAR(таблДанни[[#This Row],[ДАТА]]),12,31))","v":{"v":143800,"d":"143,800.00 лв."}},{"$f":"IFERROR(TREND($L$6:INDEX($L:$L,ROW(),1),$K$6:INDEX($K:$K,ROW(),1),IF(MONTH(таблДанни[[#This Row],[ДАТА]])=12,13,MONTH(таблДанни[[#This Row],[ДАТА]])+1)),\"\")","v":{"v":14600,"d":"14,600.00 лв."}},{"$f":"IFERROR(TREND($M$6:INDEX($M:$M,ROW(),1),$I$6:INDEX($I:$I,ROW(),1),IF(таблДанни[[#This Row],[ТРИМЕСЕЧИЕ]]=4,5,таблДанни[[#This Row],[ТРИМЕСЕЧИЕ]]+1)),\"\")","v":{"v":50800,"d":"50,800.00 лв."}},{"$f":"IFERROR(TREND($N$6:INDEX($N:$N,ROW(),1),$J$6:INDEX($J:$J,ROW(),1),таблДанни[[#This Row],[ГОДИНА]] +1),\"\")","v":{"v":143800,"d":"143,800.00 лв."}}]
[null,{"$f":"40659+(365*2)","v":"2013-04-25"},"Contoso Pharmaceuticals",{"v":8200,"d":"8,200.00 лв."},{"v":8000,"d":"8,000.00 лв."},{"v":6400,"d":"6,400.00 лв."},{"$f":"таблДанни[[#This Row],[СУМА]]-таблДанни[[#This Row],[РАЗХОДИ]]","v":{"v":1800,"d":"1,800.00 лв."}},{"$f":"DATE(YEAR('Въвеждане на данни'!$B7),MONTH('Въвеждане на данни'!$B7),1)","v":"2013-04-01"},{"$f":"LOOKUP(MONTH('Въвеждане на данни'!$H7),{1,1;2,1;3,1;4,2;5,2;6,2;7,3;8,3;9,3;10,4;11,4;12,4})","v":{"v":2,"d":"Тpимeceчие 2"}},{"$f":"YEAR('Въвеждане на данни'!$B7)","v":2013},{"$f":"MONTH(таблДанни[[#This Row],[ДАТА]])","v":4},{"$f":"SUMIFS(таблДанни[СУМА],таблДанни[ДАТА],\">=\"&EOMONTH(таблДанни[[#This Row],[ДАТА]],-1)+1,таблДанни[ДАТА],\"<=\"&EOMONTH(таблДанни[[#This Row],[ДАТА]],0))","v":{"v":14600,"d":"14,600.00 лв."}},{"$f":"SUMIFS(таблДанни[СУМА],таблДанни[ДАТА],\">=\"&DATE(YEAR(таблДанни[[#This Row],[ДАТА]]),1,1),таблДанни[ДАТА],\"<=\"&DATE(YEAR(таблДанни[[#This Row],[ДАТА]]),12,31),таблДанни[ТРИМЕСЕЧИЕ],таблДанни[[#This Row],[ТРИМЕСЕЧИЕ]])","v":{"v":50800,"d":"50,800.00 лв."}},{"$f":"SUMIFS(таблДанни[СУМА],таблДанни[ДАТА],\">=\"&DATE(YEAR(таблДанни[[#This Row],[ДАТА]]),1,1),таблДанни[ДАТА],\"<=\"&DATE(YEAR(таблДанни[[#This Row],[ДАТА]]),12,31))","v":{"v":143800,"d":"143,800.00 лв."}},{"$f":"IFERROR(TREND($L$6:INDEX($L:$L,ROW(),1),$K$6:INDEX($K:$K,ROW(),1),IF(MONTH(таблДанни[[#This Row],[ДАТА]])=12,13,MONTH(таблДанни[[#This Row],[ДАТА]])+1)),\"\")","v":{"v":14600,"d":"14,600.00 лв."}},{"$f":"IFERROR(TREND($M$6:INDEX($M:$M,ROW(),1),$I$6:INDEX($I:$I,ROW(),1),IF(таблДанни[[#This Row],[ТРИМЕСЕЧИЕ]]=4,5,таблДанни[[#This Row],[ТРИМЕСЕЧИЕ]]+1)),\"\")","v":{"v":50800,"d":"50,800.00 лв."}},{"$f":"IFERROR(TREND($N$6:INDEX($N:$N,ROW(),1),$J$6:INDEX($J:$J,ROW(),1),таблДанни[[#This Row],[ГОДИНА]] +1),\"\")","v":{"v":143800,"d":"143,800.00 лв."}}]
[null,{"$f":"40671+(365*2)","v":"2013-05-07"},"Consolidated Messenger",{"v":4400,"d":"4,400.00 лв."},{"v":4200,"d":"4,200.00 лв."},{"v":2600,"d":"2,600.00 лв."},{"$f":"таблДанни[[#This Row],[СУМА]]-таблДанни[[#This Row],[РАЗХОДИ]]","v":{"v":1800,"d":"1,800.00 лв."}},{"$f":"DATE(YEAR('Въвеждане на данни'!$B8),MONTH('Въвеждане на данни'!$B8),1)","v":"2013-05-01"},{"$f":"LOOKUP(MONTH('Въвеждане на данни'!$H8),{1,1;2,1;3,1;4,2;5,2;6,2;7,3;8,3;9,3;10,4;11,4;12,4})","v":{"v":2,"d":"Тpимeceчие 2"}},{"$f":"YEAR('Въвеждане на данни'!$B8)","v":2013},{"$f":"MONTH(таблДанни[[#This Row],[ДАТА]])","v":5},{"$f":"SUMIFS(таблДанни[СУМА],таблДанни[ДАТА],\">=\"&EOMONTH(таблДанни[[#This Row],[ДАТА]],-1)+1,таблДанни[ДАТА],\"<=\"&EOMONTH(таблДанни[[#This Row],[ДАТА]],0))","v":{"v":21800,"d":"21,800.00 лв."}},{"$f":"SUMIFS(таблДанни[СУМА],таблДанни[ДАТА],\">=\"&DATE(YEAR(таблДанни[[#This Row],[ДАТА]]),1,1),таблДанни[ДАТА],\"<=\"&DATE(YEAR(таблДанни[[#This Row],[ДАТА]]),12,31),таблДанни[ТРИМЕСЕЧИЕ],таблДанни[[#This Row],[ТРИМЕСЕЧИЕ]])","v":{"v":50800,"d":"50,800.00 лв."}},{"$f":"SUMIFS(таблДанни[СУМА],таблДанни[ДАТА],\">=\"&DATE(YEAR(таблДанни[[#This Row],[ДАТА]]),1,1),таблДанни[ДАТА],\"<=\"&DATE(YEAR(таблДанни[[#This Row],[ДАТА]]),12,31))","v":{"v":143800,"d":"143,800.00 лв."}},{"$f":"IFERROR(TREND($L$6:INDEX($L:$L,ROW(),1),$K$6:INDEX($K:$K,ROW(),1),IF(MONTH(таблДанни[[#This Row],[ДАТА]])=12,13,MONTH(таблДанни[[#This Row],[ДАТА]])+1)),\"\")","v":{"v":28999.999999999996,"d":"29,000.00 лв."}},{"$f":"IFERROR(TREND($M$6:INDEX($M:$M,ROW(),1),$I$6:INDEX($I:$I,ROW(),1),IF(таблДанни[[#This Row],[ТРИМЕСЕЧИЕ]]=4,5,таблДанни[[#This Row],[ТРИМЕСЕЧИЕ]]+1)),\"\")","v":{"v":50800,"d":"50,800.00 лв."}},{"$f":"IFERROR(TREND($N$6:INDEX($N:$N,ROW(),1),$J$6:INDEX($J:$J,ROW(),1),таблДанни[[#This Row],[ГОДИНА]] +1),\"\")","v":{"v":143800,"d":"143,800.00 лв."}}]
[null,{"$f":"40678+(365*2)","v":"2013-05-14"},"Proseware, Inc.",{"v":5400,"d":"5,400.00 лв."},{"v":5500,"d":"5,500.00 лв."},{"v":4500,"d":"4,500.00 лв."},{"$f":"таблДанни[[#This Row],[СУМА]]-таблДанни[[#This Row],[РАЗХОДИ]]","v":{"v":900,"d":"900.00 лв."}},{"$f":"DATE(YEAR('Въвеждане на данни'!$B9),MONTH('Въвеждане на данни'!$B9),1)","v":"2013-05-01"},{"$f":"LOOKUP(MONTH('Въвеждане на данни'!$H9),{1,1;2,1;3,1;4,2;5,2;6,2;7,3;8,3;9,3;10,4;11,4;12,4})","v":{"v":2,"d":"Тpимeceчие 2"}},{"$f":"YEAR('Въвеждане на данни'!$B9)","v":2013},{"$f":"MONTH(таблДанни[[#This Row],[ДАТА]])","v":5},{"$f":"SUMIFS(таблДанни[СУМА],таблДанни[ДАТА],\">=\"&EOMONTH(таблДанни[[#This Row],[ДАТА]],-1)+1,таблДанни[ДАТА],\"<=\"&EOMONTH(таблДанни[[#This Row],[ДАТА]],0))","v":{"v":21800,"d":"21,800.00 лв."}},{"$f":"SUMIFS(таблДанни[СУМА],таблДанни[ДАТА],\">=\"&DATE(YEAR(таблДанни[[#This Row],[ДАТА]]),1,1),таблДанни[ДАТА],\"<=\"&DATE(YEAR(таблДанни[[#This Row],[ДАТА]]),12,31),таблДанни[ТРИМЕСЕЧИЕ],таблДанни[[#This Row],[ТРИМЕСЕЧИЕ]])","v":{"v":50800,"d":"50,800.00 лв."}},{"$f":"SUMIFS(таблДанни[СУМА],таблДанни[ДАТА],\">=\"&DATE(YEAR(таблДанни[[#This Row],[ДАТА]]),1,1),таблДанни[ДАТА],\"<=\"&DATE(YEAR(таблДанни[[#This Row],[ДАТА]]),12,31))","v":{"v":143800,"d":"143,800.00 лв."}},{"$f":"IFERROR(TREND($L$6:INDEX($L:$L,ROW(),1),$K$6:INDEX($K:$K,ROW(),1),IF(MONTH(таблДанни[[#This Row],[ДАТА]])=12,13,MONTH(таблДанни[[#This Row],[ДАТА]])+1)),\"\")","v":{"v":29000,"d":"29,000.00 лв."}},{"$f":"IFERROR(TREND($M$6:INDEX($M:$M,ROW(),1),$I$6:INDEX($I:$I,ROW(),1),IF(таблДанни[[#This Row],[ТРИМЕСЕЧИЕ]]=4,5,таблДанни[[#This Row],[ТРИМЕСЕЧИЕ]]+1)),\"\")","v":{"v":50800,"d":"50,800.00 лв."}},{"$f":"IFERROR(TREND($N$6:INDEX($N:$N,ROW(),1),$J$6:INDEX($J:$J,ROW(),1),таблДанни[[#This Row],[ГОДИНА]] +1),\"\")","v":{"v":143800,"d":"143,800.00 лв."}}]
[null,{"$f":"40678+(365*2)","v":"2013-05-14"},"School of Fine Art",{"v":5800,"d":"5,800.00 лв."},{"v":6000,"d":"6,000.00 лв."},{"v":4500,"d":"4,500.00 лв."},{"$f":"таблДанни[[#This Row],[СУМА]]-таблДанни[[#This Row],[РАЗХОДИ]]","v":{"v":1300,"d":"1,300.00 лв."}},{"$f":"DATE(YEAR('Въвеждане на данни'!$B10),MONTH('Въвеждане на данни'!$B10),1)","v":"2013-05-01"},{"$f":"LOOKUP(MONTH('Въвеждане на данни'!$H10),{1,1;2,1;3,1;4,2;5,2;6,2;7,3;8,3;9,3;10,4;11,4;12,4})","v":{"v":2,"d":"Тpимeceчие 2"}},{"$f":"YEAR('Въвеждане на данни'!$B10)","v":2013},{"$f":"MONTH(таблДанни[[#This Row],[ДАТА]])","v":5},{"$f":"SUMIFS(таблДанни[СУМА],таблДанни[ДАТА],\">=\"&EOMONTH(таблДанни[[#This Row],[ДАТА]],-1)+1,таблДанни[ДАТА],\"<=\"&EOMONTH(таблДанни[[#This Row],[ДАТА]],0))","v":{"v":21800,"d":"21,800.00 лв."}},{"$f":"SUMIFS(таблДанни[СУМА],таблДанни[ДАТА],\">=\"&DATE(YEAR(таблДанни[[#This Row],[ДАТА]]),1,1),таблДанни[ДАТА],\"<=\"&DATE(YEAR(таблДанни[[#This Row],[ДАТА]]),12,31),таблДанни[ТРИМЕСЕЧИЕ],таблДанни[[#This Row],[ТРИМЕСЕЧИЕ]])","v":{"v":50800,"d":"50,800.00 лв."}},{"$f":"SUMIFS(таблДанни[СУМА],таблДанни[ДАТА],\">=\"&DATE(YEAR(таблДанни[[#This Row],[ДАТА]]),1,1),таблДанни[ДАТА],\"<=\"&DATE(YEAR(таблДанни[[#This Row],[ДАТА]]),12,31))","v":{"v":143800,"d":"143,800.00 лв."}},{"$f":"IFERROR(TREND($L$6:INDEX($L:$L,ROW(),1),$K$6:INDEX($K:$K,ROW(),1),IF(MONTH(таблДанни[[#This Row],[ДАТА]])=12,13,MONTH(таблДанни[[#This Row],[ДАТА]])+1)),\"\")","v":{"v":29000,"d":"29,000.00 лв."}},{"$f":"IFERROR(TREND($M$6:INDEX($M:$M,ROW(),1),$I$6:INDEX($I:$I,ROW(),1),IF(таблДанни[[#This Row],[ТРИМЕСЕЧИЕ]]=4,5,таблДанни[[#This Row],[ТРИМЕСЕЧИЕ]]+1)),\"\")","v":{"v":50800,"d":"50,800.00 лв."}},{"$f":"IFERROR(TREND($N$6:INDEX($N:$N,ROW(),1),$J$6:INDEX($J:$J,ROW(),1),таблДанни[[#This Row],[ГОДИНА]] +1),\"\")","v":{"v":143800,"d":"143,800.00 лв."}}]
[null,{"$f":"40693+(365*2)","v":"2013-05-29"},"Trey Research",{"v":6200,"d":"6,200.00 лв."},{"v":6000,"d":"6,000.00 лв."},{"v":4500,"d":"4,500.00 лв."},{"$f":"таблДанни[[#This Row],[СУМА]]-таблДанни[[#This Row],[РАЗХОДИ]]","v":{"v":1700,"d":"1,700.00 лв."}},{"$f":"DATE(YEAR('Въвеждане на данни'!$B11),MONTH('Въвеждане на данни'!$B11),1)","v":"2013-05-01"},{"$f":"LOOKUP(MONTH('Въвеждане на данни'!$H11),{1,1;2,1;3,1;4,2;5,2;6,2;7,3;8,3;9,3;10,4;11,4;12,4})","v":{"v":2,"d":"Тpимeceчие 2"}},{"$f":"YEAR('Въвеждане на данни'!$B11)","v":2013},{"$f":"MONTH(таблДанни[[#This Row],[ДАТА]])","v":5},{"$f":"SUMIFS(таблДанни[СУМА],таблДанни[ДАТА],\">=\"&EOMONTH(таблДанни[[#This Row],[ДАТА]],-1)+1,таблДанни[ДАТА],\"<=\"&EOMONTH(таблДанни[[#This Row],[ДАТА]],0))","v":{"v":21800,"d":"21,800.00 лв."}},{"$f":"SUMIFS(таблДанни[СУМА],таблДанни[ДАТА],\">=\"&DATE(YEAR(таблДанни[[#This Row],[ДАТА]]),1,1),таблДанни[ДАТА],\"<=\"&DATE(YEAR(таблДанни[[#This Row],[ДАТА]]),12,31),таблДанни[ТРИМЕСЕЧИЕ],таблДанни[[#This Row],[ТРИМЕСЕЧИЕ]])","v":{"v":50800,"d":"50,800.00 лв."}},{"$f":"SUMIFS(таблДанни[СУМА],таблДанни[ДАТА],\">=\"&DATE(YEAR(таблДанни[[#This Row],[ДАТА]]),1,1),таблДанни[ДАТА],\"<=\"&DATE(YEAR(таблДанни[[#This Row],[ДАТА]]),12,31))","v":{"v":143800,"d":"143,800.00 лв."}},{"$f":"IFERROR(TREND($L$6:INDEX($L:$L,ROW(),1),$K$6:INDEX($K:$K,ROW(),1),IF(MONTH(таблДанни[[#This Row],[ДАТА]])=12,13,MONTH(таблДанни[[#This Row],[ДАТА]])+1)),\"\")","v":{"v":29000,"d":"29,000.00 лв."}},{"$f":"IFERROR(TREND($M$6:INDEX($M:$M,ROW(),1),$I$6:INDEX($I:$I,ROW(),1),IF(таблДанни[[#This Row],[ТРИМЕСЕЧИЕ]]=4,5,таблДанни[[#This Row],[ТРИМЕСЕЧИЕ]]+1)),\"\")","v":{"v":50800,"d":"50,800.00 лв."}},{"$f":"IFERROR(TREND($N$6:INDEX($N:$N,ROW(),1),$J$6:INDEX($J:$J,ROW(),1),таблДанни[[#This Row],[ГОДИНА]] +1),\"\")","v":{"v":143800,"d":"143,800.00 лв."}}]
[null,{"$f":"40705+(365*2)","v":"2013-06-10"},"A. Datum Corporation",{"v":6900,"d":"6,900.00 лв."},{"v":7500,"d":"7,500.00 лв."},{"v":5400,"d":"5,400.00 лв."},{"$f":"таблДанни[[#This Row],[СУМА]]-таблДанни[[#This Row],[РАЗХОДИ]]","v":{"v":1500,"d":"1,500.00 лв."}},{"$f":"DATE(YEAR('Въвеждане на данни'!$B12),MONTH('Въвеждане на данни'!$B12),1)","v":"2013-06-01"},{"$f":"LOOKUP(MONTH('Въвеждане на данни'!$H12),{1,1;2,1;3,1;4,2;5,2;6,2;7,3;8,3;9,3;10,4;11,4;12,4})","v":{"v":2,"d":"Тpимeceчие 2"}},{"$f":"YEAR('Въвеждане на данни'!$B12)","v":2013},{"$f":"MONTH(таблДанни[[#This Row],[ДАТА]])","v":6},{"$f":"SUMIFS(таблДанни[СУМА],таблДанни[ДАТА],\">=\"&EOMONTH(таблДанни[[#This Row],[ДАТА]],-1)+1,таблДанни[ДАТА],\"<=\"&EOMONTH(таблДанни[[#This Row],[ДАТА]],0))","v":{"v":14400,"d":"14,400.00 лв."}},{"$f":"SUMIFS(таблДанни[СУМА],таблДанни[ДАТА],\">=\"&DATE(YEAR(таблДанни[[#This Row],[ДАТА]]),1,1),таблДанни[ДАТА],\"<=\"&DATE(YEAR(таблДанни[[#This Row],[ДАТА]]),12,31),таблДанни[ТРИМЕСЕЧИЕ],таблДанни[[#This Row],[ТРИМЕСЕЧИЕ]])","v":{"v":50800,"d":"50,800.00 лв."}},{"$f":"SUMIFS(таблДанни[СУМА],таблДанни[ДАТА],\">=\"&DATE(YEAR(таблДанни[[#This Row],[ДАТА]]),1,1),таблДанни[ДАТА],\"<=\"&DATE(YEAR(таблДанни[[#This Row],[ДАТА]]),12,31))","v":{"v":143800,"d":"143,800.00 лв."}},{"$f":"IFERROR(TREND($L$6:INDEX($L:$L,ROW(),1),$K$6:INDEX($K:$K,ROW(),1),IF(MONTH(таблДанни[[#This Row],[ДАТА]])=12,13,MONTH(таблДанни[[#This Row],[ДАТА]])+1)),\"\")","v":{"v":21600.000000000004,"d":"21,600.00 лв."}},{"$f":"IFERROR(TREND($M$6:INDEX($M:$M,ROW(),1),$I$6:INDEX($I:$I,ROW(),1),IF(таблДанни[[#This Row],[ТРИМЕСЕЧИЕ]]=4,5,таблДанни[[#This Row],[ТРИМЕСЕЧИЕ]]+1)),\"\")","v":{"v":50800,"d":"50,800.00 лв."}},{"$f":"IFERROR(TREND($N$6:INDEX($N:$N,ROW(),1),$J$6:INDEX($J:$J,ROW(),1),таблДанни[[#This Row],[ГОДИНА]] +1),\"\")","v":{"v":143800,"d":"143,800.00 лв."}}]
[null,{"$f":"40716+(365*2)","v":"2013-06-21"},"Contoso Pharmaceuticals",{"v":7500,"d":"7,500.00 лв."},{"v":7200,"d":"7,200.00 лв."},{"v":6500,"d":"6,500.00 лв."},{"$f":"таблДанни[[#This Row],[СУМА]]-таблДанни[[#This Row],[РАЗХОДИ]]","v":{"v":1000,"d":"1,000.00 лв."}},{"$f":"DATE(YEAR('Въвеждане на данни'!$B13),MONTH('Въвеждане на данни'!$B13),1)","v":"2013-06-01"},{"$f":"LOOKUP(MONTH('Въвеждане на данни'!$H13),{1,1;2,1;3,1;4,2;5,2;6,2;7,3;8,3;9,3;10,4;11,4;12,4})","v":{"v":2,"d":"Тpимeceчие 2"}},{"$f":"YEAR('Въвеждане на данни'!$B13)","v":2013},{"$f":"MONTH(таблДанни[[#This Row],[ДАТА]])","v":6},{"$f":"SUMIFS(таблДанни[СУМА],таблДанни[ДАТА],\">=\"&EOMONTH(таблДанни[[#This Row],[ДАТА]],-1)+1,таблДанни[ДАТА],\"<=\"&EOMONTH(таблДанни[[#This Row],[ДАТА]],0))","v":{"v":14400,"d":"14,400.00 лв."}},{"$f":"SUMIFS(таблДанни[СУМА],таблДанни[ДАТА],\">=\"&DATE(YEAR(таблДанни[[#This Row],[ДАТА]]),1,1),таблДанни[ДАТА],\"<=\"&DATE(YEAR(таблДанни[[#This Row],[ДАТА]]),12,31),таблДанни[ТРИМЕСЕЧИЕ],таблДанни[[#This Row],[ТРИМЕСЕЧИЕ]])","v":{"v":50800,"d":"50,800.00 лв."}},{"$f":"SUMIFS(таблДанни[СУМА],таблДанни[ДАТА],\">=\"&DATE(YEAR(таблДанни[[#This Row],[ДАТА]]),1,1),таблДанни[ДАТА],\"<=\"&DATE(YEAR(таблДанни[[#This Row],[ДАТА]]),12,31))","v":{"v":143800,"d":"143,800.00 лв."}},{"$f":"IFERROR(TREND($L$6:INDEX($L:$L,ROW(),1),$K$6:INDEX($K:$K,ROW(),1),IF(MONTH(таблДанни[[#This Row],[ДАТА]])=12,13,MONTH(таблДанни[[#This Row],[ДАТА]])+1)),\"\")","v":{"v":17950,"d":"17,950.00 лв."}},{"$f":"IFERROR(TREND($M$6:INDEX($M:$M,ROW(),1),$I$6:INDEX($I:$I,ROW(),1),IF(таблДанни[[#This Row],[ТРИМЕСЕЧИЕ]]=4,5,таблДанни[[#This Row],[ТРИМЕСЕЧИЕ]]+1)),\"\")","v":{"v":50800,"d":"50,800.00 лв."}},{"$f":"IFERROR(TREND($N$6:INDEX($N:$N,ROW(),1),$J$6:INDEX($J:$J,ROW(),1),таблДанни[[#This Row],[ГОДИНА]] +1),\"\")","v":{"v":143800,"d":"143,800.00 лв."}}]
[null,{"$f":"40731+(365*2)","v":"2013-07-06"},"Consolidated Messenger",{"v":8700,"d":"8,700.00 лв."},{"v":8500,"d":"8,500.00 лв."},{"v":7250,"d":"7,250.00 лв."},{"$f":"таблДанни[[#This Row],[СУМА]]-таблДанни[[#This Row],[РАЗХОДИ]]","v":{"v":1450,"d":"1,450.00 лв."}},{"$f":"DATE(YEAR('Въвеждане на данни'!$B14),MONTH('Въвеждане на данни'!$B14),1)","v":"2013-07-01"},{"$f":"LOOKUP(MONTH('Въвеждане на данни'!$H14),{1,1;2,1;3,1;4,2;5,2;6,2;7,3;8,3;9,3;10,4;11,4;12,4})","v":{"v":3,"d":"Тpимeceчие 3"}},{"$f":"YEAR('Въвеждане на данни'!$B14)","v":2013},{"$f":"MONTH(таблДанни[[#This Row],[ДАТА]])","v":7},{"$f":"SUMIFS(таблДанни[СУМА],таблДанни[ДАТА],\">=\"&EOMONTH(таблДанни[[#This Row],[ДАТА]],-1)+1,таблДанни[ДАТА],\"<=\"&EOMONTH(таблДанни[[#This Row],[ДАТА]],0))","v":{"v":8700,"d":"8,700.00 лв."}},{"$f":"SUMIFS(таблДанни[СУМА],таблДанни[ДАТА],\">=\"&DATE(YEAR(таблДанни[[#This Row],[ДАТА]]),1,1),таблДанни[ДАТА],\"<=\"&DATE(YEAR(таблДанни[[#This Row],[ДАТА]]),12,31),таблДанни[ТРИМЕСЕЧИЕ],таблДанни[[#This Row],[ТРИМЕСЕЧИЕ]])","v":{"v":49100,"d":"49,100.00 лв."}},{"$f":"SUMIFS(таблДанни[СУМА],таблДанни[ДАТА],\">=\"&DATE(YEAR(таблДанни[[#This Row],[ДАТА]]),1,1),таблДанни[ДАТА],\"<=\"&DATE(YEAR(таблДанни[[#This Row],[ДАТА]]),12,31))","v":{"v":143800,"d":"143,800.00 лв."}},{"$f":"IFERROR(TREND($L$6:INDEX($L:$L,ROW(),1),$K$6:INDEX($K:$K,ROW(),1),IF(MONTH(таблДанни[[#This Row],[ДАТА]])=12,13,MONTH(таблДанни[[#This Row],[ДАТА]])+1)),\"\")","v":{"v":10776.470588235294,"d":"10,776.47 лв."}},{"$f":"IFERROR(TREND($M$6:INDEX($M:$M,ROW(),1),$I$6:INDEX($I:$I,ROW(),1),IF(таблДанни[[#This Row],[ТРИМЕСЕЧИЕ]]=4,5,таблДанни[[#This Row],[ТРИМЕСЕЧИЕ]]+1)),\"\")","v":{"v":47400,"d":"47,400.00 лв."}},{"$f":"IFERROR(TREND($N$6:INDEX($N:$N,ROW(),1),$J$6:INDEX($J:$J,ROW(),1),таблДанни[[#This Row],[ГОДИНА]] +1),\"\")","v":{"v":143800,"d":"143,800.00 лв."}}]
[null,{"$f":"40761+(365*2)","v":"2013-08-05"},"Proseware, Inc.",{"v":8500,"d":"8,500.00 лв."},{"v":8300,"d":"8,300.00 лв."},{"v":7100,"d":"7,100.00 лв."},{"$f":"таблДанни[[#This Row],[СУМА]]-таблДанни[[#This Row],[РАЗХОДИ]]","v":{"v":1400,"d":"1,400.00 лв."}},{"$f":"DATE(YEAR('Въвеждане на данни'!$B15),MONTH('Въвеждане на данни'!$B15),1)","v":"2013-08-01"},{"$f":"LOOKUP(MONTH('Въвеждане на данни'!$H15),{1,1;2,1;3,1;4,2;5,2;6,2;7,3;8,3;9,3;10,4;11,4;12,4})","v":{"v":3,"d":"Тpимeceчие 3"}},{"$f":"YEAR('Въвеждане на данни'!$B15)","v":2013},{"$f":"MONTH(таблДанни[[#This Row],[ДАТА]])","v":8},{"$f":"SUMIFS(таблДанни[СУМА],таблДанни[ДАТА],\">=\"&EOMONTH(таблДанни[[#This Row],[ДАТА]],-1)+1,таблДанни[ДАТА],\"<=\"&EOMONTH(таблДанни[[#This Row],[ДАТА]],0))","v":{"v":16400,"d":"16,400.00 лв."}},{"$f":"SUMIFS(таблДанни[СУМА],таблДанни[ДАТА],\">=\"&DATE(YEAR(таблДанни[[#This Row],[ДАТА]]),1,1),таблДанни[ДАТА],\"<=\"&DATE(YEAR(таблДанни[[#This Row],[ДАТА]]),12,31),таблДанни[ТРИМЕСЕЧИЕ],таблДанни[[#This Row],[ТРИМЕСЕЧИЕ]])","v":{"v":49100,"d":"49,100.00 лв."}},{"$f":"SUMIFS(таблДанни[СУМА],таблДанни[ДАТА],\">=\"&DATE(YEAR(таблДанни[[#This Row],[ДАТА]]),1,1),таблДанни[ДАТА],\"<=\"&DATE(YEAR(таблДанни[[#This Row],[ДАТА]]),12,31))","v":{"v":143800,"d":"143,800.00 лв."}},{"$f":"IFERROR(TREND($L$6:INDEX($L:$L,ROW(),1),$K$6:INDEX($K:$K,ROW(),1),IF(MONTH(таблДанни[[#This Row],[ДАТА]])=12,13,MONTH(таблДанни[[#This Row],[ДАТА]])+1)),\"\")","v":{"v":12455.862068965516,"d":"12,455.86 лв."}},{"$f":"IFERROR(TREND($M$6:INDEX($M:$M,ROW(),1),$I$6:INDEX($I:$I,ROW(),1),IF(таблДанни[[#This Row],[ТРИМЕСЕЧИЕ]]=4,5,таблДанни[[#This Row],[ТРИМЕСЕЧИЕ]]+1)),\"\")","v":{"v":47400,"d":"47,400.00 лв."}},{"$f":"IFERROR(TREND($N$6:INDEX($N:$N,ROW(),1),$J$6:INDEX($J:$J,ROW(),1),таблДанни[[#This Row],[ГОДИНА]] +1),\"\")","v":{"v":143800,"d":"143,800.00 лв."}}]
{"$rows_left_out":10}
{"sheet":"Отчет за продажбите","index":1,"n_rows":29,"n_cols":6,"rows_kept":29}
[]
[null,"МЕСЕЧНО ОТЧЕТ ЗА ПРОДАЖБИТЕ"]
[]
[]
[]
[null,"ГОДИНА","ТРИМЕСЕЧИЕ","МЕСЕЦ","ФИРМА","ОБЩО ПРОДАЖБИ"]
[null,2013,{"v":2,"d":"Тpимeceчие 2"},"2013-04-01","A. Datum Corporation",{"v":6400,"d":"6,400.00 лв."}]
[{"$nulls":4},"Contoso Pharmaceuticals",{"v":8200,"d":"8,200.00 лв."}]
[{"$nulls":3},"2013-05-01","Consolidated Messenger",{"v":4400,"d":"4,400.00 лв."}]
[{"$nulls":4},"Proseware, Inc.",{"v":5400,"d":"5,400.00 лв."}]
[{"$nulls":4},"School of Fine Art",{"v":5800,"d":"5,800.00 лв."}]
[{"$nulls":4},"Trey Research",{"v":6200,"d":"6,200.00 лв."}]
[{"$nulls":3},"2013-06-01","A. Datum Corporation",{"v":6900,"d":"6,900.00 лв."}]
[{"$nulls":4},"Contoso Pharmaceuticals",{"v":7500,"d":"7,500.00 лв."}]
[null,null,"Тpимeceчие 2 Общо",null,null,{"v":50800,"d":"50,800.00 лв."}]
{"$rows_left_out":15}
{"sheet":"Прогноза за продажбите","index":2,"n_rows":43,"n_cols":10,"rows_kept":43}
[]
[null,"МЕСЕЧНО ПРОГНОЗА ЗА ПРОДАЖБИТЕ"]
[null,{"$f":"\"ДНЕШНА ДАТА: \"&UPPER(TEXT(TODAY(),\"d mmm yyyy\"))","v":"ДНЕШНА ДАТА: 19 НОЕ 2012"},null,{"$f":"--TRIM(RIGHT(B3,LEN(B3)-FIND(\":\",B3)))","v":"2012-11-19"}]
[]
[null,"ТОЗИ МЕСЕЦ","РЕАЛНИ","ПЛАН","РАЗЛИКА","%","ГОД. РЕАЛНИ","ГОД. ПЛАН","ГОД. РАЗЛИКА","ГОД. %"]
[null,"Количество",{"$f":"COUNTIF('Въвеждане на данни'!$B$6:$B$24,\">=\"&DATE(ф_Година,MONTH(ф_Дата),1))-COUNTIF('Въвеждане на данни'!$B$6:$B$24,\">\"&EOMONTH(ф_Дата,0))","v":0},{"$nulls":3},{"$f":"COUNTIF(таблДанни[ДАТА],\"<=\"&EOMONTH(ф_Дата,0))","v":0}]
[null,"Продажби",{"$f":"SUMIF(таблДанни[ДАТА],\">=\"&DATE(ф_Година,MONTH(ф_Дата),1),таблДанни[СУМА])-SUMIF(таблДанни[ДАТА],\">\"&EOMONTH(ф_Дата,0),таблДанни[СУМА])","v":{"v":0,"d":"0.00 лв."}},{"$f":"SUMIF('Въвеждане на данни'!$B$6:$B$24,\">=\"&DATE(ф_Година,MONTH(ф_Дата),1),'Въвеждане на данни'!$E$6:$E$24)-SUMIF('Въвеждане на данни'!$B$6:$B$24,\">\"&EOMONTH(ф_Дата,0),'Въвеждане на данни'!$E$6:$E$24)","v":{"v":0,"d":"0.00 лв."}},{"$f":"D7-C7","v":{"v":0,"d":"0.00 лв."}},{"$f":"IFERROR(D7/C7,\"-\")","v":"-"},{"$f":"SUMIF(таблДанни[ДАТА],\"<=\"&EOMONTH(ф_Дата,0),таблДанни[СУМА])","v":{"v":0,"d":"0.00 лв."}},{"$f":"SUMIF(таблДанни[ДАТА],\"<=\"&EOMONTH(ф_Дата,0),таблДанни[ПЛАНИРАНО])","v":{"v":0,"d":"0.00 лв."}},{"$f":"H7-G7","v":{"v":0,"d":"0.00 лв."}},{"$f":"IFERROR(H7/G7,\"\")","v":""}]
[null,"Приходи",{"$f":"(SUMIF(таблДанни[ДАТА],\">=\"&DATE(ф_Година,MONTH(ф_Дата),1),таблДанни[СУМА])-SUMIF(таблДанни[ДАТА],\">\"&EOMONTH(ф_Дата,0),таблДанни[СУМА]))-(SUMIF(таблДанни[ДАТА],\">=\"&DATE(ф_Година,MONTH(ф_Дата),1),таблДанни[РАЗХОДИ])-SUMIF(таблДанни[ДАТА],\">\"&EOMONTH(ф_Дата,0),таблДанни[РАЗХОДИ]))","v":{"v":0,"d":"0.00 лв."}},{"$f":"(SUMIF('Въвеждане на данни'!$B$6:$B$24,\">=\"&DATE(ф_Година,MONTH(ф_Дата),1),'Въвеждане на данни'!$E$6:$E$24)-SUMIF('Въвеждане на данни'!$B$6:$B$24,\">\"&EOMONTH(ф_Дата,0),'Въвеждане на данни'!$E$6:$E$24))-(SUMIF('Въвеждане на данни'!$B$6:$B$24,\">=\"&DATE(ф_Година,MONTH(ф_Дата),1),'Въвеждане на данни'!$F$6:$F$24)-SUMIF('Въвеждане на данни'!$B$6:$B$24,\">\"&EOMONTH(ф_Дата,0),'Въвеждане на данни'!$F$6:$F$24))","v":{"v":0,"d":"0.00 лв."}},{"$f":"D8-C8","v":{"v":0,"d":"0.00 лв."}},{"$f":"IFERROR(D8/C8,\"-\")","v":"-"},{"$f":"SUMIF('Въвеждане на данни'!$B$6:$B$24,\"<=\"&EOMONTH(ф_Дата,0),'Въвеждане на данни'!$F$6:$F$24)","v":{"v":0,"d":"0.00 лв."}},{"$f":"SUMIF(таблДанни[ДАТА],\"<=\"&EOMONTH(ф_Дата,0),таблДанни[РАЗХОДИ])","v":{"v":0,"d":"0.00 лв."}},{"$f":"H8-G8","v":{"v":0,"d":"0.00 лв."}},{"$f":"IFERROR(H8/G8,\"\")","v":""}]
[null,"Марж",{"$f":"IFERROR(C8/C7,\"-\")","v":"-"},{"$f":"IFERROR(D8/D7,\"-\")","v":"-"},null,{"$f":"IFERROR(F8/F7,\"-\")","v":"-"},{"$f":"IFERROR(G8/G7,\"\")","v":""},{"$f":"IFERROR(H8/H7,\"\")","v":""},null,{"$f":"IFERROR(J8/J7,\"\")","v":""}]
[null,"Брой поръчки",{"$f":"COUNTIF(таблДанни[ДАТА],\">=\"&DATE(ф_Година,MONTH(ф_Дата),1))-COUNTIF(таблДанни[ДАТА],\">\"&EOMONTH(ф_Дата,0))","v":0},{"$nulls":3},{"$f":"COUNTIF(таблДанни[ДАТА],\">\"&EOMONTH(ф_Дата,0))","v":19}]
[null,"Средна стойност на поръчка",{"$f":"IFERROR(C7/C10,\"-\")","v":"-"},{"$nulls":3},{"$f":"IFERROR(G7/G10,\"-\")","v":{"v":0,"d":"0.00 лв."}}]
[]
[null,"ПРОГНОЗА",null,"СЛЕДВАЩ МЕСЕЦ",null,"СЛЕДВАЩО ТРИМЕСЕЧИЕ",null,null,"СЛЕДВАЩА ГОДИНА"]
[null,"Продажби",null,{"$f":"TREND(таблДанни[[МЕСЕЦ ]],таблДанни[МЕСЕЦ НОМЕР (СКРИЙ)],IF(MONTH(ф_Дата)=12,13,MONTH(ф_Дата)+1))","v":{"v":20153.510998307953,"d":"20,153.51 лв."}},null,{"$f":"TREND(таблДанни[[ТРИМЕСЕЧИЕ ]],таблДанни[МЕСЕЦ НОМЕР (СКРИЙ)],IF(MONTH(ф_Дата)=12,13,MONTH(ф_Дата)+1))","v":{"v":44115.905245346876,"d":"44,115.91 лв."}},null,null,{"$f":"TREND(таблДанни[[ГОДИШНО ]],таблДанни[МЕСЕЦ НОМЕР (СКРИЙ)],IF(MONTH(ф_Дата)=12,13,MONTH(ф_Дата)+1))","v":{"v":143800,"d":"143,800.00 лв."}}]
[]
{"$rows_left_out":10}